Build #7,644

Build result summary

Details

Completed
Duration
9 minutes
Labels
None
Agent
bamboo-23.af.pivotal.io
Revisions
Spring Framework
a3c7ae2c58dc932be4f576ebbad007442aff2cff a3c7ae2c58dc932be4f576ebbad007442aff2cff
Plan Repository
a3c7ae2c58dc932be4f576ebbad007442aff2cff a3c7ae2c58dc932be4f576ebbad007442aff2cff
Total tests
18136
Failing since
#7643 (Changes by Sam Brannen)
Fixed in
#7645 (Changes by Sam Brannen)

Tests

Responsible

Code commits

Spring Framework
Author Commit Message Commit date
Sam Brannen Sam Brannen a3c7ae2c58dc932be4f576ebbad007442aff2cff a3c7ae2c58dc932be4f576ebbad007442aff2cff Polish contribution
See gh-23300
stsypanov <sergei.tsypanov@yandex.ru> stsypanov <sergei.tsypanov@yandex.ru> 1d6e44ab04cc007e34c09191cd77517795cbd8ca 1d6e44ab04cc007e34c09191cd77517795cbd8ca Use StringJoiner where possible to simplify String joining
Closes gh-23300
Plan Repository
Author Commit Message Commit date
Sam Brannen Sam Brannen a3c7ae2c58dc932be4f576ebbad007442aff2cff a3c7ae2c58dc932be4f576ebbad007442aff2cff Polish contribution
See gh-23300
stsypanov <sergei.tsypanov@yandex.ru> stsypanov <sergei.tsypanov@yandex.ru> 1d6e44ab04cc007e34c09191cd77517795cbd8ca 1d6e44ab04cc007e34c09191cd77517795cbd8ca Use StringJoiner where possible to simplify String joining
Closes gh-23300

Tests

New test failures 1
Status Test View job Duration
Collapse Failed WebSocketIntegrationTests echo[client[org.springframework.web.reactive.socket.client.ReactorNettyWebSocketClient@19448fac] - server [org.springframework.http.server.reactive.bootstrap.TomcatHttpServer@6ed15b3a]] History
Default Job 5 secs
java.lang.IllegalStateException: java.lang.IllegalStateException: Timeout on blocking read for 5000 MILLISECONDS
java.lang.IllegalStateException: Timeout on blocking read for 5000 MILLISECONDS
	at reactor.core.publisher.BlockingSingleSubscriber.blockingGet(BlockingSingleSubscriber.java:117)
	at reactor.core.publisher.Mono.block(Mono.java:1520)
	at org.springframework.web.reactive.socket.WebSocketIntegrationTests.echo(WebSocketIntegrationTests.java:71)
	at sun.reflect.NativeMethodAccessorImpl.invoke0(Native Method)
	at sun.reflect.NativeMethodAccessorImpl.invoke(NativeMethodAccessorImpl.java:62)
	at sun.reflect.DelegatingMethodAccessorImpl.invoke(DelegatingMethodAccessorImpl.java:43)
(76 more lines...)