Build #7,670

Build: #7670 failed Changes by Juergen Hoeller

Build result summary

Details

Completed
Duration
6 minutes
Labels
None
Agent
bamboo-22.af.pivotal.io
Revisions
Spring Framework
22e87ac14355db55abb1126e42be0ec5176e182f 22e87ac14355db55abb1126e42be0ec5176e182f
Plan Repository
22e87ac14355db55abb1126e42be0ec5176e182f 22e87ac14355db55abb1126e42be0ec5176e182f
Total tests
13772
Fixed in
#7673 (Changes by Arjen Poutsma)

Tests

Responsible

Code commits

Spring Framework
Author Commit Message Commit date
Juergen Hoeller Juergen Hoeller 22e87ac14355db55abb1126e42be0ec5176e182f 22e87ac14355db55abb1126e42be0ec5176e182f Polishing
Juergen Hoeller Juergen Hoeller cc57506474b0977c74d1ccbd5c780e98010e1ce7 cc57506474b0977c74d1ccbd5c780e98010e1ce7 Add status code 425 ("Too Early") to HttpStatus enum
Closes gh-23384
Plan Repository
Author Commit Message Commit date
Juergen Hoeller Juergen Hoeller 22e87ac14355db55abb1126e42be0ec5176e182f 22e87ac14355db55abb1126e42be0ec5176e182f Polishing
Juergen Hoeller Juergen Hoeller cc57506474b0977c74d1ccbd5c780e98010e1ce7 cc57506474b0977c74d1ccbd5c780e98010e1ce7 Add status code 425 ("Too Early") to HttpStatus enum
Closes gh-23384

Tests

New test failures 1
Status Test View job Duration
Collapse Failed StatusResultMatchersTests testHttpStatusCodeResultMatchers History
Default Job < 1 sec
java.lang.Exception: java.lang.Exception: Failed to obtain ResultMatcher for status 425 TOO_EARLY
java.lang.Exception: Failed to obtain ResultMatcher for status 425 TOO_EARLY
	at org.springframework.test.web.servlet.result.StatusResultMatchersTests.testHttpStatusCodeResultMatchers(StatusResultMatchersTests.java:77)
	at sun.reflect.NativeMethodAccessorImpl.invoke0(Native Method)
	at sun.reflect.NativeMethodAccessorImpl.invoke(NativeMethodAccessorImpl.java:62)
	at sun.reflect.DelegatingMethodAccessorImpl.invoke(DelegatingMethodAccessorImpl.java:43)
	at java.lang.reflect.Method.invoke(Method.java:498)
	at org.junit.runners.model.FrameworkMethod$1.runReflectiveCall(FrameworkMethod.java:59)
(70 more lines...)