Build #7,671

Build: #7671 failed Changes by Rossen Stoyanchev

Build result summary

Details

Completed
Duration
12 minutes
Labels
None
Agent
bamboo-24.af.pivotal.io
Revisions
Spring Framework
5e15bbfbf12ad5a86852c462aaf02f9f40a4dbfe 5e15bbfbf12ad5a86852c462aaf02f9f40a4dbfe
Plan Repository
5e15bbfbf12ad5a86852c462aaf02f9f40a4dbfe 5e15bbfbf12ad5a86852c462aaf02f9f40a4dbfe
Total tests
13780
Failing since
#7670 (Changes by Juergen Hoeller)
Fixed in
#7673 (Changes by Arjen Poutsma)

Responsible

Code commits

Spring Framework
Author Commit Message Commit date
Rossen Stoyanchev Rossen Stoyanchev 5e15bbfbf12ad5a86852c462aaf02f9f40a4dbfe 5e15bbfbf12ad5a86852c462aaf02f9f40a4dbfe Change order of argument for createPayload
Expecting data first and metadata second aligns better with the single
arg variant that accepts data. This is also consistent with the
RSocket API in the create methods of ByteBufPayload and DefaultPayload.
Rossen Stoyanchev Rossen Stoyanchev a1a878127980b5744f08d74d85732256da50b22d a1a878127980b5744f08d74d85732256da50b22d PayloadUtils improvements and tests
Plan Repository
Author Commit Message Commit date
Rossen Stoyanchev Rossen Stoyanchev 5e15bbfbf12ad5a86852c462aaf02f9f40a4dbfe 5e15bbfbf12ad5a86852c462aaf02f9f40a4dbfe Change order of argument for createPayload
Expecting data first and metadata second aligns better with the single
arg variant that accepts data. This is also consistent with the
RSocket API in the create methods of ByteBufPayload and DefaultPayload.
Rossen Stoyanchev Rossen Stoyanchev a1a878127980b5744f08d74d85732256da50b22d a1a878127980b5744f08d74d85732256da50b22d PayloadUtils improvements and tests

Tests

Existing test failures 1
Status Test Failing since View job Duration
java.lang.Exception: java.lang.Exception: Failed to obtain ResultMatcher for status 425 TOO_EARLY
java.lang.Exception: Failed to obtain ResultMatcher for status 425 TOO_EARLY
	at org.springframework.test.web.servlet.result.StatusResultMatchersTests.testHttpStatusCodeResultMatchers(StatusResultMatchersTests.java:77)
	at sun.reflect.NativeMethodAccessorImpl.invoke0(Native Method)
	at sun.reflect.NativeMethodAccessorImpl.invoke(NativeMethodAccessorImpl.java:62)
	at sun.reflect.DelegatingMethodAccessorImpl.invoke(DelegatingMethodAccessorImpl.java:43)
	at java.lang.reflect.Method.invoke(Method.java:498)
	at org.junit.runners.model.FrameworkMethod$1.runReflectiveCall(FrameworkMethod.java:59)
(70 more lines...)