Build #7,672

Build: #7672 failed Changes by Juergen Hoeller

Build result summary

Details

Completed
Duration
10 minutes
Labels
None
Agent
bamboo-20.af.pivotal.io
Revisions
Spring Framework
27aaad5a892f6bec71316d2fec0871eb5c2b8435 27aaad5a892f6bec71316d2fec0871eb5c2b8435
Plan Repository
27aaad5a892f6bec71316d2fec0871eb5c2b8435 27aaad5a892f6bec71316d2fec0871eb5c2b8435
Total tests
18195
Failing since
#7670 (Changes by Juergen Hoeller)
Fixed in
#7673 (Changes by Arjen Poutsma)

Responsible

Code commits

Spring Framework
Author Commit Message Commit date
Juergen Hoeller Juergen Hoeller 27aaad5a892f6bec71316d2fec0871eb5c2b8435 27aaad5a892f6bec71316d2fec0871eb5c2b8435 Add isTooEarly() method to StatusResultMatchers
See gh-23384
Juergen Hoeller Juergen Hoeller 4f3b89e907bf0587507632797dd8cc22db3e7392 4f3b89e907bf0587507632797dd8cc22db3e7392 Adapt MethodParameterTests to AssertJ usage on master
See gh-23352
Juergen Hoeller Juergen Hoeller 8ef557df2f29db040c6129cd25ed95e592fe335b 8ef557df2f29db040c6129cd25ed95e592fe335b Merge branch '5.1.x'
Juergen Hoeller Juergen Hoeller b2c56590dd253b83b8cc2738a597a3927e77c7e7 m b2c56590dd253b83b8cc2738a597a3927e77c7e7 Upgrade to Netty 4.1.38 and Checkstyle 8.23
Juergen Hoeller Juergen Hoeller c4622dbebceba4ff424c097d91d825c600367b9e m c4622dbebceba4ff424c097d91d825c600367b9e Polishing

Tests

New test failures 1
Status Test View job Duration
Collapse Failed WebSocketIntegrationTests echo[client[org.springframework.web.reactive.socket.client.ReactorNettyWebSocketClient@b9412d2] - server [org.springframework.http.server.reactive.bootstrap.TomcatHttpServer@47153050]] History
Default Job 5 secs
java.lang.IllegalStateException: java.lang.IllegalStateException: Timeout on blocking read for 5000 MILLISECONDS
java.lang.IllegalStateException: Timeout on blocking read for 5000 MILLISECONDS
	at reactor.core.publisher.BlockingSingleSubscriber.blockingGet(BlockingSingleSubscriber.java:117)
	at reactor.core.publisher.Mono.block(Mono.java:1538)
	at org.springframework.web.reactive.socket.WebSocketIntegrationTests.echo(WebSocketIntegrationTests.java:71)
	at sun.reflect.NativeMethodAccessorImpl.invoke0(Native Method)
	at sun.reflect.NativeMethodAccessorImpl.invoke(NativeMethodAccessorImpl.java:62)
	at sun.reflect.DelegatingMethodAccessorImpl.invoke(DelegatingMethodAccessorImpl.java:43)
(76 more lines...)
Fixed tests 1
Status Test Failing since View job Duration
Successful StatusResultMatchersTests testHttpStatusCodeResultMatchers History
Failing since build #7670 (Changes by Juergen Hoeller) Default Job < 1 sec