Build #7,708

Build: #7708 failed Changes by Sam Brannen

Build result summary

Details

Completed
Duration
9 minutes
Labels
None
Agent
bamboo-24.af.pivotal.io
Revisions
Spring Framework
50e53343789fe985b09e9be83481005074f716ee 50e53343789fe985b09e9be83481005074f716ee
Plan Repository
50e53343789fe985b09e9be83481005074f716ee 50e53343789fe985b09e9be83481005074f716ee
Total tests
18214
Failing since
#7707 (Changes by Sam Brannen)
Fixed in
#7709 (Changes by Sam Brannen)

Tests

Responsible

Code commits

Spring Framework
Author Commit Message Commit date
Sam Brannen Sam Brannen 50e53343789fe985b09e9be83481005074f716ee 50e53343789fe985b09e9be83481005074f716ee Simplify assertions within MockMvc internals
Plan Repository
Author Commit Message Commit date
Sam Brannen Sam Brannen 50e53343789fe985b09e9be83481005074f716ee 50e53343789fe985b09e9be83481005074f716ee Simplify assertions within MockMvc internals

Tests

New test failures 1
Status Test View job Duration
Collapse Failed WebSocketIntegrationTests echo[client[org.springframework.web.reactive.socket.client.JettyWebSocketClient@4171f72d] - server [org.springframework.http.server.reactive.bootstrap.TomcatHttpServer@736b221d]] History
Default Job 5 secs
java.lang.IllegalStateException: java.lang.IllegalStateException: Timeout on blocking read for 5000 MILLISECONDS
java.lang.IllegalStateException: Timeout on blocking read for 5000 MILLISECONDS
	at reactor.core.publisher.BlockingSingleSubscriber.blockingGet(BlockingSingleSubscriber.java:117)
	at reactor.core.publisher.Mono.block(Mono.java:1538)
	at org.springframework.web.reactive.socket.WebSocketIntegrationTests.echo(WebSocketIntegrationTests.java:71)
	at sun.reflect.NativeMethodAccessorImpl.invoke0(Native Method)
	at sun.reflect.NativeMethodAccessorImpl.invoke(NativeMethodAccessorImpl.java:62)
	at sun.reflect.DelegatingMethodAccessorImpl.invoke(DelegatingMethodAccessorImpl.java:43)
(76 more lines...)