Build #7,804

Build: #7804 failed Changes by Sébastien Deleuze

Build result summary

Details

Completed
Duration
9 minutes
Labels
None
Agent
bamboo-21.af.pivotal.io
Revisions
Spring Framework
d53cbb6de4bd7eb0382f425e6d26ff03e61e0e62 d53cbb6de4bd7eb0382f425e6d26ff03e61e0e62
Plan Repository
d53cbb6de4bd7eb0382f425e6d26ff03e61e0e62 d53cbb6de4bd7eb0382f425e6d26ff03e61e0e62
Total tests
18177
Fixed in
#7805 (Rebuilt by Stéphane Nicoll)

Tests

Responsible

Code commits

Spring Framework
Author Commit Message Commit date
Sébastien Deleuze Sébastien Deleuze d53cbb6de4bd7eb0382f425e6d26ff03e61e0e62 d53cbb6de4bd7eb0382f425e6d26ff03e61e0e62 Upgrade to Kotlin 1.3.50
Closes gh-23536
Sébastien Deleuze Sébastien Deleuze 77da40f006c2eb6b1925d97ef09a94709ca6262e 77da40f006c2eb6b1925d97ef09a94709ca6262e Upgrade to Coroutines 1.3.0
Closes gh-23535
Sébastien Deleuze Sébastien Deleuze 52976246ac3dac44c77a367276ac5326d590d47a 52976246ac3dac44c77a367276ac5326d590d47a Remove bodyWithType extension from WebFlux
Since there is no more clash with the new bodyValue
method name.

Closes gh-23523
Plan Repository
Author Commit Message Commit date
Sébastien Deleuze Sébastien Deleuze d53cbb6de4bd7eb0382f425e6d26ff03e61e0e62 d53cbb6de4bd7eb0382f425e6d26ff03e61e0e62 Upgrade to Kotlin 1.3.50
Closes gh-23536
Sébastien Deleuze Sébastien Deleuze 77da40f006c2eb6b1925d97ef09a94709ca6262e 77da40f006c2eb6b1925d97ef09a94709ca6262e Upgrade to Coroutines 1.3.0
Closes gh-23535

Tests

New test failures 1
Status Test View job Duration
Collapse Failed WebSocketIntegrationTests sessionClosing(WebSocketClient, HttpServer, Class)[13] History
Default Job 5 secs
java.lang.IllegalStateException: java.lang.IllegalStateException: Timeout on blocking read for 5000 MILLISECONDS
java.lang.IllegalStateException: Timeout on blocking read for 5000 MILLISECONDS
	at reactor.core.publisher.BlockingSingleSubscriber.blockingGet(BlockingSingleSubscriber.java:117)
	at reactor.core.publisher.Mono.block(Mono.java:1538)
	at org.springframework.web.reactive.socket.WebSocketIntegrationTests.sessionClosing(WebSocketIntegrationTests.java:144)
	at sun.reflect.NativeMethodAccessorImpl.invoke0(Native Method)
	at sun.reflect.NativeMethodAccessorImpl.invoke(NativeMethodAccessorImpl.java:62)
	at sun.reflect.DelegatingMethodAccessorImpl.invoke(DelegatingMethodAccessorImpl.java:43)
(142 more lines...)