Build #7,807

Build: #7807 failed Changes by Sam Brannen

Build result summary

Details

Completed
Duration
10 minutes
Labels
None
Agent
bamboo-21.af.pivotal.io
Revisions
Spring Framework
5af4d220440fbbe553f2eb2f6e023e280626804d 5af4d220440fbbe553f2eb2f6e023e280626804d
Plan Repository
5af4d220440fbbe553f2eb2f6e023e280626804d 5af4d220440fbbe553f2eb2f6e023e280626804d
Total tests
18177
Fixed in
#7808 (Changes by Sam Brannen)

Tests

Responsible

Code commits

Spring Framework
Author Commit Message Commit date
Sam Brannen Sam Brannen 5af4d220440fbbe553f2eb2f6e023e280626804d 5af4d220440fbbe553f2eb2f6e023e280626804d Upgrade to Gradle 5.6.1
See gh-23479
Plan Repository
Author Commit Message Commit date
Sam Brannen Sam Brannen 5af4d220440fbbe553f2eb2f6e023e280626804d 5af4d220440fbbe553f2eb2f6e023e280626804d Upgrade to Gradle 5.6.1
See gh-23479

Tests

New test failures 1
Status Test View job Duration
Collapse Failed WebSocketIntegrationTests sessionClosing(WebSocketClient, HttpServer, Class)[13] History
Default Job 5 secs
java.lang.IllegalStateException: java.lang.IllegalStateException: Timeout on blocking read for 5000 MILLISECONDS
java.lang.IllegalStateException: Timeout on blocking read for 5000 MILLISECONDS
	at reactor.core.publisher.BlockingSingleSubscriber.blockingGet(BlockingSingleSubscriber.java:117)
	at reactor.core.publisher.Mono.block(Mono.java:1538)
	at org.springframework.web.reactive.socket.WebSocketIntegrationTests.sessionClosing(WebSocketIntegrationTests.java:144)
	at sun.reflect.NativeMethodAccessorImpl.invoke0(Native Method)
	at sun.reflect.NativeMethodAccessorImpl.invoke(NativeMethodAccessorImpl.java:62)
	at sun.reflect.DelegatingMethodAccessorImpl.invoke(DelegatingMethodAccessorImpl.java:43)
(142 more lines...)