Build #7,812

Build result summary

Details

Completed
Duration
11 minutes
Labels
None
Agent
bamboo-21.af.pivotal.io
Revisions
Spring Framework
ed64a10c386060697a6904825f2e2a6f14ff297a ed64a10c386060697a6904825f2e2a6f14ff297a
Plan Repository
ed64a10c386060697a6904825f2e2a6f14ff297a ed64a10c386060697a6904825f2e2a6f14ff297a
Total tests
18178
Fixed in
#7813 (Changes by Rossen Stoyanchev)

Tests

Responsible

No one has taken responsibility for this failure

Code commits

Spring Framework
Author Commit Message Commit date
OLPMO <OLPMO@users.noreply.github.com> OLPMO <OLPMO@users.noreply.github.com> ed64a10c386060697a6904825f2e2a6f14ff297a ed64a10c386060697a6904825f2e2a6f14ff297a Use Collections.addAll where feasible
Closes gh-23478
Plan Repository
Author Commit Message Commit date
OLPMO <OLPMO@users.noreply.github.com> OLPMO <OLPMO@users.noreply.github.com> ed64a10c386060697a6904825f2e2a6f14ff297a ed64a10c386060697a6904825f2e2a6f14ff297a Use Collections.addAll where feasible
Closes gh-23478

Tests

New test failures 1
Status Test View job Duration
Collapse Failed WebSocketIntegrationTests sessionClosing(WebSocketClient, HttpServer, Class)[15] History
Default Job 5 secs
java.lang.IllegalStateException: java.lang.IllegalStateException: Timeout on blocking read for 5000 MILLISECONDS
java.lang.IllegalStateException: Timeout on blocking read for 5000 MILLISECONDS
	at reactor.core.publisher.BlockingSingleSubscriber.blockingGet(BlockingSingleSubscriber.java:117)
	at reactor.core.publisher.Mono.block(Mono.java:1538)
	at org.springframework.web.reactive.socket.WebSocketIntegrationTests.sessionClosing(WebSocketIntegrationTests.java:144)
	at sun.reflect.NativeMethodAccessorImpl.invoke0(Native Method)
	at sun.reflect.NativeMethodAccessorImpl.invoke(NativeMethodAccessorImpl.java:62)
	at sun.reflect.DelegatingMethodAccessorImpl.invoke(DelegatingMethodAccessorImpl.java:43)
(142 more lines...)