Build #7,826

Build: #7826 failed Changes by Sam Brannen

Build result summary

Details

Completed
Duration
10 minutes
Labels
None
Agent
bamboo-21.af.pivotal.io
Revisions
Spring Framework
f05f993cc62651fff5dd3274dce081e3ba09b710 f05f993cc62651fff5dd3274dce081e3ba09b710
Plan Repository
f05f993cc62651fff5dd3274dce081e3ba09b710 f05f993cc62651fff5dd3274dce081e3ba09b710
Total tests
18193
Fixed in
#7828 (Changes by Rossen Stoyanchev)

Tests

Responsible

Code commits

Spring Framework
Author Commit Message Commit date
Sam Brannen Sam Brannen f05f993cc62651fff5dd3274dce081e3ba09b710 f05f993cc62651fff5dd3274dce081e3ba09b710 Fix formatting in Testing chapter in Reference Manual
Plan Repository
Author Commit Message Commit date
Sam Brannen Sam Brannen f05f993cc62651fff5dd3274dce081e3ba09b710 f05f993cc62651fff5dd3274dce081e3ba09b710 Fix formatting in Testing chapter in Reference Manual

Tests

New test failures 1
Status Test View job Duration
Collapse Failed WebSocketIntegrationTests echo(WebSocketClient, HttpServer, Class)[9] History
Default Job 5 secs
java.lang.IllegalStateException: java.lang.IllegalStateException: Timeout on blocking read for 5000 MILLISECONDS
java.lang.IllegalStateException: Timeout on blocking read for 5000 MILLISECONDS
	at reactor.core.publisher.BlockingSingleSubscriber.blockingGet(BlockingSingleSubscriber.java:117)
	at reactor.core.publisher.Mono.block(Mono.java:1538)
	at org.springframework.web.reactive.socket.WebSocketIntegrationTests.echo(WebSocketIntegrationTests.java:75)
	at sun.reflect.NativeMethodAccessorImpl.invoke0(Native Method)
	at sun.reflect.NativeMethodAccessorImpl.invoke(NativeMethodAccessorImpl.java:62)
	at sun.reflect.DelegatingMethodAccessorImpl.invoke(DelegatingMethodAccessorImpl.java:43)
(142 more lines...)