Build #7,827

Build: #7827 failed Changes by 康智冬 <worldkzd@gmail.com>

Build result summary

Details

Completed
Duration
9 minutes
Labels
None
Agent
bamboo-24.af.pivotal.io
Revisions
Spring Framework
a6f4862f13f96026bad09d4f40de933035043433 a6f4862f13f96026bad09d4f40de933035043433
Plan Repository
a6f4862f13f96026bad09d4f40de933035043433 a6f4862f13f96026bad09d4f40de933035043433
Total tests
18193
Failing since
#7826 (Changes by Sam Brannen)
Fixed in
#7828 (Changes by Rossen Stoyanchev)

Responsible

Code commits

Spring Framework
Author Commit Message Commit date
康智冬 <worldkzd@gmail.com> 康智冬 <worldkzd@gmail.com> a6f4862f13f96026bad09d4f40de933035043433 a6f4862f13f96026bad09d4f40de933035043433 Fix typos related to indefinite articles
Closes gh-23555
Plan Repository
Author Commit Message Commit date
康智冬 <worldkzd@gmail.com> 康智冬 <worldkzd@gmail.com> a6f4862f13f96026bad09d4f40de933035043433 a6f4862f13f96026bad09d4f40de933035043433 Fix typos related to indefinite articles
Closes gh-23555

Tests

Existing test failures 1
Status Test Failing since View job Duration
java.lang.IllegalStateException: java.lang.IllegalStateException: Timeout on blocking read for 5000 MILLISECONDS
java.lang.IllegalStateException: Timeout on blocking read for 5000 MILLISECONDS
	at reactor.core.publisher.BlockingSingleSubscriber.blockingGet(BlockingSingleSubscriber.java:117)
	at reactor.core.publisher.Mono.block(Mono.java:1538)
	at org.springframework.web.reactive.socket.WebSocketIntegrationTests.echo(WebSocketIntegrationTests.java:75)
	at sun.reflect.NativeMethodAccessorImpl.invoke0(Native Method)
	at sun.reflect.NativeMethodAccessorImpl.invoke(NativeMethodAccessorImpl.java:62)
	at sun.reflect.DelegatingMethodAccessorImpl.invoke(DelegatingMethodAccessorImpl.java:43)
(142 more lines...)