Build #7,834

Build: #7834 failed Changes by Sébastien Deleuze

Build result summary

Details

Completed
Duration
9 minutes
Labels
None
Agent
bamboo-23.af.pivotal.io
Revisions
Spring Framework
c13941821a0aa5cacab68c4ab15f6c0dc19c9095 c13941821a0aa5cacab68c4ab15f6c0dc19c9095
Plan Repository
c13941821a0aa5cacab68c4ab15f6c0dc19c9095 c13941821a0aa5cacab68c4ab15f6c0dc19c9095
Total tests
18193
Fixed in
#7836 (Changes by Brian Clozel)

Tests

Responsible

Code commits

Spring Framework
Author Commit Message Commit date
Sébastien Deleuze Sébastien Deleuze c13941821a0aa5cacab68c4ab15f6c0dc19c9095 c13941821a0aa5cacab68c4ab15f6c0dc19c9095 Treat Kotlin warnings as errors
Closes gh-23566
Sébastien Deleuze Sébastien Deleuze a2e740c896d3d9b834126e47c7ce4a9ff920f8b7 a2e740c896d3d9b834126e47c7ce4a9ff920f8b7 Polishing
Plan Repository
Author Commit Message Commit date
Sébastien Deleuze Sébastien Deleuze c13941821a0aa5cacab68c4ab15f6c0dc19c9095 c13941821a0aa5cacab68c4ab15f6c0dc19c9095 Treat Kotlin warnings as errors
Closes gh-23566
Sébastien Deleuze Sébastien Deleuze a2e740c896d3d9b834126e47c7ce4a9ff920f8b7 a2e740c896d3d9b834126e47c7ce4a9ff920f8b7 Polishing

Tests

New test failures 1
Status Test View job Duration
Collapse Failed WebSocketIntegrationTests echo(WebSocketClient, HttpServer, Class)[5] History
Default Job 5 secs
java.lang.IllegalStateException: java.lang.IllegalStateException: Timeout on blocking read for 5000 MILLISECONDS
java.lang.IllegalStateException: Timeout on blocking read for 5000 MILLISECONDS
	at reactor.core.publisher.BlockingSingleSubscriber.blockingGet(BlockingSingleSubscriber.java:117)
	at reactor.core.publisher.Mono.block(Mono.java:1538)
	at org.springframework.web.reactive.socket.WebSocketIntegrationTests.echo(WebSocketIntegrationTests.java:75)
	at sun.reflect.NativeMethodAccessorImpl.invoke0(Native Method)
	at sun.reflect.NativeMethodAccessorImpl.invoke(NativeMethodAccessorImpl.java:62)
	at sun.reflect.DelegatingMethodAccessorImpl.invoke(DelegatingMethodAccessorImpl.java:43)
(142 more lines...)