Build #7,835

Build: #7835 failed Changes by Brian Clozel

Build result summary

Details

Completed
Duration
11 minutes
Labels
None
Agent
bamboo-22.af.pivotal.io
Revisions
Spring Framework
d4089747b8e1f4d79497916286c581b8eb69d67f d4089747b8e1f4d79497916286c581b8eb69d67f
Plan Repository
d4089747b8e1f4d79497916286c581b8eb69d67f d4089747b8e1f4d79497916286c581b8eb69d67f
Total tests
20672
Failing since
#7834 (Changes by Sébastien Deleuze)
Fixed in
#7836 (Changes by Brian Clozel)
No failed tests found, a possible compilation error occurred.

Tests

Responsible

Code commits

Spring Framework
Author Commit Message Commit date
Brian Clozel Brian Clozel d4089747b8e1f4d79497916286c581b8eb69d67f d4089747b8e1f4d79497916286c581b8eb69d67f Use dependency management in Framework build
Prior to this commit, the Spring Framework build would partially use the
dependency management plugin to import and enforce BOMs.

This commit applies the dependency management plugin to all Java
projects and regroups all version management declaration in the root
`build.gradle` file (versions and exclusions).

Some versions are overridden in specific modules for
backwards-compatibility reasons or extended support.

This commit also adds the Gradle versions plugin that checks for
dependency upgrades in artifact repositories and produces a report; you
can use the following:

    ./gradlew dependencyUpdates
Plan Repository
Author Commit Message Commit date
Brian Clozel Brian Clozel d4089747b8e1f4d79497916286c581b8eb69d67f d4089747b8e1f4d79497916286c581b8eb69d67f Use dependency management in Framework build
Prior to this commit, the Spring Framework build would partially use the
dependency management plugin to import and enforce BOMs.

This commit applies the dependency management plugin to all Java
projects and regroups all version management declaration in the root
`build.gradle` file (versions and exclusions).

Some versions are overridden in specific modules for
backwards-compatibility reasons or extended support.

This commit also adds the Gradle versions plugin that checks for
dependency upgrades in artifact repositories and produces a report; you
can use the following:

    ./gradlew dependencyUpdates

Tests

Fixed tests 1
Status Test Failing since View job Duration
Successful WebSocketIntegrationTests echo(WebSocketClient, HttpServer, Class)[5] History
Failing since build #7834 (Changes by Sébastien Deleuze) Default Job < 1 sec

Error summary for Default Job

The job generated some errors, drill down into the full build log for more details.

Note: Some input files use or override a deprecated API.
Note: Recompile with -Xlint:deprecation for details.
Note: Some input files use unchecked or unsafe operations.
Note: Recompile with -Xlint:unchecked for details.
Note: Some input files use or override a deprecated API.
Note: Recompile with -Xlint:deprecation for details.
Note: Some input files use unchecked or unsafe operations.
Note: Recompile with -Xlint:unchecked for details.
POM relocation to an other version number is not fully supported in Gradle : xml-apis:xml-apis:2.0.2 relocated to xml-apis:xml-apis:1.0.b2.
javadoc: warning - Multiple sources of package comments found for package "javax.servlet"
javadoc: warning - Multiple sources of package comments found for package "javax.servlet.http"
javadoc: warning - Multiple sources of package comments found for package "javax.servlet.descriptor"
javadoc: warning - Multiple sources of package comments found for package "javax.servlet.annotation"
/opt/users/bamboo/.gradle/caches/modules-2/files-2.1/org.jboss.spec.javax.servlet/jboss-servlet-api_4.0_spec/1.0.0.Final/322892a664ab868bd3ec8561028111f1f928a3f0/jboss-servlet-api_4.0_spec-1.0.0.Final.jar/javax/servlet/ServletResponse.java:132: warning - Tag @link: reference not found: setCharacterEncoding
/opt/users/bamboo/.gradle/caches/modules-2/files-2.1/org.jboss.spec.javax.servlet/jboss-servlet-api_4.0_spec/1.0.0.Final/322892a664ab868bd3ec8561028111f1f928a3f0/jboss-servlet-api_4.0_spec-1.0.0.Final.jar/javax/servlet/ServletResponse.java:132: warning - Tag @link: reference not found: setContentType
/opt/bamboo-home/xml-data/build-dir/SPR-PUB-JOB1/spring-test/src/main/java/org/springframework/test/web/reactive/server/WebTestClient.java:642: warning - Tag @link: reference not found: WebClient.RequestBodySpec#bodyValue(Object) bodyValue
/opt/bamboo-home/xml-data/build-dir/SPR-PUB-JOB1/spring-test/src/main/java/org/springframework/test/web/reactive/server/WebTestClient.java:680: warning - Tag @link: reference not found: WebClient.RequestBodySpec#body(Object, Class)
/opt/bamboo-home/xml-data/build-dir/SPR-PUB-JOB1/spring-test/src/main/java/org/springframework/test/web/reactive/server/WebTestClient.java:693: warning - Tag @link: reference not found: WebClient.RequestBodySpec#body(Object, ParameterizedTypeReference)
/opt/bamboo-home/xml-data/build-dir/SPR-PUB-JOB1/spring-test/src/main/java/org/springframework/test/web/reactive/server/WebTestClient.java:704: warning - Tag @link: reference not found: WebClient.RequestBodySpec#body(BodyInserter)

FAILURE: Build failed with an exception.

* What went wrong:
Execution failed for task ':dokka'.
> Could not resolve all files for configuration ':compileClasspath'.
   > Could not find com.google.code.findbugs:jsr305:.
     Required by:
         project :

* Try:
Run with --info or --debug option to get more log output. Run with --scan to get full insights.

* Exception is:
org.gradle.api.tasks.TaskExecutionException: Execution failed for task ':dokka'.
        at org.gradle.api.internal.tasks.execution.CatchExceptionTaskExecuter.execute(CatchExceptionTaskExecuter.java:38)
        at org.gradle.api.internal.tasks.execution.EventFiringTaskExecuter$1.executeTask(EventFiringTaskExecuter.java:77)
        at org.gradle.api.internal.tasks.execution.EventFiringTaskExecuter$1.call(EventFiringTaskExecuter.java:55)
        at org.gradle.api.internal.tasks.execution.EventFiringTaskExecuter$1.call(EventFiringTaskExecuter.java:52)
        at org.gradle.internal.operations.DefaultBuildOperationExecutor$CallableBuildOperationWorker.execute(DefaultBuildOperationExecutor.java:416)
        at org.gradle.internal.operations.DefaultBuildOperationExecutor$CallableBuildOperationWorker.execute(DefaultBuildOperationExecutor.java:406)
        at org.gradle.internal.operations.DefaultBuildOperationExecutor$1.execute(DefaultBuildOperationExecutor.java:165)
        at org.gradle.internal.operations.DefaultBuildOperationExecutor.execute(DefaultBuildOperationExecutor.java:250)
        at org.gradle.internal.operations.DefaultBuildOperationExecutor.execute(DefaultBuildOperationExecutor.java:158)
        at org.gradle.internal.operations.DefaultBuildOperationExecutor.call(DefaultBuildOperationExecutor.java:102)
        at org.gradle.internal.operations.DelegatingBuildOperationExecutor.call(DelegatingBuildOperationExecutor.java:36)
        at org.gradle.api.internal.tasks.execution.EventFiringTaskExecuter.execute(EventFiringTaskExecuter.java:52)
        at org.gradle.execution.plan.LocalTaskNodeExecutor.execute(LocalTaskNodeExecutor.java:43)
        at org.gradle.execution.taskgraph.DefaultTaskExecutionGraph$InvokeNodeExecutorsAction.execute(DefaultTaskExecutionGraph.java:355)
        at org.gradle.execution.taskgraph.DefaultTaskExecutionGraph$InvokeNodeExecutorsAction.execute(DefaultTaskExecutionGraph.java:343)
        at org.gradle.execution.taskgraph.DefaultTaskExecutionGraph$BuildOperationAwareExecutionAction.execute(DefaultTaskExecutionGraph.java:336)
        at org.gradle.execution.taskgraph.DefaultTaskExecutionGraph$BuildOperationAwareExecutionAction.execute(DefaultTaskExecutionGraph.java:322)
        at org.gradle.execution.plan.DefaultPlanExecutor$ExecutorWorker$1.execute(DefaultPlanExecutor.java:134)
        at org.gradle.execution.plan.DefaultPlanExecutor$ExecutorWorker$1.execute(DefaultPlanExecutor.java:129)
        at org.gradle.execution.plan.DefaultPlanExecutor$ExecutorWorker.execute(DefaultPlanExecutor.java:202)
        at org.gradle.execution.plan.DefaultPlanExecutor$ExecutorWorker.executeNextNode(DefaultPlanExecutor.java:193)
        at org.gradle.execution.plan.DefaultPlanExecutor$ExecutorWorker.run(DefaultPlanExecutor.java:129)
        at org.gradle.internal.concurrent.ExecutorPolicy$CatchAndRecordFailures.onExecute(ExecutorPolicy.java:64)
        at org.gradle.internal.concurrent.ManagedExecutorImpl$1.run(ManagedExecutorImpl.java:48)
        at org.gradle.internal.concurrent.ThreadFactoryImpl$ManagedThreadRunnable.run(ThreadFactoryImpl.java:56)
Caused by: org.gradle.api.internal.artifacts.ivyservice.DefaultLenientConfiguration$ArtifactResolveException: Could not resolve all files for configuration ':compileClasspath'.
        at org.gradle.api.internal.artifacts.configurations.DefaultConfiguration.rethrowFailure(DefaultConfiguration.java:1258)
        at org.gradle.api.internal.artifacts.configurations.DefaultConfiguration.access$2200(DefaultConfiguration.java:139)
        at org.gradle.api.internal.artifacts.configurations.DefaultConfiguration$ConfigurationFileCollection.getFiles(DefaultConfiguration.java:1233)
        at org.gradle.api.internal.file.AbstractFileCollection.iterator(AbstractFileCollection.java:75)
        at org.gradle.api.internal.artifacts.configurations.DefaultConfiguration.iterator(DefaultConfiguration.java:486)
        at org.gradle.internal.fingerprint.impl.DefaultFileCollectionSnapshotter$FileCollectionLeafVisitorImpl.visitCollection(DefaultFileCollectionSnapshotter.java:60)
        at org.gradle.api.internal.file.AbstractFileCollection.visitLeafCollections(AbstractFileCollection.java:262)
        at org.gradle.api.internal.file.CompositeFileCollection.visitLeafCollections(CompositeFileCollection.java:205)
        at org.gradle.internal.fingerprint.impl.DefaultFileCollectionSnapshotter.snapshot(DefaultFileCollectionSnapshotter.java:50)
        at org.gradle.internal.fingerprint.impl.AbstractFileCollectionFingerprinter.fingerprint(AbstractFileCollectionFingerprinter.java:46)
        at org.gradle.api.internal.tasks.execution.ExecuteActionsTaskExecuter$TaskExecution.lambda$visitInputFileProperties$0(ExecuteActionsTaskExecuter.java:283)
        at org.gradle.internal.execution.steps.CaptureStateBeforeExecutionStep.lambda$fingerprintInputFiles$3(CaptureStateBeforeExecutionStep.java:154)
        at org.gradle.api.internal.tasks.execution.ExecuteActionsTaskExecuter$TaskExecution.visitInputFileProperties(ExecuteActionsTaskExecuter.java:281)
        at org.gradle.internal.execution.steps.CaptureStateBeforeExecutionStep.fingerprintInputFiles(CaptureStateBeforeExecutionStep.java:150)
        at org.gradle.internal.execution.steps.CaptureStateBeforeExecutionStep.createExecutionState(CaptureStateBeforeExecutionStep.java:114)
        at org.gradle.internal.execution.steps.CaptureStateBeforeExecutionStep.execute(CaptureStateBeforeExecutionStep.java:67)
        at org.gradle.internal.execution.steps.CaptureStateBeforeExecutionStep.execute(CaptureStateBeforeExecutionStep.java:47)
        at org.gradle.internal.execution.impl.DefaultWorkExecutor.execute(DefaultWorkExecutor.java:33)
        at org.gradle.api.internal.tasks.execution.ExecuteActionsTaskExecuter.execute(ExecuteActionsTaskExecuter.java:140)
        at org.gradle.api.internal.tasks.execution.ValidatingTaskExecuter.execute(ValidatingTaskExecuter.java:62)
        at org.gradle.api.internal.tasks.execution.SkipEmptySourceFilesTaskExecuter.execute(SkipEmptySourceFilesTaskExecuter.java:108)
        at org.gradle.api.internal.tasks.execution.ResolveBeforeExecutionOutputsTaskExecuter.execute(ResolveBeforeExecutionOutputsTaskExecuter.java:67)
        at org.gradle.api.internal.tasks.execution.ResolveAfterPreviousExecutionStateTaskExecuter.execute(ResolveAfterPreviousExecutionStateTaskExecuter.java:46)
        at org.gradle.api.internal.tasks.execution.CleanupStaleOutputsExecuter.execute(CleanupStaleOutputsExecuter.java:94)
        at org.gradle.api.internal.tasks.execution.FinalizePropertiesTaskExecuter.execute(FinalizePropertiesTaskExecuter.java:46)
        at org.gradle.api.internal.tasks.execution.ResolveTaskExecutionModeExecuter.execute(ResolveTaskExecutionModeExecuter.java:95)
        at org.gradle.api.internal.tasks.execution.SkipTaskWithNoActionsExecuter.execute(SkipTaskWithNoActionsExecuter.java:57)
        at org.gradle.api.internal.tasks.execution.SkipOnlyIfTaskExecuter.execute(SkipOnlyIfTaskExecuter.java:56)
        at org.gradle.api.internal.tasks.execution.CatchExceptionTaskExecuter.execute(CatchExceptionTaskExecuter.java:36)
        ... 24 more
Caused by: org.gradle.internal.resolve.ModuleVersionNotFoundException: Could not find com.google.code.findbugs:jsr305:.
Required by:
    project :


* Get more help at https://help.gradle.org

BUILD FAILED in 11m 28s