Build #7,841

Build: #7841 failed Changes by Sam Brannen

Build result summary

Details

Completed
Duration
9 minutes
Labels
None
Agent
bamboo-22.af.pivotal.io
Revisions
Spring Framework
23d5c6e3dc1bdee0dd103e617506e4d9589d16bf 23d5c6e3dc1bdee0dd103e617506e4d9589d16bf
Plan Repository
23d5c6e3dc1bdee0dd103e617506e4d9589d16bf 23d5c6e3dc1bdee0dd103e617506e4d9589d16bf
Total tests
15860
Fixed in
#7842 (Manual run by Sam Brannen)
No failed tests found, a possible compilation error occurred.

Tests

Responsible

Code commits

Spring Framework
Author Commit Message Commit date
Sam Brannen Sam Brannen 23d5c6e3dc1bdee0dd103e617506e4d9589d16bf 23d5c6e3dc1bdee0dd103e617506e4d9589d16bf Do not scan for test classes in default test task
Plan Repository
Author Commit Message Commit date
Sam Brannen Sam Brannen 23d5c6e3dc1bdee0dd103e617506e4d9589d16bf 23d5c6e3dc1bdee0dd103e617506e4d9589d16bf Do not scan for test classes in default test task

Error summary for Default Job

The job generated some errors, drill down into the full build log for more details.

        at org.jetbrains.dokka.DokkaGenerator.generate(DokkaGenerator.kt:40)
        at org.jetbrains.dokka.DokkaBootstrapImpl.generate(DokkaBootstrapImpl.kt:79)
        at org.jetbrains.dokka.DelegatedInvocationHandler.invoke(ProxyUtils.kt:41)
        at com.sun.proxy.$Proxy123.generate(Unknown Source)
        at org.jetbrains.dokka.gradle.DokkaTask.generate(main.kt:368)
        at org.gradle.internal.reflect.JavaMethod.invoke(JavaMethod.java:103)
        at org.gradle.api.internal.project.taskfactory.StandardTaskAction.doExecute(StandardTaskAction.java:49)
        at org.gradle.api.internal.project.taskfactory.StandardTaskAction.execute(StandardTaskAction.java:42)
        at org.gradle.api.internal.project.taskfactory.StandardTaskAction.execute(StandardTaskAction.java:28)
        at org.gradle.api.internal.AbstractTask$TaskActionWrapper.execute(AbstractTask.java:717)
        at org.gradle.api.internal.AbstractTask$TaskActionWrapper.execute(AbstractTask.java:684)
        at org.gradle.api.internal.tasks.execution.ExecuteActionsTaskExecuter$5.run(ExecuteActionsTaskExecuter.java:476)
        at org.gradle.internal.operations.DefaultBuildOperationExecutor$RunnableBuildOperationWorker.execute(DefaultBuildOperationExecutor.java:402)
        at org.gradle.internal.operations.DefaultBuildOperationExecutor$RunnableBuildOperationWorker.execute(DefaultBuildOperationExecutor.java:394)
        at org.gradle.internal.operations.DefaultBuildOperationExecutor$1.execute(DefaultBuildOperationExecutor.java:165)
        at org.gradle.internal.operations.DefaultBuildOperationExecutor.execute(DefaultBuildOperationExecutor.java:250)
        at org.gradle.internal.operations.DefaultBuildOperationExecutor.execute(DefaultBuildOperationExecutor.java:158)
        at org.gradle.internal.operations.DefaultBuildOperationExecutor.run(DefaultBuildOperationExecutor.java:92)
        at org.gradle.internal.operations.DelegatingBuildOperationExecutor.run(DelegatingBuildOperationExecutor.java:31)
        at org.gradle.api.internal.tasks.execution.ExecuteActionsTaskExecuter.executeAction(ExecuteActionsTaskExecuter.java:461)
        at org.gradle.api.internal.tasks.execution.ExecuteActionsTaskExecuter.executeActions(ExecuteActionsTaskExecuter.java:444)
        at org.gradle.api.internal.tasks.execution.ExecuteActionsTaskExecuter.access$200(ExecuteActionsTaskExecuter.java:93)
        at org.gradle.api.internal.tasks.execution.ExecuteActionsTaskExecuter$TaskExecution.execute(ExecuteActionsTaskExecuter.java:237)
        at org.gradle.internal.execution.steps.ExecuteStep.lambda$execute$1(ExecuteStep.java:33)
        at org.gradle.internal.execution.steps.ExecuteStep.execute(ExecuteStep.java:33)
        at org.gradle.internal.execution.steps.ExecuteStep.execute(ExecuteStep.java:26)
        at org.gradle.internal.execution.steps.CleanupOutputsStep.execute(CleanupOutputsStep.java:58)
        at org.gradle.internal.execution.steps.CleanupOutputsStep.execute(CleanupOutputsStep.java:35)
        at org.gradle.internal.execution.steps.ResolveInputChangesStep.execute(ResolveInputChangesStep.java:48)
        at org.gradle.internal.execution.steps.ResolveInputChangesStep.execute(ResolveInputChangesStep.java:33)
        at org.gradle.internal.execution.steps.CancelExecutionStep.execute(CancelExecutionStep.java:39)
        at org.gradle.internal.execution.steps.TimeoutStep.executeWithoutTimeout(TimeoutStep.java:73)
        at org.gradle.internal.execution.steps.TimeoutStep.execute(TimeoutStep.java:54)
        at org.gradle.internal.execution.steps.CatchExceptionStep.execute(CatchExceptionStep.java:35)
        at org.gradle.internal.execution.steps.CreateOutputsStep.execute(CreateOutputsStep.java:51)
        at org.gradle.internal.execution.steps.SnapshotOutputsStep.execute(SnapshotOutputsStep.java:45)
        at org.gradle.internal.execution.steps.SnapshotOutputsStep.execute(SnapshotOutputsStep.java:31)
        at org.gradle.internal.execution.steps.CacheStep.executeWithoutCache(CacheStep.java:208)
        at org.gradle.internal.execution.steps.CacheStep.execute(CacheStep.java:70)
        at org.gradle.internal.execution.steps.CacheStep.execute(CacheStep.java:45)
        at org.gradle.internal.execution.steps.BroadcastChangingOutputsStep.execute(BroadcastChangingOutputsStep.java:49)
        at org.gradle.internal.execution.steps.StoreSnapshotsStep.execute(StoreSnapshotsStep.java:43)
        at org.gradle.internal.execution.steps.StoreSnapshotsStep.execute(StoreSnapshotsStep.java:32)
        at org.gradle.internal.execution.steps.RecordOutputsStep.execute(RecordOutputsStep.java:38)
        at org.gradle.internal.execution.steps.RecordOutputsStep.execute(RecordOutputsStep.java:24)
        at org.gradle.internal.execution.steps.SkipUpToDateStep.executeBecause(SkipUpToDateStep.java:96)
        at org.gradle.internal.execution.steps.SkipUpToDateStep.lambda$execute$0(SkipUpToDateStep.java:89)
        at org.gradle.internal.execution.steps.SkipUpToDateStep.execute(SkipUpToDateStep.java:54)
        at org.gradle.internal.execution.steps.SkipUpToDateStep.execute(SkipUpToDateStep.java:38)
        at org.gradle.internal.execution.steps.ResolveChangesStep.execute(ResolveChangesStep.java:76)
        at org.gradle.internal.execution.steps.ResolveChangesStep.execute(ResolveChangesStep.java:37)
        at org.gradle.internal.execution.steps.legacy.MarkSnapshottingInputsFinishedStep.execute(MarkSnapshottingInputsFinishedStep.java:36)
        at org.gradle.internal.execution.steps.legacy.MarkSnapshottingInputsFinishedStep.execute(MarkSnapshottingInputsFinishedStep.java:26)
        at org.gradle.internal.execution.steps.ResolveCachingStateStep.execute(ResolveCachingStateStep.java:90)
        at org.gradle.internal.execution.steps.ResolveCachingStateStep.execute(ResolveCachingStateStep.java:48)
        at org.gradle.internal.execution.steps.CaptureStateBeforeExecutionStep.execute(CaptureStateBeforeExecutionStep.java:69)
        at org.gradle.internal.execution.steps.CaptureStateBeforeExecutionStep.execute(CaptureStateBeforeExecutionStep.java:47)
        at org.gradle.internal.execution.impl.DefaultWorkExecutor.execute(DefaultWorkExecutor.java:33)
        at org.gradle.api.internal.tasks.execution.ExecuteActionsTaskExecuter.execute(ExecuteActionsTaskExecuter.java:140)
        ... 34 more
Caused by: java.lang.RuntimeException: Exception while loading package-list from ExternalDocumentationLinkImpl(url=https://projectreactor.io/docs/core/release/api/, packageListUrl=https://projectreactor.io/docs/core/release/api/package-list)
        at org.jetbrains.dokka.ExternalDocumentationLinkResolver.<init>(ExternalDocumentationLinkResolver.kt:164)
        at org.jetbrains.dokka.ExternalDocumentationLinkResolver$$FastClassByGuice$$34356095.newInstance(<generated>)
        at com.google.inject.internal.cglib.reflect.$FastConstructor.newInstance(FastConstructor.java:40)
        at com.google.inject.internal.DefaultConstructionProxyFactory$1.newInstance(DefaultConstructionProxyFactory.java:60)
        at com.google.inject.internal.ConstructorInjector.construct(ConstructorInjector.java:85)
        at com.google.inject.internal.ConstructorBindingImpl$Factory.get(ConstructorBindingImpl.java:254)
        at com.google.inject.internal.ProviderToInternalFactoryAdapter$1.call(ProviderToInternalFactoryAdapter.java:46)
        at com.google.inject.internal.InjectorImpl.callInContext(InjectorImpl.java:1031)
        at com.google.inject.internal.ProviderToInternalFactoryAdapter.get(ProviderToInternalFactoryAdapter.java:40)
        at com.google.inject.Scopes$1$1.get(Scopes.java:65)
        at com.google.inject.internal.InternalFactoryToProviderAdapter.get(InternalFactoryToProviderAdapter.java:40)
        at com.google.inject.internal.SingleParameterInjector.inject(SingleParameterInjector.java:38)
        at com.google.inject.internal.SingleParameterInjector.getAll(SingleParameterInjector.java:62)
        at com.google.inject.internal.ConstructorInjector.construct(ConstructorInjector.java:84)
        at com.google.inject.internal.ConstructorBindingImpl$Factory.get(ConstructorBindingImpl.java:254)
        at com.google.inject.internal.SingleParameterInjector.inject(SingleParameterInjector.java:38)
        at com.google.inject.internal.SingleParameterInjector.getAll(SingleParameterInjector.java:62)
        at com.google.inject.internal.ConstructorInjector.construct(ConstructorInjector.java:84)
        at com.google.inject.internal.ConstructorBindingImpl$Factory.get(ConstructorBindingImpl.java:254)
        at com.google.inject.internal.ProviderToInternalFactoryAdapter$1.call(ProviderToInternalFactoryAdapter.java:46)
        at com.google.inject.internal.InjectorImpl.callInContext(InjectorImpl.java:1031)
        at com.google.inject.internal.ProviderToInternalFactoryAdapter.get(ProviderToInternalFactoryAdapter.java:40)
        at com.google.inject.Scopes$1$1.get(Scopes.java:65)
        at com.google.inject.internal.InternalFactoryToProviderAdapter.get(InternalFactoryToProviderAdapter.java:40)
        at com.google.inject.internal.InjectorImpl$4$1.call(InjectorImpl.java:978)
        at com.google.inject.internal.InjectorImpl.callInContext(InjectorImpl.java:1024)
        at com.google.inject.internal.InjectorImpl$4.get(InjectorImpl.java:974)
        ... 96 more
Caused by: java.lang.RuntimeException: Unhandled http code: 404
        at org.jetbrains.dokka.ExternalDocumentationLinkResolver.doOpenConnectionToReadContent(ExternalDocumentationLinkResolver.kt:71)
        at org.jetbrains.dokka.ExternalDocumentationLinkResolver.doOpenConnectionToReadContent$default(ExternalDocumentationLinkResolver.kt:49)
        at org.jetbrains.dokka.ExternalDocumentationLinkResolver.loadPackageList(ExternalDocumentationLinkResolver.kt:118)
        at org.jetbrains.dokka.ExternalDocumentationLinkResolver.<init>(ExternalDocumentationLinkResolver.kt:162)
        ... 122 more


* Get more help at https://help.gradle.org

BUILD FAILED in 8m 39s