Build #7,857

Build: #7857 failed Changes by Rossen Stoyanchev

Build result summary

Details

Completed
Duration
49 seconds
Labels
None
Agent
bamboo-20.af.pivotal.io
Revisions
Spring Framework
c8f430ee9188ad082bf76e5b05877d00bafe1a82 c8f430ee9188ad082bf76e5b05877d00bafe1a82
Plan Repository
c8f430ee9188ad082bf76e5b05877d00bafe1a82 c8f430ee9188ad082bf76e5b05877d00bafe1a82
Failing since
#7853 (Changes by Rossen Stoyanchev)
No failed tests found, a possible compilation error occurred.

Responsible

Code commits

Spring Framework
Author Commit Message Commit date
Rossen Stoyanchev Rossen Stoyanchev c8f430ee9188ad082bf76e5b05877d00bafe1a82 c8f430ee9188ad082bf76e5b05877d00bafe1a82 Change package used to test path matching
The org.reactivestreams has 13 instead of 4 classes in 1.0.3 with the
addition of Java 9 Flow adapters. This commit switches to using a
different package reactor.util.annotation, also with a small number of
classes, for this test.
Plan Repository
Author Commit Message Commit date
Rossen Stoyanchev Rossen Stoyanchev c8f430ee9188ad082bf76e5b05877d00bafe1a82 c8f430ee9188ad082bf76e5b05877d00bafe1a82 Change package used to test path matching
The org.reactivestreams has 13 instead of 4 classes in 1.0.3 with the
addition of Java 9 Flow adapters. This commit switches to using a
different package reactor.util.annotation, also with a small number of
classes, for this test.

Configuration changes

Plan configuration has changed since the last successful build. See the plan audit log for more details.

Error summary for Default Job

The job generated some errors, drill down into the full build log for more details.

Could not find test result reports in the /opt/bamboo-home/xml-data/build-dir/SPR-PUB-JOB1 directory.
        at org.gradle.initialization.DefaultGradleLauncher.executeTasks(DefaultGradleLauncher.java:106)
        at org.gradle.internal.invocation.GradleBuildController$1.execute(GradleBuildController.java:60)
        at org.gradle.internal.invocation.GradleBuildController$1.execute(GradleBuildController.java:57)
        at org.gradle.internal.invocation.GradleBuildController$3.create(GradleBuildController.java:85)
        at org.gradle.internal.invocation.GradleBuildController$3.create(GradleBuildController.java:78)
        at org.gradle.internal.work.DefaultWorkerLeaseService.withLocks(DefaultWorkerLeaseService.java:189)
        at org.gradle.internal.work.StopShieldingWorkerLeaseService.withLocks(StopShieldingWorkerLeaseService.java:40)
        at org.gradle.internal.invocation.GradleBuildController.doBuild(GradleBuildController.java:78)
        at org.gradle.internal.invocation.GradleBuildController.run(GradleBuildController.java:57)
        at org.gradle.tooling.internal.provider.ExecuteBuildActionRunner.run(ExecuteBuildActionRunner.java:31)
        at org.gradle.launcher.exec.ChainingBuildActionRunner.run(ChainingBuildActionRunner.java:35)
        at org.gradle.launcher.exec.BuildOutcomeReportingBuildActionRunner.run(BuildOutcomeReportingBuildActionRunner.java:63)
        at org.gradle.tooling.internal.provider.ValidatingBuildActionRunner.run(ValidatingBuildActionRunner.java:32)
        at org.gradle.launcher.exec.BuildCompletionNotifyingBuildActionRunner.run(BuildCompletionNotifyingBuildActionRunner.java:39)
        at org.gradle.launcher.exec.RunAsBuildOperationBuildActionRunner$3.call(RunAsBuildOperationBuildActionRunner.java:51)
        at org.gradle.launcher.exec.RunAsBuildOperationBuildActionRunner$3.call(RunAsBuildOperationBuildActionRunner.java:45)
        at org.gradle.internal.operations.DefaultBuildOperationExecutor$CallableBuildOperationWorker.execute(DefaultBuildOperationExecutor.java:416)
        at org.gradle.internal.operations.DefaultBuildOperationExecutor$CallableBuildOperationWorker.execute(DefaultBuildOperationExecutor.java:406)
        at org.gradle.internal.operations.DefaultBuildOperationExecutor$1.execute(DefaultBuildOperationExecutor.java:165)
        at org.gradle.internal.operations.DefaultBuildOperationExecutor.execute(DefaultBuildOperationExecutor.java:250)
        at org.gradle.internal.operations.DefaultBuildOperationExecutor.execute(DefaultBuildOperationExecutor.java:158)
        at org.gradle.internal.operations.DefaultBuildOperationExecutor.call(DefaultBuildOperationExecutor.java:102)
        at org.gradle.internal.operations.DelegatingBuildOperationExecutor.call(DelegatingBuildOperationExecutor.java:36)
        at org.gradle.launcher.exec.RunAsBuildOperationBuildActionRunner.run(RunAsBuildOperationBuildActionRunner.java:45)
        at org.gradle.launcher.exec.InProcessBuildActionExecuter$1.transform(InProcessBuildActionExecuter.java:50)
        at org.gradle.launcher.exec.InProcessBuildActionExecuter$1.transform(InProcessBuildActionExecuter.java:47)
        at org.gradle.composite.internal.DefaultRootBuildState.run(DefaultRootBuildState.java:78)
        at org.gradle.launcher.exec.InProcessBuildActionExecuter.execute(InProcessBuildActionExecuter.java:47)
        at org.gradle.launcher.exec.InProcessBuildActionExecuter.execute(InProcessBuildActionExecuter.java:31)
        at org.gradle.launcher.exec.BuildTreeScopeBuildActionExecuter.execute(BuildTreeScopeBuildActionExecuter.java:42)
        at org.gradle.launcher.exec.BuildTreeScopeBuildActionExecuter.execute(BuildTreeScopeBuildActionExecuter.java:28)
        at org.gradle.tooling.internal.provider.ContinuousBuildActionExecuter.execute(ContinuousBuildActionExecuter.java:78)
        at org.gradle.tooling.internal.provider.ContinuousBuildActionExecuter.execute(ContinuousBuildActionExecuter.java:52)
        at org.gradle.tooling.internal.provider.SubscribableBuildActionExecuter.execute(SubscribableBuildActionExecuter.java:59)
        at org.gradle.tooling.internal.provider.SubscribableBuildActionExecuter.execute(SubscribableBuildActionExecuter.java:36)
        at org.gradle.tooling.internal.provider.SessionScopeBuildActionExecuter.execute(SessionScopeBuildActionExecuter.java:68)
        at org.gradle.tooling.internal.provider.SessionScopeBuildActionExecuter.execute(SessionScopeBuildActionExecuter.java:38)
        at org.gradle.tooling.internal.provider.GradleThreadBuildActionExecuter.execute(GradleThreadBuildActionExecuter.java:37)
        at org.gradle.tooling.internal.provider.GradleThreadBuildActionExecuter.execute(GradleThreadBuildActionExecuter.java:26)
        at org.gradle.tooling.internal.provider.ParallelismConfigurationBuildActionExecuter.execute(ParallelismConfigurationBuildActionExecuter.java:43)
        at org.gradle.tooling.internal.provider.ParallelismConfigurationBuildActionExecuter.execute(ParallelismConfigurationBuildActionExecuter.java:29)
        at org.gradle.tooling.internal.provider.StartParamsValidatingActionExecuter.execute(StartParamsValidatingActionExecuter.java:60)
        at org.gradle.tooling.internal.provider.StartParamsValidatingActionExecuter.execute(StartParamsValidatingActionExecuter.java:32)
        at org.gradle.tooling.internal.provider.SessionFailureReportingActionExecuter.execute(SessionFailureReportingActionExecuter.java:55)
        at org.gradle.tooling.internal.provider.SessionFailureReportingActionExecuter.execute(SessionFailureReportingActionExecuter.java:41)
        at org.gradle.tooling.internal.provider.SetupLoggingActionExecuter.execute(SetupLoggingActionExecuter.java:48)
        at org.gradle.tooling.internal.provider.SetupLoggingActionExecuter.execute(SetupLoggingActionExecuter.java:32)
        at org.gradle.launcher.cli.RunBuildAction.run(RunBuildAction.java:56)
        at org.gradle.internal.Actions$RunnableActionAdapter.execute(Actions.java:212)
        at org.gradle.launcher.cli.DefaultCommandLineActionFactory$ParseAndBuildAction.execute(DefaultCommandLineActionFactory.java:404)
        at org.gradle.launcher.cli.DefaultCommandLineActionFactory$ParseAndBuildAction.execute(DefaultCommandLineActionFactory.java:376)
        at org.gradle.launcher.cli.ExceptionReportingAction.execute(ExceptionReportingAction.java:38)
        at org.gradle.launcher.cli.ExceptionReportingAction.execute(ExceptionReportingAction.java:23)
        at org.gradle.launcher.cli.DefaultCommandLineActionFactory$WithLogging.execute(DefaultCommandLineActionFactory.java:369)
        at org.gradle.launcher.Main.doAction(Main.java:35)
        at org.gradle.launcher.bootstrap.EntryPoint.run(EntryPoint.java:45)
        at org.gradle.launcher.bootstrap.ProcessBootstrap.runNoExit(ProcessBootstrap.java:60)
        at org.gradle.launcher.bootstrap.ProcessBootstrap.run(ProcessBootstrap.java:37)
        at org.gradle.launcher.GradleMain.main(GradleMain.java:31)
        at org.gradle.wrapper.BootstrapMainStarter.start(BootstrapMainStarter.java:31)
        at org.gradle.wrapper.WrapperExecutor.execute(WrapperExecutor.java:108)
        at org.gradle.wrapper.GradleWrapperMain.main(GradleWrapperMain.java:63)
Caused by: org.gradle.api.internal.plugins.PluginApplicationException: Failed to apply plugin [id 'com.jfrog.artifactory']
        at org.gradle.api.internal.plugins.DefaultPluginManager.doApply(DefaultPluginManager.java:167)
        at org.gradle.api.internal.plugins.DefaultPluginManager.apply(DefaultPluginManager.java:136)
        at org.gradle.api.internal.plugins.DefaultObjectConfigurationAction.applyType(DefaultObjectConfigurationAction.java:129)
        at org.gradle.api.internal.plugins.DefaultObjectConfigurationAction.access$200(DefaultObjectConfigurationAction.java:38)
        at org.gradle.api.internal.plugins.DefaultObjectConfigurationAction$3.run(DefaultObjectConfigurationAction.java:93)
        at org.gradle.api.internal.plugins.DefaultObjectConfigurationAction.execute(DefaultObjectConfigurationAction.java:152)
        at org.gradle.groovy.scripts.DefaultScript.apply(DefaultScript.java:140)
        at org.gradle.api.Script$apply$1.callCurrent(Unknown Source)
        at publications_9ttkpsqnt0hp0e8peb3q82c3x.run(/opt/bamboo-home/xml-data/build-dir/SPR-PUB-JOB1/gradle/publications.gradle:2)
        at org.gradle.groovy.scripts.internal.DefaultScriptRunnerFactory$ScriptRunnerImpl.run(DefaultScriptRunnerFactory.java:91)
        ... 180 more
Caused by: org.codehaus.groovy.runtime.typehandling.GroovyCastException: Cannot cast object 'org.jfrog.gradle.plugin.artifactory.dsl.ArtifactoryPluginConvention@713e7d9a' with class 'org.jfrog.gradle.plugin.artifactory.dsl.ArtifactoryPluginConvention' to class 'org.jfrog.gradle.plugin.artifactory.dsl.ArtifactoryPluginConvention'
        at org.jfrog.gradle.plugin.artifactory.ArtifactoryPluginBase.getArtifactoryPluginConvention(ArtifactoryPluginBase.groovy:73)
        at org.jfrog.gradle.plugin.artifactory.ArtifactoryPluginBase.apply(ArtifactoryPluginBase.groovy:41)
        at org.jfrog.gradle.plugin.artifactory.ArtifactoryPluginBase.apply(ArtifactoryPluginBase.groovy)
        at org.gradle.api.internal.plugins.ImperativeOnlyPluginTarget.applyImperative(ImperativeOnlyPluginTarget.java:43)
        at org.gradle.api.internal.plugins.RuleBasedPluginTarget.applyImperative(RuleBasedPluginTarget.java:51)
        at org.gradle.api.internal.plugins.DefaultPluginManager.addPlugin(DefaultPluginManager.java:181)
        at org.gradle.api.internal.plugins.DefaultPluginManager.access$300(DefaultPluginManager.java:51)
        at org.gradle.api.internal.plugins.DefaultPluginManager$AddPluginBuildOperation.run(DefaultPluginManager.java:276)
        at org.gradle.internal.operations.DefaultBuildOperationExecutor$RunnableBuildOperationWorker.execute(DefaultBuildOperationExecutor.java:402)
        at org.gradle.internal.operations.DefaultBuildOperationExecutor$RunnableBuildOperationWorker.execute(DefaultBuildOperationExecutor.java:394)
        at org.gradle.internal.operations.DefaultBuildOperationExecutor$1.execute(DefaultBuildOperationExecutor.java:165)
        at org.gradle.internal.operations.DefaultBuildOperationExecutor.execute(DefaultBuildOperationExecutor.java:250)
        at org.gradle.internal.operations.DefaultBuildOperationExecutor.execute(DefaultBuildOperationExecutor.java:158)
        at org.gradle.internal.operations.DefaultBuildOperationExecutor.run(DefaultBuildOperationExecutor.java:92)
        at org.gradle.internal.operations.DelegatingBuildOperationExecutor.run(DelegatingBuildOperationExecutor.java:31)
        at org.gradle.api.internal.plugins.DefaultPluginManager$2.execute(DefaultPluginManager.java:159)
        at org.gradle.api.internal.plugins.DefaultPluginManager$2.execute(DefaultPluginManager.java:156)
        at org.gradle.configuration.internal.DefaultUserCodeApplicationContext.apply(DefaultUserCodeApplicationContext.java:49)
        at org.gradle.api.internal.plugins.DefaultPluginManager.doApply(DefaultPluginManager.java:156)
        ... 189 more


* Get more help at https://help.gradle.org

BUILD FAILED in 25s