Build #7,511

Build: #7511 failed

Job: Default Job failed

Stages & jobs

  1. Default Stage

Build log

The build generated 592 lines of output. Download or view full build log

21-Jun-2019 13:32:54 Build Spring Framework - Publication - Default Job #7511 (SPR-PUB-JOB1-7511) started building on agent bamboo-16.af.pivotal.io
21-Jun-2019 13:32:54 Remote agent on host bamboo-16.af.pivotal.io
21-Jun-2019 13:32:54 Build working directory is /opt/bamboo-home/xml-data/build-dir/SPR-PUB-JOB1
21-Jun-2019 13:32:54 Executing build Spring Framework - Publication - Default Job #7511 (SPR-PUB-JOB1-7511)
21-Jun-2019 13:32:54 Starting task 'Checkout Default Repository' of type 'com.atlassian.bamboo.plugins.vcs:task.vcs.checkout'
21-Jun-2019 13:32:54 Build always requires a clean checkout
21-Jun-2019 13:32:54 Cleaning build directory '/opt/bamboo-home/xml-data/build-dir/SPR-PUB-JOB1'
21-Jun-2019 13:32:54 Checking out into /opt/bamboo-home/xml-data/build-dir/SPR-PUB-JOB1
21-Jun-2019 13:32:54 Updating source code to revision: eaecf0c00679b196d4aed49b1e4a679a270a0834
21-Jun-2019 13:32:54 Creating local git repository in '/opt/bamboo-home/xml-data/build-dir/SPR-PUB-JOB1/.git'.
21-Jun-2019 13:32:54 Initialized empty Git repository in /opt/bamboo-home/xml-data/build-dir/SPR-PUB-JOB1/.git/
21-Jun-2019 13:32:55 Fetching 'refs/heads/master' from 'https://github.com/spring-projects/spring-framework.git'.
21-Jun-2019 13:33:13 From https://github.com/spring-projects/spring-framework
21-Jun-2019 13:33:13 * [new branch]      master     -> master
21-Jun-2019 13:33:13 * [new tag]               v3.1.0.RELEASE -> v3.1.0.RELEASE
21-Jun-2019 13:33:13 * [new tag]               v3.2.0.M1      -> v3.2.0.M1
21-Jun-2019 13:33:13 * [new tag]               v3.2.0.M2      -> v3.2.0.M2
21-Jun-2019 13:33:13 * [new tag]               v3.2.0.RC1     -> v3.2.0.RC1
21-Jun-2019 13:33:13 * [new tag]               v3.2.0.RC2-A   -> v3.2.0.RC2-A
21-Jun-2019 13:33:13 * [new tag]               v3.2.0.RELEASE -> v3.2.0.RELEASE
21-Jun-2019 13:33:13 * [new tag]               v3.2.1.RELEASE -> v3.2.1.RELEASE
21-Jun-2019 13:33:13 * [new tag]               v3.2.2.RELEASE -> v3.2.2.RELEASE
21-Jun-2019 13:33:13 * [new tag]               v4.0.0.M1      -> v4.0.0.M1
21-Jun-2019 13:33:13 * [new tag]               v4.0.0.M2      -> v4.0.0.M2
21-Jun-2019 13:33:13 * [new tag]               v4.0.0.M3      -> v4.0.0.M3
21-Jun-2019 13:33:13 * [new tag]               v4.0.0.RC1     -> v4.0.0.RC1
21-Jun-2019 13:33:13 * [new tag]               v4.0.0.RC2     -> v4.0.0.RC2
21-Jun-2019 13:33:13 Checking out revision eaecf0c00679b196d4aed49b1e4a679a270a0834.
21-Jun-2019 13:33:14 Already on 'master'
21-Jun-2019 13:33:14 Updated source code to revision: eaecf0c00679b196d4aed49b1e4a679a270a0834
21-Jun-2019 13:33:14 Finished task 'Checkout Default Repository' with result: Success
21-Jun-2019 13:33:14 Running pre-build action: Artifactory Release Staging
21-Jun-2019 13:33:14 Running pre-build action: VCS Version Collector
21-Jun-2019 13:33:14
Substituting variable: ${bamboo.spr.jdk.home} with /opt/jdk-8
21-Jun-2019 13:33:14
Substituting variable: ${bamboo.repository.branch.name} with master
21-Jun-2019 13:33:14 Starting task 'Artifactory Gradle' of type 'org.jfrog.bamboo.bamboo-artifactory-plugin:artifactoryGradleTask'
21-Jun-2019 13:33:14 Bamboo Artifactory Plugin version: 2.6.3
21-Jun-2019 13:33:14
Beginning to execute external process for build 'Spring Framework - Publication - Default Job #7511 (SPR-PUB-JOB1-7511)'
... running command line:
./gradlew --refresh-dependencies --no-daemon -PtestGroups=ci -P BRANCH_NAME=master --stacktrace clean check build -I /tmp/artifactory.init.script1596557783075879836gradle -DbuildInfoConfig.propertiesFile=/tmp/buildinfo4743818802350281322properties artifactoryPublish -Dartifactory.resolve.password=******** -Dartifactory.publish.password=********
... in: /opt/bamboo-home/xml-data/build-dir/SPR-PUB-JOB1
... using extra environment variables:
bamboo_planRepository_1_branch=master
bamboo_********_username_password=********
bamboo_signing_store_password=********
bamboo_planRepository_2_branch=master
bamboo_capability_system_builder_ant_Ant_1_9=/opt/ant-1.9
bamboo_repository_137199621_git_repositoryUrl=https://github.com/spring-projects/spring-framework.git
bamboo_capability_system_builder_ant_Ant_1_8=/opt/ant-1.8
bamboo_planRepository_1_branchDisplayName=master
bamboo_artifactory_override_resolve_repo=libs-milestone
bamboo_capability_system_builder_node_Node_js_10_16=/opt/node-10.16/bin/node
bamboo_repository_revision_number=eaecf0c00679b196d4aed49b1e4a679a270a0834
bamboo_repository_262406229_git_repositoryUrl=https://github.com/spring-projects/spring-framework.git
bamboo_artifactory_task_override_jdk=true
bamboo_RIAK_BIN=/usr/sbin/riak
WRAPPER_BITS=32
bamboo_buildKey=SPR-PUB-JOB1
bamboo_repository_137199621_name=Plan Repository
bamboo_spr_jdk_home=/opt/jdk-8
bamboo_bintray_password=********
bamboo_sonar_token_password=********
PWD=/opt/bamboo-home/bin
bamboo_planRepository_2_branchDisplayName=master
bamboo_shortJobName=Default Job
bamboo_artifactory_override_resolver_password=********
bamboo_sonatype_token=RSJChaox
bamboo_capability_system_builder_gradle___gradlew=./gradlew
bamboo_buildResultsUrl=https://build.spring.io/browse/SPR-PUB-JOB1-7511
bamboo_capability_system_builder_mvn3_Maven_3_3=/opt/maven-3.3
bamboo_capability_system_builder_mvn3_Maven_3_2=/opt/maven-3.2
bamboo_capability_system_builder_mvn3_Maven_3_1=/opt/maven-3.1
bamboo_planRepository_repositoryUrl=https://github.com/spring-projects/spring-framework.git
bamboo_capability_system_builder_mvn3_Maven_3_6=/opt/maven-3.6
bamboo_agentId=286195719
bamboo_capability_system_builder_mvn3_Maven_3_5=/opt/maven-3.5
bamboo_capability_system_builder_mvn3_Maven_3_0=/opt/maven-3.0
bamboo_planRepository_revision=eaecf0c00679b196d4aed49b1e4a679a270a0834
bamboo_planRepository_previousRevision=003247dc40dd0a194c69ce51aa64dd1a0dd69657
bamboo_repository_137199621_revision_number=eaecf0c00679b196d4aed49b1e4a679a270a0834
bamboo_capability_remote_build=true
bamboo_repository_branch_name=master
bamboo_sonatype_token_password=********
bamboo_sonatype_user=springsource
SHLVL=1
bamboo_org_jfrog_bamboo_buildInfo_serverUrl=https://repo.spring.io
bamboo_scdf_acceptance_tests_password=********
bamboo_repository_262406229_branch_name=master
WRAPPER_OS=linux
JAVA_HOME=/opt/jdk-8/
TERM=linux
XDG_SESSION_ID=c1
bamboo_planRepository_branch=master
bamboo_org_jfrog_bamboo_release_activated=false
bamboo_planRepository_1_type=gitv2
bamboo_planRepository_branchName=master
bamboo_repository_137199621_git_username=spring-buildmaster
bamboo_capability_system_jdk_JDK_12=/opt/jdk-12
WRAPPER_FILE_SEPARATOR=/
_=/opt/bamboo-home/bin/bamboo-agent.sh
bamboo_repository_262406229_revision_number=eaecf0c00679b196d4aed49b1e4a679a270a0834
bamboo_capability_system_builder_ant_Ant_1_10=/opt/ant-1.10
WRAPPER_PATH_SEPARATOR=:
bamboo_sonar_password=********
bamboo_hg_cache_directory=/opt/bamboo-home/xml-data/build-dir/_hg-repositories-cache
bamboo_planRepository_1_username=spring-buildmaster
bamboo_planRepository_type=gitv2
bamboo_repository_262406229_git_branch=master
bamboo_git_cache_directory=/opt/bamboo-home/xml-data/build-dir/_git-repositories-cache
bamboo_planRepository_2_branchName=master
bamboo_artifactory_username=buildmaster
bamboo_tmp_directory=/opt/bamboo-home/temp
bamboo_planKey=SPR-PUB
bamboo_planRepository_username=spring-buildmaster
bamboo_JDK8_HOME=/opt/jdk-8
bamboo_snifftask=sniff
bamboo_planRepository_1_branchName=master
bamboo_sonar_version=5.6.3
bamboo_sonar_jdbc_password=********
bamboo_bintray_api_key_password=********
GRADLE_OPTS=-Xms128m
bamboo_repository_262406229_git_username=spring-buildmaster
XDG_DATA_DIRS=/usr/local/share:/usr/share:/var/lib/snapd/desktop
bamboo_capability_system_jdk_JDK_1_11=/opt/jdk-11
bamboo_resultsUrl=https://build.spring.io/browse/SPR-PUB-JOB1-7511
bamboo_capability_system_jdk_JDK_1_10=/opt/jdk-10
bamboo_build_working_directory=/opt/bamboo-home/xml-data/build-dir/SPR-PUB-JOB1
bamboo_planRepository_1_name=Spring Framework
bamboo_capability_system_os=ubuntu1804
bamboo_nexusPush_stagingProfile=buildmaster
bamboo_shortPlanName=Publication
MAIL=/var/mail/bamboo
bamboo_planRepository_2_username=spring-buildmaster
bamboo_repository_137199621_branch_name=master
bamboo_planRepository_name=Spring Framework
LOGNAME=bamboo
bamboo_buildNumber=7511
bamboo_repository_137199621_git_branch=master
SHELL=/bin/bash
bamboo_planName=Spring Framework - Publication
bamboo_JDK7_HOME=/opt/jdk-7
bamboo_repository_137199621_previous_revision_number=003247dc40dd0a194c69ce51aa64dd1a0dd69657
bamboo_shortPlanKey=PUB
OLDPWD=/opt/users/bamboo
bamboo_shortJobKey=JOB1
bamboo_artifactory_password=********
bamboo_repository_262406229_name=Spring Framework
bamboo_planRepository_2_name=Plan Repository
bamboo_repository_262406229_previous_revision_number=003247dc40dd0a194c69ce51aa64dd1a0dd69657
bamboo_buildTimeStamp=2019-06-21T13:32:58.286Z
bamboo_repository_previous_revision_number=003247dc40dd0a194c69ce51aa64dd1a0dd69657
bamboo_sonar_username=buildmaster
bamboo_********_password=********
bamboo_repository_git_branch=master
bamboo_buildResultKey=SPR-PUB-JOB1-7511
bamboo_nexusPush_close=true
bamboo_artifactory_override_resolver_username=buildmaster
bamboo_buildPlanName=Spring Framework - Publication - Default Job
bamboo_planRepository_1_revision=eaecf0c00679b196d4aed49b1e4a679a270a0834
bamboo_repository_name=Plan Repository
bamboo_signing_key_password=********
bamboo_planRepository_2_previousRevision=003247dc40dd0a194c69ce51aa64dd1a0dd69657
bamboo_capability_system_builder_groovy_Groovy_2_5=/opt/groovy-2.5
LANG=en_US.UTF-8
bamboo_buildFailed=false
bamboo_capability_system_docker_executable=/usr/bin/docker
DISPLAY=localhost:1.0
bamboo_capability_system_jdk_OpenJDK_7=/opt/jdk-7
bamboo_capability_system_builder_groovy_Groovy_2_4=/opt/groovy-2.4
bamboo_artifactory_override_deployer_username=buildmaster
bamboo_artifactory_password_mask_b=********
bamboo_capability_system_builder_command_Bash=/bin/bash
bamboo_artifactory_password_mask_a=********
bamboo_agentWorkingDirectory=/opt/bamboo-home/xml-data/build-dir
bamboo_planRepository_2_revision=eaecf0c00679b196d4aed49b1e4a679a270a0834
bamboo_capability_system_git_executable=/usr/bin/git
bamboo_repository_git_username=spring-buildmaster
bamboo_planRepository_1_previousRevision=003247dc40dd0a194c69ce51aa64dd1a0dd69657
bamboo_capability_os_family=unix
bamboo_planRepository_branchDisplayName=master
bamboo_capability_system_builder_maven_Artifactory_Maven_3_6=/opt/maven-3.6
bamboo_capability_system_builder_maven_Artifactory_Maven_3_5=/opt/maven-3.5
GIT_SSL_NO_VERIFY=true
bamboo_capability_system_builder_maven_Artifactory_Maven_3_3=/opt/maven-3.3
bamboo_planRepository_2_type=gitv2
bamboo_capability_system_builder_maven_Artifactory_Maven_3_2=/opt/maven-3.2
bamboo_s3_properties=/home/bamboo/tools/s3.properties
bamboo_capability_system_builder_maven_Artifactory_Maven_3_1=/opt/maven-3.1
bamboo_artifactory_override_deploy_repo=libs-snapshot-local
bamboo_capability_system_builder_maven_Artifactory_Maven_3_0=/opt/maven-3.0
bamboo_plan_storageTag=SPR-PUB
bamboo_bintray_username_password=********
bamboo_planRepository_2_repositoryUrl=https://github.com/spring-projects/spring-framework.git
USER=bamboo
bamboo_repository_git_repositoryUrl=https://github.com/spring-projects/spring-framework.git
bamboo_working_directory=/opt/bamboo-home/xml-data/build-dir/SPR-PUB-JOB1
bamboo_org_jfrog_bamboo_buildInfo_activated=true
bamboo_planRepository_1_repositoryUrl=https://github.com/spring-projects/spring-framework.git
bamboo_capability_system_jdk_JDK_1_8=/opt/jdk-8
bamboo_artifactory_override_deployer_password=********
bamboo_capability_system_jdk_JDK_1_9=/opt/jdk-9
WRAPPER_ARCH=x86
bamboo_capability_system_jdk_JDK_1_6=/opt/jdk-6
bamboo_sonatype_password=********
bamboo_capability_system_jdk_JDK_1_7=/opt/jdk-7
bamboo_sonar_ip=10.194.6.9
XDG_RUNTIME_DIR=/run/user/1002
HOME=/home/bamboo
PATH=/bin:/home/bamboo/bin:/usr/local/sbin:/usr/local/bin:/usr/sbin:/usr/bin:/sbin:/bin:/usr/games:/usr/local/games:/snap/bin:/home/bamboo/bin:/usr/local/bin:/bin:/home/bamboo/bin:/usr/local/sbin:/usr/local/bin:/usr/sbin:/usr/bin:/sbin:/bin:/usr/games:/usr/local/games:/snap/bin:/home/bamboo/bin:/usr/local/bin
21-Jun-2019 13:33:17 > Task :buildSrc:compileJava NO-SOURCE
21-Jun-2019 13:33:18 > Task :buildSrc:compileGroovy
21-Jun-2019 13:33:18 > Task :buildSrc:processResources
21-Jun-2019 13:33:18 > Task :buildSrc:classes
21-Jun-2019 13:33:18 > Task :buildSrc:jar
21-Jun-2019 13:33:18 > Task :buildSrc:assemble
21-Jun-2019 13:33:18 > Task :buildSrc:compileTestJava NO-SOURCE
21-Jun-2019 13:33:18 > Task :buildSrc:compileTestGroovy NO-SOURCE
21-Jun-2019 13:33:18 > Task :buildSrc:processTestResources NO-SOURCE
21-Jun-2019 13:33:18 > Task :buildSrc:testClasses UP-TO-DATE
21-Jun-2019 13:33:18 > Task :buildSrc:test NO-SOURCE
21-Jun-2019 13:33:18 > Task :buildSrc:check UP-TO-DATE
21-Jun-2019 13:33:18 > Task :buildSrc:build
21-Jun-2019 13:33:28 Cannot publish pom for project ':' since it does not contain the Maven plugin install task and task ':artifactoryPublish' does not specify a custom pom path.
21-Jun-2019 13:33:28 Cannot publish pom for project ':spring-core-coroutines' since it does not contain the Maven plugin install task and task ':spring-core-coroutines:artifactoryPublish' does not specify a custom pom path.
21-Jun-2019 13:33:29 Cannot publish pom for project ':spring-build-src' since it does not contain the Maven plugin install task and task ':spring-build-src:artifactoryPublish' does not specify a custom pom path.
21-Jun-2019 13:33:32 > Task :clean UP-TO-DATE
21-Jun-2019 13:33:32 > Task :spring-aop:clean UP-TO-DATE
21-Jun-2019 13:33:32 > Task :spring-aspects:clean UP-TO-DATE
21-Jun-2019 13:33:32 > Task :spring-beans:clean UP-TO-DATE
21-Jun-2019 13:33:32 > Task :spring-build-src:clean
21-Jun-2019 13:33:32 > Task :spring-context:clean UP-TO-DATE
21-Jun-2019 13:33:32 > Task :spring-context-indexer:clean UP-TO-DATE
21-Jun-2019 13:33:32 > Task :spring-context-support:clean UP-TO-DATE
21-Jun-2019 13:33:32 > Task :spring-core:clean UP-TO-DATE
21-Jun-2019 13:33:32 > Task :spring-core-coroutines:clean UP-TO-DATE
21-Jun-2019 13:33:32 > Task :spring-expression:clean UP-TO-DATE
21-Jun-2019 13:33:32 > Task :spring-framework-bom:clean UP-TO-DATE
21-Jun-2019 13:33:32 > Task :spring-instrument:clean UP-TO-DATE
21-Jun-2019 13:33:32 > Task :spring-jcl:clean UP-TO-DATE
21-Jun-2019 13:33:32 > Task :spring-jdbc:clean UP-TO-DATE
21-Jun-2019 13:33:32 > Task :spring-jms:clean UP-TO-DATE
21-Jun-2019 13:33:32 > Task :spring-messaging:clean UP-TO-DATE
21-Jun-2019 13:33:32 > Task :spring-orm:clean UP-TO-DATE
21-Jun-2019 13:33:32 > Task :spring-oxm:clean UP-TO-DATE
21-Jun-2019 13:33:32 > Task :spring-test:clean UP-TO-DATE
21-Jun-2019 13:33:32 > Task :spring-tx:clean UP-TO-DATE
21-Jun-2019 13:33:32 > Task :spring-web:clean UP-TO-DATE
21-Jun-2019 13:33:32 > Task :spring-webflux:clean UP-TO-DATE
21-Jun-2019 13:33:32 > Task :spring-webmvc:clean UP-TO-DATE
21-Jun-2019 13:33:32 > Task :spring-websocket:clean UP-TO-DATE
21-Jun-2019 13:33:32 > Task :compileKotlin NO-SOURCE
21-Jun-2019 13:33:32 > Task :compileJava NO-SOURCE
21-Jun-2019 13:33:32 > Task :compileGroovy NO-SOURCE
21-Jun-2019 13:33:32 > Task :processResources NO-SOURCE
21-Jun-2019 13:33:32 > Task :classes UP-TO-DATE
21-Jun-2019 13:33:32 > Task :checkstyleMain NO-SOURCE
21-Jun-2019 13:33:33 > Task :spring-core:cglibRepackJar
21-Jun-2019 13:33:33 > Task :spring-core:objenesisRepackJar
21-Jun-2019 13:33:38 > Task :spring-core-coroutines:compileKotlin
21-Jun-2019 13:33:38 > Task :spring-core-coroutines:compileJava NO-SOURCE
21-Jun-2019 13:33:38 > Task :spring-core-coroutines:processResources NO-SOURCE
21-Jun-2019 13:33:38 > Task :spring-core-coroutines:classes UP-TO-DATE
21-Jun-2019 13:33:38 > Task :spring-core-coroutines:inspectClassesForKotlinIC
21-Jun-2019 13:33:38 > Task :spring-core-coroutines:jar
21-Jun-2019 13:33:38 > Task :spring-jcl:compileKotlin
21-Jun-2019 13:33:38 > Task :spring-jcl:compileJava
21-Jun-2019 13:33:38 > Task :spring-jcl:processResources
21-Jun-2019 13:33:38 > Task :spring-jcl:classes
21-Jun-2019 13:33:38 > Task :spring-jcl:inspectClassesForKotlinIC
21-Jun-2019 13:33:38 > Task :spring-jcl:jar
21-Jun-2019 13:33:41 > Task :spring-core:compileKotlin
21-Jun-2019 13:33:44 > Task :spring-core:compileJava
21-Jun-2019 13:33:44 > Task :spring-core:processResources NO-SOURCE
21-Jun-2019 13:33:44 > Task :spring-core:classes
21-Jun-2019 13:33:44 > Task :spring-core:inspectClassesForKotlinIC
21-Jun-2019 13:33:44 > Task :spring-core:jar
21-Jun-2019 13:33:49 > Task :spring-beans:compileGroovy
21-Jun-2019 13:33:49 > Task :spring-beans:compileKotlin
21-Jun-2019 13:33:49 > Task :spring-beans:compileJava NO-SOURCE
21-Jun-2019 13:33:49 > Task :spring-beans:processResources
21-Jun-2019 13:33:49 > Task :spring-beans:classes
21-Jun-2019 13:33:49 > Task :spring-beans:inspectClassesForKotlinIC
21-Jun-2019 13:33:49 > Task :spring-beans:jar
21-Jun-2019 13:33:49 > Task :spring-aop:compileKotlin
21-Jun-2019 13:33:50 > Task :spring-aop:compileJava
21-Jun-2019 13:33:50 > Task :spring-aop:processResources
21-Jun-2019 13:33:50 > Task :spring-aop:classes
21-Jun-2019 13:33:50 > Task :spring-core-coroutines:compileTestKotlin NO-SOURCE
21-Jun-2019 13:33:50 > Task :spring-core-coroutines:compileTestJava NO-SOURCE
21-Jun-2019 13:33:50 > Task :spring-core-coroutines:processTestResources NO-SOURCE
21-Jun-2019 13:33:50 > Task :spring-core-coroutines:testClasses UP-TO-DATE
21-Jun-2019 13:33:50 > Task :spring-jcl:compileTestKotlin NO-SOURCE
21-Jun-2019 13:33:50 > Task :spring-jcl:compileTestJava NO-SOURCE
21-Jun-2019 13:33:50 > Task :spring-jcl:processTestResources NO-SOURCE
21-Jun-2019 13:33:50 > Task :spring-jcl:testClasses UP-TO-DATE
21-Jun-2019 13:33:53 > Task :spring-core:compileTestKotlin
21-Jun-2019 13:33:59 > Task :spring-core:compileTestJava
21-Jun-2019 13:33:59 > Task :spring-core:processTestResources
21-Jun-2019 13:33:59 > Task :spring-core:testClasses
21-Jun-2019 13:34:01 > Task :spring-beans:compileTestKotlin
21-Jun-2019 13:34:03
21-Jun-2019 13:34:03 > Task :spring-beans:compileTestJava
21-Jun-2019 13:34:03 Note: Some input files use unchecked or unsafe operations.
21-Jun-2019 13:34:03 Note: Recompile with -Xlint:unchecked for details.
21-Jun-2019 13:34:03
21-Jun-2019 13:34:03 > Task :spring-beans:compileTestGroovy NO-SOURCE
21-Jun-2019 13:34:03 > Task :spring-beans:processTestResources
21-Jun-2019 13:34:03 > Task :spring-beans:testClasses
21-Jun-2019 13:34:04 > Task :spring-aop:compileTestKotlin
21-Jun-2019 13:34:04 > Task :spring-aop:inspectClassesForKotlinIC
21-Jun-2019 13:34:04 > Task :spring-aop:jar
21-Jun-2019 13:34:04 > Task :spring-aop:compileTestJava
21-Jun-2019 13:34:04 > Task :spring-aop:processTestResources
21-Jun-2019 13:34:04 > Task :spring-aop:testClasses
21-Jun-2019 13:34:04 > Task :spring-expression:compileKotlin
21-Jun-2019 13:34:05 > Task :spring-expression:compileJava
21-Jun-2019 13:34:05 > Task :spring-expression:processResources
21-Jun-2019 13:34:05 > Task :spring-expression:classes
21-Jun-2019 13:34:05 > Task :spring-expression:inspectClassesForKotlinIC
21-Jun-2019 13:34:05 > Task :spring-expression:jar
21-Jun-2019 13:34:05 > Task :spring-instrument:compileKotlin
21-Jun-2019 13:34:05 > Task :spring-instrument:compileJava
21-Jun-2019 13:34:05 > Task :spring-instrument:processResources NO-SOURCE
21-Jun-2019 13:34:05 > Task :spring-instrument:classes
21-Jun-2019 13:34:05 > Task :spring-instrument:inspectClassesForKotlinIC
21-Jun-2019 13:34:05 > Task :spring-instrument:jar
21-Jun-2019 13:34:09 > Task :spring-context:compileKotlin
21-Jun-2019 13:34:10 > Task :spring-context:compileJava
21-Jun-2019 13:34:10 > Task :spring-context:compileGroovy NO-SOURCE
21-Jun-2019 13:34:10 > Task :spring-context:processResources
21-Jun-2019 13:34:10 > Task :spring-context:classes
21-Jun-2019 13:34:10 > Task :spring-expression:compileTestKotlin
21-Jun-2019 13:34:14 > Task :spring-expression:compileTestJava
21-Jun-2019 13:34:14 > Task :spring-expression:processTestResources
21-Jun-2019 13:34:14 > Task :spring-expression:testClasses
21-Jun-2019 13:34:14 > Task :spring-instrument:compileTestKotlin NO-SOURCE
21-Jun-2019 13:34:14 > Task :spring-instrument:compileTestJava NO-SOURCE
21-Jun-2019 13:34:14 > Task :spring-instrument:processTestResources
21-Jun-2019 13:34:14 > Task :spring-instrument:testClasses
21-Jun-2019 13:34:15 > Task :spring-context:compileTestKotlin
21-Jun-2019 13:34:15 > Task :spring-context:inspectClassesForKotlinIC
21-Jun-2019 13:34:15 > Task :spring-context:jar
21-Jun-2019 13:34:20
21-Jun-2019 13:34:20 > Task :spring-context:compileTestJava
21-Jun-2019 13:34:20 Note: Some input files use or override a deprecated API.
21-Jun-2019 13:34:20 Note: Recompile with -Xlint:deprecation for details.
21-Jun-2019 13:34:20 Note: Some input files use unchecked or unsafe operations.
21-Jun-2019 13:34:20 Note: Recompile with -Xlint:unchecked for details.
21-Jun-2019 13:34:21
21-Jun-2019 13:34:21 > Task :spring-context:compileTestGroovy
21-Jun-2019 13:34:21 > Task :spring-context:processTestResources
21-Jun-2019 13:34:21 > Task :spring-context:testClasses
21-Jun-2019 13:34:21 > Task :spring-tx:compileKotlin
21-Jun-2019 13:34:22 > Task :spring-tx:compileJava
21-Jun-2019 13:34:22 > Task :spring-tx:processResources
21-Jun-2019 13:34:22 > Task :spring-tx:classes
21-Jun-2019 13:34:22 > Task :spring-tx:inspectClassesForKotlinIC
21-Jun-2019 13:34:22 > Task :spring-tx:jar
21-Jun-2019 13:34:22 > Task :spring-jdbc:compileKotlin
21-Jun-2019 13:34:23 > Task :spring-jdbc:compileJava
21-Jun-2019 13:34:23 > Task :spring-jdbc:processResources
21-Jun-2019 13:34:23 > Task :spring-jdbc:classes
21-Jun-2019 13:34:23 > Task :spring-tx:compileTestKotlin
21-Jun-2019 13:34:40 > Task :spring-tx:compileTestJava
21-Jun-2019 13:34:40 > Task :spring-tx:processTestResources
21-Jun-2019 13:34:40 > Task :spring-tx:testClasses
21-Jun-2019 13:34:41 > Task :spring-jdbc:compileTestKotlin
21-Jun-2019 13:34:41 > Task :spring-jdbc:inspectClassesForKotlinIC
21-Jun-2019 13:34:41 > Task :spring-jdbc:jar
21-Jun-2019 13:34:42 > Task :spring-jdbc:compileTestJava
21-Jun-2019 13:34:42 > Task :spring-jdbc:processTestResources
21-Jun-2019 13:34:42 > Task :spring-jdbc:testClasses
21-Jun-2019 13:34:42 > Task :spring-oxm:compileKotlin
21-Jun-2019 13:34:42 > Task :spring-oxm:compileJava
21-Jun-2019 13:34:42 > Task :spring-oxm:processResources
21-Jun-2019 13:34:42 > Task :spring-oxm:classes
21-Jun-2019 13:34:42 > Task :spring-oxm:inspectClassesForKotlinIC
21-Jun-2019 13:34:42 > Task :spring-oxm:jar
21-Jun-2019 13:34:45 > Task :spring-web:compileKotlin
21-Jun-2019 13:34:47 > Task :spring-web:compileJava
21-Jun-2019 13:34:47 > Task :spring-web:processResources
21-Jun-2019 13:34:47 > Task :spring-web:classes
21-Jun-2019 13:34:47 > Task :spring-web:inspectClassesForKotlinIC
21-Jun-2019 13:34:47 > Task :spring-web:jar
21-Jun-2019 13:34:47 > Task :spring-orm:compileKotlin
21-Jun-2019 13:34:48 > Task :spring-orm:compileJava
21-Jun-2019 13:34:48 > Task :spring-orm:processResources NO-SOURCE
21-Jun-2019 13:34:48 > Task :spring-orm:classes
21-Jun-2019 13:34:48
21-Jun-2019 13:34:48 > Task :spring-oxm:genJaxb
21-Jun-2019 13:34:48 [ant:javac] : warning: 'includeantruntime' was not set, defaulting to build.sysclasspath=last; set to false for repeatable builds
21-Jun-2019 13:34:50
21-Jun-2019 13:34:50 > Task :spring-oxm:compileTestKotlin
21-Jun-2019 13:34:50 > Task :spring-oxm:compileTestJava
21-Jun-2019 13:34:50 > Task :spring-oxm:processTestResources
21-Jun-2019 13:34:50 > Task :spring-oxm:testClasses
21-Jun-2019 13:34:53 > Task :spring-web:compileTestKotlin
21-Jun-2019 13:34:56 > Task :spring-web:compileTestJava
21-Jun-2019 13:34:56 > Task :spring-web:processTestResources
21-Jun-2019 13:34:56 > Task :spring-web:testClasses
21-Jun-2019 13:34:57 > Task :spring-orm:compileTestKotlin
21-Jun-2019 13:34:57 > Task :spring-orm:inspectClassesForKotlinIC
21-Jun-2019 13:34:57 > Task :spring-orm:jar
21-Jun-2019 13:34:57 > Task :spring-orm:compileTestJava
21-Jun-2019 13:34:57 > Task :spring-orm:processTestResources
21-Jun-2019 13:34:57 > Task :spring-orm:testClasses
21-Jun-2019 13:34:58 > Task :spring-context-support:compileKotlin
21-Jun-2019 13:34:58 > Task :spring-context-support:compileJava
21-Jun-2019 13:34:58 > Task :spring-context-support:processResources
21-Jun-2019 13:34:58 > Task :spring-context-support:classes
21-Jun-2019 13:34:58 > Task :spring-context-support:compileTestKotlin
21-Jun-2019 13:34:58 > Task :spring-context-support:inspectClassesForKotlinIC
21-Jun-2019 13:34:58 > Task :spring-context-support:jar
21-Jun-2019 13:34:59 > Task :spring-context-support:compileTestJava
21-Jun-2019 13:34:59 > Task :spring-context-support:processTestResources
21-Jun-2019 13:34:59 > Task :spring-context-support:testClasses
21-Jun-2019 13:35:00 > Task :spring-webflux:compileKotlin
21-Jun-2019 13:35:01 > Task :spring-webflux:compileJava
21-Jun-2019 13:35:01 > Task :spring-webflux:processResources
21-Jun-2019 13:35:01 > Task :spring-webflux:classes
21-Jun-2019 13:35:01 > Task :spring-webflux:inspectClassesForKotlinIC
21-Jun-2019 13:35:02 > Task :spring-webflux:jar
21-Jun-2019 13:35:03 > Task :spring-webmvc:compileKotlin
21-Jun-2019 13:35:04 > Task :spring-webmvc:compileJava
21-Jun-2019 13:35:04 > Task :spring-webmvc:processResources
21-Jun-2019 13:35:04 > Task :spring-webmvc:classes
21-Jun-2019 13:35:04 > Task :spring-webmvc:inspectClassesForKotlinIC
21-Jun-2019 13:35:04 > Task :spring-webmvc:jar
21-Jun-2019 13:35:05 > Task :spring-messaging:compileKotlin
21-Jun-2019 13:35:05 > Task :spring-messaging:compileJava
21-Jun-2019 13:35:05 > Task :spring-messaging:processResources NO-SOURCE
21-Jun-2019 13:35:05 > Task :spring-messaging:classes
21-Jun-2019 13:35:05 > Task :spring-messaging:inspectClassesForKotlinIC
21-Jun-2019 13:35:05 > Task :spring-messaging:jar
21-Jun-2019 13:35:06 > Task :spring-websocket:compileKotlin
21-Jun-2019 13:35:06 > Task :spring-websocket:compileJava
21-Jun-2019 13:35:06 > Task :spring-websocket:processResources
21-Jun-2019 13:35:06 > Task :spring-websocket:classes
21-Jun-2019 13:35:06 > Task :spring-websocket:inspectClassesForKotlinIC
21-Jun-2019 13:35:06 > Task :spring-websocket:jar
21-Jun-2019 13:35:08 > Task :spring-test:compileKotlin
21-Jun-2019 13:35:09 > Task :spring-test:compileJava
21-Jun-2019 13:35:09 > Task :spring-test:processResources
21-Jun-2019 13:35:09 > Task :spring-test:classes
21-Jun-2019 13:35:11 > Task :spring-webflux:compileTestKotlin
21-Jun-2019 13:35:14 > Task :spring-webflux:compileTestJava
21-Jun-2019 13:35:15 > Task :spring-webflux:processTestResources
21-Jun-2019 13:35:15 > Task :spring-webflux:testClasses
21-Jun-2019 13:35:16 > Task :spring-webmvc:compileTestKotlin
21-Jun-2019 13:35:19 > Task :spring-webmvc:compileTestJava
21-Jun-2019 13:35:19 > Task :spring-webmvc:processTestResources
21-Jun-2019 13:35:19 > Task :spring-webmvc:testClasses
21-Jun-2019 13:35:21
21-Jun-2019 13:35:21 > Task :spring-messaging:compileTestKotlin
21-Jun-2019 13:35:21 w: /opt/bamboo-home/xml-data/build-dir/SPR-PUB-JOB1/spring-messaging/src/test/kotlin/org/springframework/messaging/rsocket/RSocketClientToServerCoroutinesIntegrationTests.kt: (202, 7): 'addServerPlugin(RSocketInterceptor!): RSocketFactory.ServerRSocketFactory!' is deprecated. Deprecated in Java
21-Jun-2019 13:35:22
21-Jun-2019 13:35:22 > Task :spring-messaging:compileTestJava
21-Jun-2019 13:35:22 > Task :spring-messaging:processTestResources
21-Jun-2019 13:35:22 > Task :spring-messaging:testClasses
21-Jun-2019 13:35:22 > Task :spring-websocket:compileTestKotlin
21-Jun-2019 13:35:23 > Task :spring-websocket:compileTestJava
21-Jun-2019 13:35:23 > Task :spring-websocket:processTestResources
21-Jun-2019 13:35:23 > Task :spring-websocket:testClasses
21-Jun-2019 13:35:25 > Task :spring-test:compileTestKotlin
21-Jun-2019 13:35:25 > Task :spring-test:inspectClassesForKotlinIC
21-Jun-2019 13:35:25 > Task :spring-test:jar
21-Jun-2019 13:35:28 > Task :spring-test:compileTestJava
21-Jun-2019 13:35:28 > Task :spring-test:processTestResources
21-Jun-2019 13:35:28 > Task :spring-test:testClasses
21-Jun-2019 13:35:28 > Task :compileTestKotlin
21-Jun-2019 13:35:29 > Task :compileTestJava
21-Jun-2019 13:35:29 > Task :compileTestGroovy NO-SOURCE
21-Jun-2019 13:35:29 > Task :processTestResources
21-Jun-2019 13:35:29 > Task :testClasses
21-Jun-2019 13:35:31 > Task :checkstyleTest
21-Jun-2019 13:35:34 > Task :test
21-Jun-2019 13:35:34 > Task :check
21-Jun-2019 13:35:38 > Task :spring-aop:checkstyleMain
21-Jun-2019 13:35:39 > Task :spring-aop:checkstyleTest
21-Jun-2019 13:35:42 > Task :spring-aop:test
21-Jun-2019 13:35:42 > Task :spring-aop:check
21-Jun-2019 13:35:42 > Task :spring-aspects:compileKotlin
21-Jun-2019 13:35:44 > Task :spring-aspects:compileJava
21-Jun-2019 13:35:44 > Task :spring-aspects:processResources
21-Jun-2019 13:35:44 > Task :spring-aspects:classes
21-Jun-2019 13:35:44 > Task :spring-aspects:checkstyleMain
21-Jun-2019 13:35:44 > Task :spring-aspects:compileTestKotlin
21-Jun-2019 13:35:44 > Task :spring-aspects:inspectClassesForKotlinIC
21-Jun-2019 13:35:44 > Task :spring-aspects:jar
21-Jun-2019 13:35:46 > Task :spring-aspects:compileTestJava
21-Jun-2019 13:35:46 > Task :spring-aspects:processTestResources
21-Jun-2019 13:35:46 > Task :spring-aspects:testClasses
21-Jun-2019 13:35:46 > Task :spring-aspects:checkstyleTest
21-Jun-2019 13:35:50 > Task :spring-aspects:test
21-Jun-2019 13:35:50 > Task :spring-aspects:check
21-Jun-2019 13:35:53 > Task :spring-beans:checkstyleMain
21-Jun-2019 13:35:55 > Task :spring-beans:checkstyleTest
21-Jun-2019 13:36:03 > Task :spring-beans:test
21-Jun-2019 13:36:03 > Task :spring-beans:check
21-Jun-2019 13:36:03 > Task :spring-build-src:compileKotlin NO-SOURCE
21-Jun-2019 13:36:03 > Task :spring-build-src:compileJava NO-SOURCE
21-Jun-2019 13:36:03 > Task :spring-build-src:compileGroovy
21-Jun-2019 13:36:03 > Task :spring-build-src:processResources
21-Jun-2019 13:36:03 > Task :spring-build-src:classes
21-Jun-2019 13:36:03 > Task :spring-build-src:checkstyleMain NO-SOURCE
21-Jun-2019 13:36:03 > Task :spring-build-src:compileTestKotlin NO-SOURCE
21-Jun-2019 13:36:03 > Task :spring-build-src:compileTestJava NO-SOURCE
21-Jun-2019 13:36:03 > Task :spring-build-src:compileTestGroovy NO-SOURCE
21-Jun-2019 13:36:03 > Task :spring-build-src:processTestResources NO-SOURCE
21-Jun-2019 13:36:03 > Task :spring-build-src:testClasses UP-TO-DATE
21-Jun-2019 13:36:03 > Task :spring-build-src:checkstyleTest NO-SOURCE
21-Jun-2019 13:36:03 > Task :spring-build-src:test NO-SOURCE
21-Jun-2019 13:36:03 > Task :spring-build-src:check UP-TO-DATE
21-Jun-2019 13:36:07 > Task :spring-context:checkstyleMain
21-Jun-2019 13:36:11 > Task :spring-context:checkstyleTest
21-Jun-2019 13:36:41 > Task :spring-context:test
21-Jun-2019 13:36:45 > Task :spring-context:check
21-Jun-2019 13:36:45 > Task :spring-context-indexer:compileKotlin
21-Jun-2019 13:36:46 > Task :spring-context-indexer:compileJava
21-Jun-2019 13:36:46 > Task :spring-context-indexer:processResources
21-Jun-2019 13:36:46 > Task :spring-context-indexer:classes
21-Jun-2019 13:36:46 > Task :spring-context-indexer:checkstyleMain
21-Jun-2019 13:36:46 > Task :spring-context-indexer:compileTestKotlin
21-Jun-2019 13:36:46 > Task :spring-context-indexer:compileTestJava
21-Jun-2019 13:36:46 > Task :spring-context-indexer:processTestResources NO-SOURCE
21-Jun-2019 13:36:46 > Task :spring-context-indexer:testClasses
21-Jun-2019 13:36:46 > Task :spring-context-indexer:checkstyleTest
21-Jun-2019 13:36:48 > Task :spring-context-indexer:test
21-Jun-2019 13:36:48 > Task :spring-context-indexer:check
21-Jun-2019 13:36:49 > Task :spring-context-support:checkstyleMain
21-Jun-2019 13:36:49 > Task :spring-context-support:checkstyleTest
21-Jun-2019 13:36:59 > Task :spring-context-support:test
21-Jun-2019 13:36:59 > Task :spring-context-support:check
21-Jun-2019 13:37:05 > Task :spring-core:checkstyleMain
21-Jun-2019 13:37:07 > Task :spring-core:checkstyleTest
21-Jun-2019 13:37:18 > Task :spring-core:test
21-Jun-2019 13:37:18 > Task :spring-core:check
21-Jun-2019 13:37:18 > Task :spring-core-coroutines:checkstyleMain NO-SOURCE
21-Jun-2019 13:37:18 > Task :spring-core-coroutines:checkstyleTest NO-SOURCE
21-Jun-2019 13:37:18 > Task :spring-core-coroutines:test NO-SOURCE
21-Jun-2019 13:37:18 > Task :spring-core-coroutines:check UP-TO-DATE
21-Jun-2019 13:37:19 > Task :spring-expression:checkstyleMain
21-Jun-2019 13:37:20 > Task :spring-expression:checkstyleTest
21-Jun-2019 13:37:22 > Task :spring-expression:test
21-Jun-2019 13:37:22 > Task :spring-expression:check
21-Jun-2019 13:37:22 > Task :spring-framework-bom:compileKotlin NO-SOURCE
21-Jun-2019 13:37:22 > Task :spring-framework-bom:compileJava NO-SOURCE
21-Jun-2019 13:37:22 > Task :spring-framework-bom:processResources NO-SOURCE
21-Jun-2019 13:37:22 > Task :spring-framework-bom:classes UP-TO-DATE
21-Jun-2019 13:37:22 > Task :spring-framework-bom:checkstyleMain NO-SOURCE
21-Jun-2019 13:37:22 > Task :spring-framework-bom:compileTestKotlin NO-SOURCE
21-Jun-2019 13:37:22 > Task :spring-framework-bom:compileTestJava NO-SOURCE
21-Jun-2019 13:37:22 > Task :spring-framework-bom:processTestResources NO-SOURCE
21-Jun-2019 13:37:22 > Task :spring-framework-bom:testClasses UP-TO-DATE
21-Jun-2019 13:37:22 > Task :spring-framework-bom:checkstyleTest NO-SOURCE
21-Jun-2019 13:37:22 > Task :spring-framework-bom:test NO-SOURCE
21-Jun-2019 13:37:22 > Task :spring-framework-bom:check UP-TO-DATE
21-Jun-2019 13:37:22 > Task :spring-instrument:checkstyleMain
21-Jun-2019 13:37:22 > Task :spring-instrument:checkstyleTest NO-SOURCE
21-Jun-2019 13:37:22 > Task :spring-instrument:test NO-SOURCE
21-Jun-2019 13:37:22 > Task :spring-instrument:check
21-Jun-2019 13:37:22 > Task :spring-jcl:checkstyleMain
21-Jun-2019 13:37:23 > Task :spring-jcl:checkstyleTest NO-SOURCE
21-Jun-2019 13:37:23 > Task :spring-jcl:test NO-SOURCE
21-Jun-2019 13:37:23 > Task :spring-jcl:check
21-Jun-2019 13:37:24 > Task :spring-jdbc:checkstyleMain
21-Jun-2019 13:37:25 > Task :spring-jdbc:checkstyleTest
21-Jun-2019 13:37:34 > Task :spring-jdbc:test
21-Jun-2019 13:37:34 > Task :spring-jdbc:check
21-Jun-2019 13:37:34 > Task :spring-jms:compileKotlin
21-Jun-2019 13:37:35 > Task :spring-jms:compileJava
21-Jun-2019 13:37:35 > Task :spring-jms:processResources
21-Jun-2019 13:37:35 > Task :spring-jms:classes
21-Jun-2019 13:37:36 > Task :spring-jms:checkstyleMain
21-Jun-2019 13:37:36 > Task :spring-jms:compileTestKotlin
21-Jun-2019 13:37:36 > Task :spring-jms:compileTestJava
21-Jun-2019 13:37:36 > Task :spring-jms:processTestResources
21-Jun-2019 13:37:36 > Task :spring-jms:testClasses
21-Jun-2019 13:37:37 > Task :spring-jms:checkstyleTest
21-Jun-2019 13:37:41 > Task :spring-jms:test
21-Jun-2019 13:37:41 > Task :spring-jms:check
21-Jun-2019 13:37:43 > Task :spring-messaging:checkstyleMain
21-Jun-2019 13:37:44 > Task :spring-messaging:checkstyleTest
21-Jun-2019 13:38:14 > Task :spring-messaging:test
21-Jun-2019 13:38:29 > Task :spring-messaging:check
21-Jun-2019 13:38:30 > Task :spring-orm:checkstyleMain
21-Jun-2019 13:38:31 > Task :spring-orm:checkstyleTest
21-Jun-2019 13:38:37 > Task :spring-orm:test
21-Jun-2019 13:38:37 > Task :spring-orm:check
21-Jun-2019 13:38:37 > Task :spring-oxm:checkstyleMain
21-Jun-2019 13:38:37 > Task :spring-oxm:checkstyleTest
21-Jun-2019 13:38:40 > Task :spring-oxm:test
21-Jun-2019 13:38:40 > Task :spring-oxm:check
21-Jun-2019 13:38:50 > Task :spring-test:testJUnitJupiter
21-Jun-2019 13:38:57 > Task :spring-test:testNG
21-Jun-2019 13:39:27 > Task :spring-test:test
21-Jun-2019 13:39:32 > Task :spring-test:aggregateTestReports
21-Jun-2019 13:39:34 > Task :spring-test:checkstyleMain
21-Jun-2019 13:39:36 > Task :spring-test:checkstyleTest
21-Jun-2019 13:39:36 > Task :spring-test:check
21-Jun-2019 13:39:38 > Task :spring-tx:checkstyleMain
21-Jun-2019 13:39:38 > Task :spring-tx:checkstyleTest
21-Jun-2019 13:39:43 > Task :spring-tx:test
21-Jun-2019 13:39:43 > Task :spring-tx:check
21-Jun-2019 13:39:47 > Task :spring-web:checkstyleMain
21-Jun-2019 13:39:50 > Task :spring-web:checkstyleTest
21-Jun-2019 13:40:11 > Task :spring-web:test
21-Jun-2019 13:40:11 > Task :spring-web:check
21-Jun-2019 13:40:13 > Task :spring-webflux:checkstyleMain
21-Jun-2019 13:40:14 > Task :spring-webflux:checkstyleTest
21-Jun-2019 13:40:36
21-Jun-2019 13:40:36 > Task :spring-webflux:test
21-Jun-2019 13:40:36
21-Jun-2019 13:40:36 org.springframework.web.reactive.result.method.annotation.MultipartIntegrationTests > transferTo[server [org.springframework.http.server.reactive.bootstrap.TomcatHttpServer@4ee0a895]] FAILED
21-Jun-2019 13:40:36     org.junit.ComparisonFailure at MultipartIntegrationTests.java:173
21-Jun-2019 13:41:48
21-Jun-2019 13:41:48 1752 tests completed, 1 failed, 18 skipped
21-Jun-2019 13:41:48
21-Jun-2019 13:41:48 > Task :spring-webflux:test FAILED
21-Jun-2019 13:41:48
21-Jun-2019 13:41:48 Deprecated Gradle features were used in this build, making it incompatible with Gradle 6.0.
21-Jun-2019 13:41:48 Use '--warning-mode all' to show the individual deprecation warnings.
21-Jun-2019 13:41:48 See https://docs.gradle.org/5.4.1/userguide/command_line_interface.html#sec:command_line_warnings
21-Jun-2019 13:41:48 249 actionable tasks: 225 executed, 24 up-to-date
21-Jun-2019 13:41:48
21-Jun-2019 13:41:48 FAILURE: Build failed with an exception.
21-Jun-2019 13:41:48
21-Jun-2019 13:41:48 * What went wrong:
21-Jun-2019 13:41:48 Execution failed for task ':spring-webflux:test'.
21-Jun-2019 13:41:48 > There were failing tests. See the report at: file:///opt/bamboo-home/xml-data/build-dir/SPR-PUB-JOB1/spring-webflux/build/reports/tests/test/index.html
21-Jun-2019 13:41:48
21-Jun-2019 13:41:48 * Try:
21-Jun-2019 13:41:48 Run with --info or --debug option to get more log output. Run with --scan to get full insights.
21-Jun-2019 13:41:48
21-Jun-2019 13:41:48 * Exception is:
21-Jun-2019 13:41:48 org.gradle.api.tasks.TaskExecutionException: Execution failed for task ':spring-webflux:test'.
21-Jun-2019 13:41:48         at org.gradle.api.internal.tasks.execution.ExecuteActionsTaskExecuter$3.accept(ExecuteActionsTaskExecuter.java:151)
21-Jun-2019 13:41:48         at org.gradle.api.internal.tasks.execution.ExecuteActionsTaskExecuter$3.accept(ExecuteActionsTaskExecuter.java:148)
21-Jun-2019 13:41:48         at org.gradle.internal.Try$Failure.ifSuccessfulOrElse(Try.java:191)
21-Jun-2019 13:41:48         at org.gradle.api.internal.tasks.execution.ExecuteActionsTaskExecuter.execute(ExecuteActionsTaskExecuter.java:141)
21-Jun-2019 13:41:48         at org.gradle.api.internal.tasks.execution.ResolveBeforeExecutionStateTaskExecuter.execute(ResolveBeforeExecutionStateTaskExecuter.java:75)
21-Jun-2019 13:41:48         at org.gradle.api.internal.tasks.execution.ValidatingTaskExecuter.execute(ValidatingTaskExecuter.java:62)
21-Jun-2019 13:41:48         at org.gradle.api.internal.tasks.execution.SkipEmptySourceFilesTaskExecuter.execute(SkipEmptySourceFilesTaskExecuter.java:108)
21-Jun-2019 13:41:48         at org.gradle.api.internal.tasks.execution.ResolveBeforeExecutionOutputsTaskExecuter.execute(ResolveBeforeExecutionOutputsTaskExecuter.java:67)
21-Jun-2019 13:41:48         at org.gradle.api.internal.tasks.execution.ResolveAfterPreviousExecutionStateTaskExecuter.execute(ResolveAfterPreviousExecutionStateTaskExecuter.java:46)
21-Jun-2019 13:41:48         at org.gradle.api.internal.tasks.execution.CleanupStaleOutputsExecuter.execute(CleanupStaleOutputsExecuter.java:94)
21-Jun-2019 13:41:48         at org.gradle.api.internal.tasks.execution.FinalizePropertiesTaskExecuter.execute(FinalizePropertiesTaskExecuter.java:46)
21-Jun-2019 13:41:48         at org.gradle.api.internal.tasks.execution.ResolveTaskExecutionModeExecuter.execute(ResolveTaskExecutionModeExecuter.java:95)
21-Jun-2019 13:41:48         at org.gradle.api.internal.tasks.execution.SkipTaskWithNoActionsExecuter.execute(SkipTaskWithNoActionsExecuter.java:57)
21-Jun-2019 13:41:48         at org.gradle.api.internal.tasks.execution.SkipOnlyIfTaskExecuter.execute(SkipOnlyIfTaskExecuter.java:56)
21-Jun-2019 13:41:48         at org.gradle.api.internal.tasks.execution.CatchExceptionTaskExecuter.execute(CatchExceptionTaskExecuter.java:36)
21-Jun-2019 13:41:48         at org.gradle.api.internal.tasks.execution.EventFiringTaskExecuter$1.executeTask(EventFiringTaskExecuter.java:73)
21-Jun-2019 13:41:48         at org.gradle.api.internal.tasks.execution.EventFiringTaskExecuter$1.call(EventFiringTaskExecuter.java:52)
21-Jun-2019 13:41:48         at org.gradle.api.internal.tasks.execution.EventFiringTaskExecuter$1.call(EventFiringTaskExecuter.java:49)
21-Jun-2019 13:41:48         at org.gradle.internal.operations.DefaultBuildOperationExecutor$CallableBuildOperationWorker.execute(DefaultBuildOperationExecutor.java:416)
21-Jun-2019 13:41:48         at org.gradle.internal.operations.DefaultBuildOperationExecutor$CallableBuildOperationWorker.execute(DefaultBuildOperationExecutor.java:406)
21-Jun-2019 13:41:48         at org.gradle.internal.operations.DefaultBuildOperationExecutor$1.execute(DefaultBuildOperationExecutor.java:165)
21-Jun-2019 13:41:48         at org.gradle.internal.operations.DefaultBuildOperationExecutor.execute(DefaultBuildOperationExecutor.java:250)
21-Jun-2019 13:41:48         at org.gradle.internal.operations.DefaultBuildOperationExecutor.execute(DefaultBuildOperationExecutor.java:158)
21-Jun-2019 13:41:48         at org.gradle.internal.operations.DefaultBuildOperationExecutor.call(DefaultBuildOperationExecutor.java:102)
21-Jun-2019 13:41:48         at org.gradle.internal.operations.DelegatingBuildOperationExecutor.call(DelegatingBuildOperationExecutor.java:36)
21-Jun-2019 13:41:48         at org.gradle.api.internal.tasks.execution.EventFiringTaskExecuter.execute(EventFiringTaskExecuter.java:49)
21-Jun-2019 13:41:48         at org.gradle.execution.plan.LocalTaskNodeExecutor.execute(LocalTaskNodeExecutor.java:43)
21-Jun-2019 13:41:48         at org.gradle.execution.taskgraph.DefaultTaskExecutionGraph$InvokeNodeExecutorsAction.execute(DefaultTaskExecutionGraph.java:355)
21-Jun-2019 13:41:48         at org.gradle.execution.taskgraph.DefaultTaskExecutionGraph$InvokeNodeExecutorsAction.execute(DefaultTaskExecutionGraph.java:343)
21-Jun-2019 13:41:48         at org.gradle.execution.taskgraph.DefaultTaskExecutionGraph$BuildOperationAwareExecutionAction.execute(DefaultTaskExecutionGraph.java:336)
21-Jun-2019 13:41:48         at org.gradle.execution.taskgraph.DefaultTaskExecutionGraph$BuildOperationAwareExecutionAction.execute(DefaultTaskExecutionGraph.java:322)
21-Jun-2019 13:41:48         at org.gradle.execution.plan.DefaultPlanExecutor$ExecutorWorker$1.execute(DefaultPlanExecutor.java:134)
21-Jun-2019 13:41:48         at org.gradle.execution.plan.DefaultPlanExecutor$ExecutorWorker$1.execute(DefaultPlanExecutor.java:129)
21-Jun-2019 13:41:48         at org.gradle.execution.plan.DefaultPlanExecutor$ExecutorWorker.execute(DefaultPlanExecutor.java:202)
21-Jun-2019 13:41:48         at org.gradle.execution.plan.DefaultPlanExecutor$ExecutorWorker.executeNextNode(DefaultPlanExecutor.java:193)
21-Jun-2019 13:41:48         at org.gradle.execution.plan.DefaultPlanExecutor$ExecutorWorker.run(DefaultPlanExecutor.java:129)
21-Jun-2019 13:41:48         at org.gradle.internal.concurrent.ExecutorPolicy$CatchAndRecordFailures.onExecute(ExecutorPolicy.java:63)
21-Jun-2019 13:41:48         at org.gradle.internal.concurrent.ManagedExecutorImpl$1.run(ManagedExecutorImpl.java:46)
21-Jun-2019 13:41:48         at org.gradle.internal.concurrent.ThreadFactoryImpl$ManagedThreadRunnable.run(ThreadFactoryImpl.java:55)
21-Jun-2019 13:41:48 Caused by: org.gradle.api.GradleException: There were failing tests. See the report at: file:///opt/bamboo-home/xml-data/build-dir/SPR-PUB-JOB1/spring-webflux/build/reports/tests/test/index.html
21-Jun-2019 13:41:48         at org.gradle.api.tasks.testing.AbstractTestTask.handleTestFailures(AbstractTestTask.java:626)
21-Jun-2019 13:41:48         at org.gradle.api.tasks.testing.AbstractTestTask.executeTests(AbstractTestTask.java:498)
21-Jun-2019 13:41:48         at org.gradle.api.tasks.testing.Test.executeTests(Test.java:594)
21-Jun-2019 13:41:48         at org.gradle.internal.reflect.JavaMethod.invoke(JavaMethod.java:103)
21-Jun-2019 13:41:48         at org.gradle.api.internal.project.taskfactory.StandardTaskAction.doExecute(StandardTaskAction.java:48)
21-Jun-2019 13:41:48         at org.gradle.api.internal.project.taskfactory.StandardTaskAction.execute(StandardTaskAction.java:41)
21-Jun-2019 13:41:48         at org.gradle.api.internal.project.taskfactory.StandardTaskAction.execute(StandardTaskAction.java:28)
21-Jun-2019 13:41:48         at org.gradle.api.internal.AbstractTask$TaskActionWrapper.execute(AbstractTask.java:702)
21-Jun-2019 13:41:48         at org.gradle.api.internal.AbstractTask$TaskActionWrapper.execute(AbstractTask.java:669)
21-Jun-2019 13:41:48         at org.gradle.api.internal.tasks.execution.ExecuteActionsTaskExecuter$5.run(ExecuteActionsTaskExecuter.java:404)
21-Jun-2019 13:41:48         at org.gradle.internal.operations.DefaultBuildOperationExecutor$RunnableBuildOperationWorker.execute(DefaultBuildOperationExecutor.java:402)
21-Jun-2019 13:41:48         at org.gradle.internal.operations.DefaultBuildOperationExecutor$RunnableBuildOperationWorker.execute(DefaultBuildOperationExecutor.java:394)
21-Jun-2019 13:41:48         at org.gradle.internal.operations.DefaultBuildOperationExecutor$1.execute(DefaultBuildOperationExecutor.java:165)
21-Jun-2019 13:41:48         at org.gradle.internal.operations.DefaultBuildOperationExecutor.execute(DefaultBuildOperationExecutor.java:250)
21-Jun-2019 13:41:48         at org.gradle.internal.operations.DefaultBuildOperationExecutor.execute(DefaultBuildOperationExecutor.java:158)
21-Jun-2019 13:41:48         at org.gradle.internal.operations.DefaultBuildOperationExecutor.run(DefaultBuildOperationExecutor.java:92)
21-Jun-2019 13:41:48         at org.gradle.internal.operations.DelegatingBuildOperationExecutor.run(DelegatingBuildOperationExecutor.java:31)
21-Jun-2019 13:41:48         at org.gradle.api.internal.tasks.execution.ExecuteActionsTaskExecuter.executeAction(ExecuteActionsTaskExecuter.java:393)
21-Jun-2019 13:41:48         at org.gradle.api.internal.tasks.execution.ExecuteActionsTaskExecuter.executeActions(ExecuteActionsTaskExecuter.java:376)
21-Jun-2019 13:41:48         at org.gradle.api.internal.tasks.execution.ExecuteActionsTaskExecuter.access$200(ExecuteActionsTaskExecuter.java:80)
21-Jun-2019 13:41:48         at org.gradle.api.internal.tasks.execution.ExecuteActionsTaskExecuter$TaskExecution.execute(ExecuteActionsTaskExecuter.java:213)
21-Jun-2019 13:41:48         at org.gradle.internal.execution.steps.ExecuteStep.lambda$execute$1(ExecuteStep.java:33)
21-Jun-2019 13:41:48         at org.gradle.internal.execution.steps.ExecuteStep.execute(ExecuteStep.java:33)
21-Jun-2019 13:41:48         at org.gradle.internal.execution.steps.ExecuteStep.execute(ExecuteStep.java:26)
21-Jun-2019 13:41:48         at org.gradle.internal.execution.steps.CleanupOutputsStep.execute(CleanupOutputsStep.java:58)
21-Jun-2019 13:41:48         at org.gradle.internal.execution.steps.CleanupOutputsStep.execute(CleanupOutputsStep.java:35)
21-Jun-2019 13:41:48         at org.gradle.internal.execution.steps.ResolveInputChangesStep.execute(ResolveInputChangesStep.java:48)
21-Jun-2019 13:41:48         at org.gradle.internal.execution.steps.ResolveInputChangesStep.execute(ResolveInputChangesStep.java:33)
21-Jun-2019 13:41:48         at org.gradle.internal.execution.steps.CancelExecutionStep.execute(CancelExecutionStep.java:39)
21-Jun-2019 13:41:48         at org.gradle.internal.execution.steps.TimeoutStep.executeWithoutTimeout(TimeoutStep.java:73)
21-Jun-2019 13:41:48         at org.gradle.internal.execution.steps.TimeoutStep.execute(TimeoutStep.java:54)
21-Jun-2019 13:41:48         at org.gradle.internal.execution.steps.CatchExceptionStep.execute(CatchExceptionStep.java:35)
21-Jun-2019 13:41:48         at org.gradle.internal.execution.steps.CreateOutputsStep.execute(CreateOutputsStep.java:51)
21-Jun-2019 13:41:48         at org.gradle.internal.execution.steps.SnapshotOutputsStep.execute(SnapshotOutputsStep.java:45)
21-Jun-2019 13:41:48         at org.gradle.internal.execution.steps.SnapshotOutputsStep.execute(SnapshotOutputsStep.java:31)
21-Jun-2019 13:41:48         at org.gradle.internal.execution.steps.CacheStep.executeWithoutCache(CacheStep.java:201)
21-Jun-2019 13:41:48         at org.gradle.internal.execution.steps.CacheStep.execute(CacheStep.java:70)
21-Jun-2019 13:41:48         at org.gradle.internal.execution.steps.CacheStep.execute(CacheStep.java:45)
21-Jun-2019 13:41:48         at org.gradle.internal.execution.steps.BroadcastChangingOutputsStep.execute(BroadcastChangingOutputsStep.java:49)
21-Jun-2019 13:41:48         at org.gradle.internal.execution.steps.StoreSnapshotsStep.execute(StoreSnapshotsStep.java:43)
21-Jun-2019 13:41:48         at org.gradle.internal.execution.steps.StoreSnapshotsStep.execute(StoreSnapshotsStep.java:32)
21-Jun-2019 13:41:48         at org.gradle.internal.execution.steps.RecordOutputsStep.execute(RecordOutputsStep.java:38)
21-Jun-2019 13:41:48         at org.gradle.internal.execution.steps.RecordOutputsStep.execute(RecordOutputsStep.java:24)
21-Jun-2019 13:41:48         at org.gradle.internal.execution.steps.SkipUpToDateStep.executeBecause(SkipUpToDateStep.java:96)
21-Jun-2019 13:41:48         at org.gradle.internal.execution.steps.SkipUpToDateStep.lambda$execute$0(SkipUpToDateStep.java:89)
21-Jun-2019 13:41:48         at org.gradle.internal.execution.steps.SkipUpToDateStep.execute(SkipUpToDateStep.java:54)
21-Jun-2019 13:41:48         at org.gradle.internal.execution.steps.SkipUpToDateStep.execute(SkipUpToDateStep.java:38)
21-Jun-2019 13:41:48         at org.gradle.internal.execution.steps.ResolveChangesStep.execute(ResolveChangesStep.java:77)
21-Jun-2019 13:41:48         at org.gradle.internal.execution.steps.ResolveChangesStep.execute(ResolveChangesStep.java:37)
21-Jun-2019 13:41:48         at org.gradle.internal.execution.steps.legacy.MarkSnapshottingInputsFinishedStep.execute(MarkSnapshottingInputsFinishedStep.java:36)
21-Jun-2019 13:41:48         at org.gradle.internal.execution.steps.legacy.MarkSnapshottingInputsFinishedStep.execute(MarkSnapshottingInputsFinishedStep.java:26)
21-Jun-2019 13:41:48         at org.gradle.internal.execution.steps.ResolveCachingStateStep.execute(ResolveCachingStateStep.java:90)
21-Jun-2019 13:41:48         at org.gradle.internal.execution.steps.ResolveCachingStateStep.execute(ResolveCachingStateStep.java:48)
21-Jun-2019 13:41:48         at org.gradle.internal.execution.impl.DefaultWorkExecutor.execute(DefaultWorkExecutor.java:33)
21-Jun-2019 13:41:48         at org.gradle.api.internal.tasks.execution.ExecuteActionsTaskExecuter.execute(ExecuteActionsTaskExecuter.java:120)
21-Jun-2019 13:41:48         ... 35 more
21-Jun-2019 13:41:48
21-Jun-2019 13:41:48
21-Jun-2019 13:41:48 * Get more help at https://help.gradle.org
21-Jun-2019 13:41:48
21-Jun-2019 13:41:48 BUILD FAILED in 8m 34s
21-Jun-2019 13:41:49
21-Jun-2019 13:41:49 Failing task since return code of [./gradlew --refresh-dependencies --no-daemon -PtestGroups=ci -P BRANCH_NAME=master --stacktrace clean check build -I /tmp/artifactory.init.script1596557783075879836gradle -DbuildInfoConfig.propertiesFile=/tmp/buildinfo4743818802350281322properties artifactoryPublish -Dartifactory.resolve.password=******** -Dartifactory.publish.password=********] was 1 while expected 0
21-Jun-2019 13:41:49 Parsing test results under /opt/bamboo-home/xml-data/build-dir/SPR-PUB-JOB1...
21-Jun-2019 13:41:51 Finished task 'Artifactory Gradle' with result: Failed
21-Jun-2019 13:41:51 Running post build plugin 'Docker Container Cleanup'
21-Jun-2019 13:41:51 Running post build plugin 'NCover Results Collector'
21-Jun-2019 13:41:51 Running post build plugin 'Artifactory Release Management Staging'
21-Jun-2019 13:41:51 Running post build plugin 'Artifactory Build Info Copier'
21-Jun-2019 13:41:51 Running post build plugin 'Artifactory Gradle Properties Info Copier'
21-Jun-2019 13:41:51 Running post build plugin 'Clover Results Collector'
21-Jun-2019 13:41:51 Running post build plugin 'npm Cache Cleanup'
21-Jun-2019 13:41:51 Running post build plugin 'Artifact Copier'
21-Jun-2019 13:41:51 Successfully removed working directory at '/opt/bamboo-home/xml-data/build-dir/SPR-PUB-JOB1'
21-Jun-2019 13:41:51 Finalising the build...
21-Jun-2019 13:41:51 Stopping timer.
21-Jun-2019 13:41:51 Build SPR-PUB-JOB1-7511 completed.
21-Jun-2019 13:41:56 Running on server: post build plugin 'NCover Results Collector'
21-Jun-2019 13:41:56 Running on server: post build plugin 'Build Hanging Detection Configuration'
21-Jun-2019 13:41:56 Running on server: post build plugin 'Clover Delta Calculator'
21-Jun-2019 13:41:56 Running on server: post build plugin 'Maven Dependencies Postprocessor'
21-Jun-2019 13:41:56 All post build plugins have finished
21-Jun-2019 13:41:56 Generating build results summary...
21-Jun-2019 13:42:13 Saving build results to disk...
21-Jun-2019 13:42:14 Logging substituted variables...
21-Jun-2019 13:42:14 Indexing build results...
21-Jun-2019 13:42:14 Finished building SPR-PUB-JOB1-7511.