Build #7,517

Build: #7517 failed

Job: Default Job failed

Stages & jobs

  1. Default Stage

Build log

The build generated 672 lines of output. Download or view full build log

22-Jun-2019 16:04:50 Build Spring Framework - Publication - Default Job #7517 (SPR-PUB-JOB1-7517) started building on agent bamboo-16.af.pivotal.io
22-Jun-2019 16:04:50 Remote agent on host bamboo-16.af.pivotal.io
22-Jun-2019 16:04:50 Build working directory is /opt/bamboo-home/xml-data/build-dir/SPR-PUB-JOB1
22-Jun-2019 16:04:50 Executing build Spring Framework - Publication - Default Job #7517 (SPR-PUB-JOB1-7517)
22-Jun-2019 16:04:50 Starting task 'Checkout Default Repository' of type 'com.atlassian.bamboo.plugins.vcs:task.vcs.checkout'
22-Jun-2019 16:04:50 Build always requires a clean checkout
22-Jun-2019 16:04:50 Cleaning build directory '/opt/bamboo-home/xml-data/build-dir/SPR-PUB-JOB1'
22-Jun-2019 16:04:50 Checking out into /opt/bamboo-home/xml-data/build-dir/SPR-PUB-JOB1
22-Jun-2019 16:04:50 Updating source code to revision: 4568edf6c455f22c232dbfc1ed79ae263a99a7f4
22-Jun-2019 16:04:50 Creating local git repository in '/opt/bamboo-home/xml-data/build-dir/SPR-PUB-JOB1/.git'.
22-Jun-2019 16:04:50 Initialized empty Git repository in /opt/bamboo-home/xml-data/build-dir/SPR-PUB-JOB1/.git/
22-Jun-2019 16:04:52 Fetching 'refs/heads/master' from 'https://github.com/spring-projects/spring-framework.git'.
22-Jun-2019 16:05:18 From https://github.com/spring-projects/spring-framework
22-Jun-2019 16:05:18 * [new branch]      master     -> master
22-Jun-2019 16:05:18 * [new tag]               v3.1.0.RELEASE -> v3.1.0.RELEASE
22-Jun-2019 16:05:18 * [new tag]               v3.2.0.M1      -> v3.2.0.M1
22-Jun-2019 16:05:18 * [new tag]               v3.2.0.M2      -> v3.2.0.M2
22-Jun-2019 16:05:18 * [new tag]               v3.2.0.RC1     -> v3.2.0.RC1
22-Jun-2019 16:05:18 * [new tag]               v3.2.0.RC2-A   -> v3.2.0.RC2-A
22-Jun-2019 16:05:18 * [new tag]               v3.2.0.RELEASE -> v3.2.0.RELEASE
22-Jun-2019 16:05:18 * [new tag]               v3.2.1.RELEASE -> v3.2.1.RELEASE
22-Jun-2019 16:05:18 * [new tag]               v3.2.2.RELEASE -> v3.2.2.RELEASE
22-Jun-2019 16:05:18 * [new tag]               v4.0.0.M1      -> v4.0.0.M1
22-Jun-2019 16:05:18 * [new tag]               v4.0.0.M2      -> v4.0.0.M2
22-Jun-2019 16:05:18 * [new tag]               v4.0.0.M3      -> v4.0.0.M3
22-Jun-2019 16:05:18 * [new tag]               v4.0.0.RC1     -> v4.0.0.RC1
22-Jun-2019 16:05:18 * [new tag]               v4.0.0.RC2     -> v4.0.0.RC2
22-Jun-2019 16:05:18 Checking out revision 4568edf6c455f22c232dbfc1ed79ae263a99a7f4.
22-Jun-2019 16:05:19 Already on 'master'
22-Jun-2019 16:05:19 Updated source code to revision: 4568edf6c455f22c232dbfc1ed79ae263a99a7f4
22-Jun-2019 16:05:19 Finished task 'Checkout Default Repository' with result: Success
22-Jun-2019 16:05:19 Running pre-build action: Artifactory Release Staging
22-Jun-2019 16:05:19 Running pre-build action: VCS Version Collector
22-Jun-2019 16:05:19
Substituting variable: ${bamboo.spr.jdk.home} with /opt/jdk-8
22-Jun-2019 16:05:19
Substituting variable: ${bamboo.repository.branch.name} with master
22-Jun-2019 16:05:19 Starting task 'Artifactory Gradle' of type 'org.jfrog.bamboo.bamboo-artifactory-plugin:artifactoryGradleTask'
22-Jun-2019 16:05:19 Bamboo Artifactory Plugin version: 2.6.3
22-Jun-2019 16:05:19
Beginning to execute external process for build 'Spring Framework - Publication - Default Job #7517 (SPR-PUB-JOB1-7517)'
... running command line:
./gradlew --refresh-dependencies --no-daemon -PtestGroups=ci -P BRANCH_NAME=master --stacktrace clean check build -I /tmp/artifactory.init.script6021048187155596934gradle -DbuildInfoConfig.propertiesFile=/tmp/buildinfo4360716733063334079properties artifactoryPublish -Dartifactory.resolve.password=******** -Dartifactory.publish.password=********
... in: /opt/bamboo-home/xml-data/build-dir/SPR-PUB-JOB1
... using extra environment variables:
bamboo_planRepository_1_branch=master
bamboo_********_username_password=********
bamboo_signing_store_password=********
bamboo_planRepository_2_branch=master
bamboo_capability_system_builder_ant_Ant_1_9=/opt/ant-1.9
bamboo_repository_137199621_git_repositoryUrl=https://github.com/spring-projects/spring-framework.git
bamboo_capability_system_builder_ant_Ant_1_8=/opt/ant-1.8
bamboo_planRepository_1_branchDisplayName=master
bamboo_artifactory_override_resolve_repo=libs-milestone
bamboo_capability_system_builder_node_Node_js_10_16=/opt/node-10.16/bin/node
bamboo_repository_revision_number=4568edf6c455f22c232dbfc1ed79ae263a99a7f4
bamboo_repository_262406229_git_repositoryUrl=https://github.com/spring-projects/spring-framework.git
bamboo_artifactory_task_override_jdk=true
bamboo_RIAK_BIN=/usr/sbin/riak
WRAPPER_BITS=32
bamboo_buildKey=SPR-PUB-JOB1
bamboo_repository_137199621_name=Plan Repository
bamboo_spr_jdk_home=/opt/jdk-8
bamboo_bintray_password=********
bamboo_sonar_token_password=********
PWD=/opt/bamboo-home/bin
bamboo_planRepository_2_branchDisplayName=master
bamboo_shortJobName=Default Job
bamboo_artifactory_override_resolver_password=********
bamboo_sonatype_token=RSJChaox
bamboo_capability_system_builder_gradle___gradlew=./gradlew
bamboo_buildResultsUrl=https://build.spring.io/browse/SPR-PUB-JOB1-7517
bamboo_capability_system_builder_mvn3_Maven_3_3=/opt/maven-3.3
bamboo_capability_system_builder_mvn3_Maven_3_2=/opt/maven-3.2
bamboo_capability_system_builder_mvn3_Maven_3_1=/opt/maven-3.1
bamboo_planRepository_repositoryUrl=https://github.com/spring-projects/spring-framework.git
bamboo_capability_system_builder_mvn3_Maven_3_6=/opt/maven-3.6
bamboo_agentId=286195719
bamboo_capability_system_builder_mvn3_Maven_3_5=/opt/maven-3.5
bamboo_capability_system_builder_mvn3_Maven_3_0=/opt/maven-3.0
bamboo_planRepository_revision=4568edf6c455f22c232dbfc1ed79ae263a99a7f4
bamboo_planRepository_previousRevision=8f30639a0a10960e47632d225155fdd3cb1396f1
bamboo_repository_137199621_revision_number=4568edf6c455f22c232dbfc1ed79ae263a99a7f4
bamboo_capability_remote_build=true
bamboo_repository_branch_name=master
bamboo_sonatype_token_password=********
bamboo_sonatype_user=springsource
SHLVL=1
bamboo_org_jfrog_bamboo_buildInfo_serverUrl=https://repo.spring.io
bamboo_scdf_acceptance_tests_password=********
bamboo_repository_262406229_branch_name=master
WRAPPER_OS=linux
JAVA_HOME=/opt/jdk-8/
TERM=linux
XDG_SESSION_ID=c1
bamboo_planRepository_branch=master
bamboo_org_jfrog_bamboo_release_activated=false
bamboo_planRepository_1_type=gitv2
bamboo_planRepository_branchName=master
bamboo_repository_137199621_git_username=spring-buildmaster
bamboo_capability_system_jdk_JDK_12=/opt/jdk-12
WRAPPER_FILE_SEPARATOR=/
_=/opt/bamboo-home/bin/bamboo-agent.sh
bamboo_repository_262406229_revision_number=4568edf6c455f22c232dbfc1ed79ae263a99a7f4
bamboo_capability_system_builder_ant_Ant_1_10=/opt/ant-1.10
WRAPPER_PATH_SEPARATOR=:
bamboo_sonar_password=********
bamboo_hg_cache_directory=/opt/bamboo-home/xml-data/build-dir/_hg-repositories-cache
bamboo_planRepository_1_username=spring-buildmaster
bamboo_planRepository_type=gitv2
bamboo_repository_262406229_git_branch=master
bamboo_git_cache_directory=/opt/bamboo-home/xml-data/build-dir/_git-repositories-cache
bamboo_planRepository_2_branchName=master
bamboo_artifactory_username=buildmaster
bamboo_tmp_directory=/opt/bamboo-home/temp
bamboo_planKey=SPR-PUB
bamboo_planRepository_username=spring-buildmaster
bamboo_JDK8_HOME=/opt/jdk-8
bamboo_snifftask=sniff
bamboo_planRepository_1_branchName=master
bamboo_sonar_version=5.6.3
bamboo_sonar_jdbc_password=********
bamboo_bintray_api_key_password=********
GRADLE_OPTS=-Xms128m
bamboo_repository_262406229_git_username=spring-buildmaster
XDG_DATA_DIRS=/usr/local/share:/usr/share:/var/lib/snapd/desktop
bamboo_capability_system_jdk_JDK_1_11=/opt/jdk-11
bamboo_resultsUrl=https://build.spring.io/browse/SPR-PUB-JOB1-7517
bamboo_capability_system_jdk_JDK_1_10=/opt/jdk-10
bamboo_build_working_directory=/opt/bamboo-home/xml-data/build-dir/SPR-PUB-JOB1
bamboo_planRepository_1_name=Spring Framework
bamboo_capability_system_os=ubuntu1804
bamboo_nexusPush_stagingProfile=buildmaster
bamboo_shortPlanName=Publication
MAIL=/var/mail/bamboo
bamboo_planRepository_2_username=spring-buildmaster
bamboo_repository_137199621_branch_name=master
bamboo_planRepository_name=Spring Framework
LOGNAME=bamboo
bamboo_buildNumber=7517
bamboo_repository_137199621_git_branch=master
SHELL=/bin/bash
bamboo_planName=Spring Framework - Publication
bamboo_JDK7_HOME=/opt/jdk-7
bamboo_repository_137199621_previous_revision_number=8f30639a0a10960e47632d225155fdd3cb1396f1
bamboo_shortPlanKey=PUB
OLDPWD=/opt/users/bamboo
bamboo_shortJobKey=JOB1
bamboo_artifactory_password=********
bamboo_repository_262406229_name=Spring Framework
bamboo_planRepository_2_name=Plan Repository
bamboo_repository_262406229_previous_revision_number=8f30639a0a10960e47632d225155fdd3cb1396f1
bamboo_buildTimeStamp=2019-06-22T16:04:58.230Z
bamboo_repository_previous_revision_number=8f30639a0a10960e47632d225155fdd3cb1396f1
bamboo_sonar_username=buildmaster
bamboo_********_password=********
bamboo_repository_git_branch=master
bamboo_buildResultKey=SPR-PUB-JOB1-7517
bamboo_nexusPush_close=true
bamboo_artifactory_override_resolver_username=buildmaster
bamboo_buildPlanName=Spring Framework - Publication - Default Job
bamboo_planRepository_1_revision=4568edf6c455f22c232dbfc1ed79ae263a99a7f4
bamboo_repository_name=Plan Repository
bamboo_signing_key_password=********
bamboo_planRepository_2_previousRevision=8f30639a0a10960e47632d225155fdd3cb1396f1
bamboo_capability_system_builder_groovy_Groovy_2_5=/opt/groovy-2.5
LANG=en_US.UTF-8
bamboo_buildFailed=false
bamboo_capability_system_docker_executable=/usr/bin/docker
DISPLAY=localhost:1.0
bamboo_capability_system_jdk_OpenJDK_7=/opt/jdk-7
bamboo_capability_system_builder_groovy_Groovy_2_4=/opt/groovy-2.4
bamboo_artifactory_override_deployer_username=buildmaster
bamboo_artifactory_password_mask_b=********
bamboo_capability_system_builder_command_Bash=/bin/bash
bamboo_artifactory_password_mask_a=********
bamboo_agentWorkingDirectory=/opt/bamboo-home/xml-data/build-dir
bamboo_planRepository_2_revision=4568edf6c455f22c232dbfc1ed79ae263a99a7f4
bamboo_capability_system_git_executable=/usr/bin/git
bamboo_repository_git_username=spring-buildmaster
bamboo_planRepository_1_previousRevision=8f30639a0a10960e47632d225155fdd3cb1396f1
bamboo_capability_os_family=unix
bamboo_planRepository_branchDisplayName=master
bamboo_capability_system_builder_maven_Artifactory_Maven_3_6=/opt/maven-3.6
bamboo_capability_system_builder_maven_Artifactory_Maven_3_5=/opt/maven-3.5
GIT_SSL_NO_VERIFY=true
bamboo_capability_system_builder_maven_Artifactory_Maven_3_3=/opt/maven-3.3
bamboo_planRepository_2_type=gitv2
bamboo_capability_system_builder_maven_Artifactory_Maven_3_2=/opt/maven-3.2
bamboo_s3_properties=/home/bamboo/tools/s3.properties
bamboo_capability_system_builder_maven_Artifactory_Maven_3_1=/opt/maven-3.1
bamboo_artifactory_override_deploy_repo=libs-snapshot-local
bamboo_capability_system_builder_maven_Artifactory_Maven_3_0=/opt/maven-3.0
bamboo_plan_storageTag=SPR-PUB
bamboo_bintray_username_password=********
bamboo_planRepository_2_repositoryUrl=https://github.com/spring-projects/spring-framework.git
USER=bamboo
bamboo_repository_git_repositoryUrl=https://github.com/spring-projects/spring-framework.git
bamboo_working_directory=/opt/bamboo-home/xml-data/build-dir/SPR-PUB-JOB1
bamboo_org_jfrog_bamboo_buildInfo_activated=true
bamboo_planRepository_1_repositoryUrl=https://github.com/spring-projects/spring-framework.git
bamboo_capability_system_jdk_JDK_1_8=/opt/jdk-8
bamboo_artifactory_override_deployer_password=********
bamboo_capability_system_jdk_JDK_1_9=/opt/jdk-9
WRAPPER_ARCH=x86
bamboo_capability_system_jdk_JDK_1_6=/opt/jdk-6
bamboo_sonatype_password=********
bamboo_capability_system_jdk_JDK_1_7=/opt/jdk-7
bamboo_sonar_ip=10.194.6.9
XDG_RUNTIME_DIR=/run/user/1002
HOME=/home/bamboo
PATH=/bin:/home/bamboo/bin:/usr/local/sbin:/usr/local/bin:/usr/sbin:/usr/bin:/sbin:/bin:/usr/games:/usr/local/games:/snap/bin:/home/bamboo/bin:/usr/local/bin:/bin:/home/bamboo/bin:/usr/local/sbin:/usr/local/bin:/usr/sbin:/usr/bin:/sbin:/bin:/usr/games:/usr/local/games:/snap/bin:/home/bamboo/bin:/usr/local/bin
22-Jun-2019 16:05:22 > Task :buildSrc:compileJava NO-SOURCE
22-Jun-2019 16:05:23 > Task :buildSrc:compileGroovy
22-Jun-2019 16:05:23 > Task :buildSrc:processResources
22-Jun-2019 16:05:23 > Task :buildSrc:classes
22-Jun-2019 16:05:23 > Task :buildSrc:jar
22-Jun-2019 16:05:23 > Task :buildSrc:assemble
22-Jun-2019 16:05:23 > Task :buildSrc:compileTestJava NO-SOURCE
22-Jun-2019 16:05:23 > Task :buildSrc:compileTestGroovy NO-SOURCE
22-Jun-2019 16:05:23 > Task :buildSrc:processTestResources NO-SOURCE
22-Jun-2019 16:05:23 > Task :buildSrc:testClasses UP-TO-DATE
22-Jun-2019 16:05:23 > Task :buildSrc:test NO-SOURCE
22-Jun-2019 16:05:23 > Task :buildSrc:check UP-TO-DATE
22-Jun-2019 16:05:23 > Task :buildSrc:build
22-Jun-2019 16:05:34 Cannot publish pom for project ':spring-core-coroutines' since it does not contain the Maven plugin install task and task ':spring-core-coroutines:artifactoryPublish' does not specify a custom pom path.
22-Jun-2019 16:05:34 Cannot publish pom for project ':' since it does not contain the Maven plugin install task and task ':artifactoryPublish' does not specify a custom pom path.
22-Jun-2019 16:05:34 Cannot publish pom for project ':spring-build-src' since it does not contain the Maven plugin install task and task ':spring-build-src:artifactoryPublish' does not specify a custom pom path.
22-Jun-2019 16:05:37 > Task :clean UP-TO-DATE
22-Jun-2019 16:05:37 > Task :spring-aop:clean UP-TO-DATE
22-Jun-2019 16:05:37 > Task :spring-aspects:clean UP-TO-DATE
22-Jun-2019 16:05:37 > Task :spring-beans:clean UP-TO-DATE
22-Jun-2019 16:05:37 > Task :spring-build-src:clean
22-Jun-2019 16:05:37 > Task :spring-context:clean UP-TO-DATE
22-Jun-2019 16:05:37 > Task :spring-context-indexer:clean UP-TO-DATE
22-Jun-2019 16:05:37 > Task :spring-context-support:clean UP-TO-DATE
22-Jun-2019 16:05:37 > Task :spring-core:clean UP-TO-DATE
22-Jun-2019 16:05:37 > Task :spring-core-coroutines:clean UP-TO-DATE
22-Jun-2019 16:05:37 > Task :spring-expression:clean UP-TO-DATE
22-Jun-2019 16:05:37 > Task :spring-framework-bom:clean UP-TO-DATE
22-Jun-2019 16:05:37 > Task :spring-instrument:clean UP-TO-DATE
22-Jun-2019 16:05:37 > Task :spring-jcl:clean UP-TO-DATE
22-Jun-2019 16:05:37 > Task :spring-jdbc:clean UP-TO-DATE
22-Jun-2019 16:05:37 > Task :spring-jms:clean UP-TO-DATE
22-Jun-2019 16:05:37 > Task :spring-messaging:clean UP-TO-DATE
22-Jun-2019 16:05:37 > Task :spring-orm:clean UP-TO-DATE
22-Jun-2019 16:05:37 > Task :spring-oxm:clean UP-TO-DATE
22-Jun-2019 16:05:37 > Task :spring-test:clean UP-TO-DATE
22-Jun-2019 16:05:37 > Task :spring-tx:clean UP-TO-DATE
22-Jun-2019 16:05:37 > Task :spring-web:clean UP-TO-DATE
22-Jun-2019 16:05:37 > Task :spring-webflux:clean UP-TO-DATE
22-Jun-2019 16:05:37 > Task :spring-webmvc:clean UP-TO-DATE
22-Jun-2019 16:05:37 > Task :spring-websocket:clean UP-TO-DATE
22-Jun-2019 16:05:37 > Task :compileKotlin NO-SOURCE
22-Jun-2019 16:05:37 > Task :compileJava NO-SOURCE
22-Jun-2019 16:05:37 > Task :compileGroovy NO-SOURCE
22-Jun-2019 16:05:37 > Task :processResources NO-SOURCE
22-Jun-2019 16:05:37 > Task :classes UP-TO-DATE
22-Jun-2019 16:05:37 > Task :checkstyleMain NO-SOURCE
22-Jun-2019 16:05:37 > Task :spring-core:cglibRepackJar
22-Jun-2019 16:05:38 > Task :spring-core:objenesisRepackJar
22-Jun-2019 16:05:42 > Task :spring-core-coroutines:compileKotlin
22-Jun-2019 16:05:42 > Task :spring-core-coroutines:compileJava NO-SOURCE
22-Jun-2019 16:05:42 > Task :spring-core-coroutines:processResources NO-SOURCE
22-Jun-2019 16:05:42 > Task :spring-core-coroutines:classes UP-TO-DATE
22-Jun-2019 16:05:42 > Task :spring-core-coroutines:inspectClassesForKotlinIC
22-Jun-2019 16:05:42 > Task :spring-core-coroutines:jar
22-Jun-2019 16:05:42 > Task :spring-jcl:compileKotlin
22-Jun-2019 16:05:43 > Task :spring-jcl:compileJava
22-Jun-2019 16:05:43 > Task :spring-jcl:processResources
22-Jun-2019 16:05:43 > Task :spring-jcl:classes
22-Jun-2019 16:05:43 > Task :spring-jcl:inspectClassesForKotlinIC
22-Jun-2019 16:05:43 > Task :spring-jcl:jar
22-Jun-2019 16:05:44 > Task :spring-core:compileKotlin
22-Jun-2019 16:05:47 > Task :spring-core:compileJava
22-Jun-2019 16:05:47 > Task :spring-core:processResources NO-SOURCE
22-Jun-2019 16:05:47 > Task :spring-core:classes
22-Jun-2019 16:05:47 > Task :spring-core:inspectClassesForKotlinIC
22-Jun-2019 16:05:48 > Task :spring-core:jar
22-Jun-2019 16:05:51 > Task :spring-beans:compileGroovy
22-Jun-2019 16:05:52 > Task :spring-beans:compileKotlin
22-Jun-2019 16:05:52 > Task :spring-beans:compileJava NO-SOURCE
22-Jun-2019 16:05:52 > Task :spring-beans:processResources
22-Jun-2019 16:05:52 > Task :spring-beans:classes
22-Jun-2019 16:05:52 > Task :spring-beans:inspectClassesForKotlinIC
22-Jun-2019 16:05:52 > Task :spring-beans:jar
22-Jun-2019 16:05:52 > Task :spring-aop:compileKotlin
22-Jun-2019 16:05:53 > Task :spring-aop:compileJava
22-Jun-2019 16:05:53 > Task :spring-aop:processResources
22-Jun-2019 16:05:53 > Task :spring-aop:classes
22-Jun-2019 16:05:53 > Task :spring-core-coroutines:compileTestKotlin NO-SOURCE
22-Jun-2019 16:05:53 > Task :spring-core-coroutines:compileTestJava NO-SOURCE
22-Jun-2019 16:05:53 > Task :spring-core-coroutines:processTestResources NO-SOURCE
22-Jun-2019 16:05:53 > Task :spring-core-coroutines:testClasses UP-TO-DATE
22-Jun-2019 16:05:53 > Task :spring-jcl:compileTestKotlin NO-SOURCE
22-Jun-2019 16:05:53 > Task :spring-jcl:compileTestJava NO-SOURCE
22-Jun-2019 16:05:53 > Task :spring-jcl:processTestResources NO-SOURCE
22-Jun-2019 16:05:53 > Task :spring-jcl:testClasses UP-TO-DATE
22-Jun-2019 16:05:55 > Task :spring-core:compileTestKotlin
22-Jun-2019 16:06:01 > Task :spring-core:compileTestJava
22-Jun-2019 16:06:01 > Task :spring-core:processTestResources
22-Jun-2019 16:06:01 > Task :spring-core:testClasses
22-Jun-2019 16:06:03 > Task :spring-beans:compileTestKotlin
22-Jun-2019 16:06:05 Note: Some input files use unchecked or unsafe operations.
22-Jun-2019 16:06:05
22-Jun-2019 16:06:05 Note: Recompile with -Xlint:unchecked for details.
22-Jun-2019 16:06:05 > Task :spring-beans:compileTestJava
22-Jun-2019 16:06:06
22-Jun-2019 16:06:06 > Task :spring-beans:compileTestGroovy NO-SOURCE
22-Jun-2019 16:06:06 > Task :spring-beans:processTestResources
22-Jun-2019 16:06:06 > Task :spring-beans:testClasses
22-Jun-2019 16:06:06 > Task :spring-aop:compileTestKotlin
22-Jun-2019 16:06:06 > Task :spring-aop:inspectClassesForKotlinIC
22-Jun-2019 16:06:06 > Task :spring-aop:jar
22-Jun-2019 16:06:07 > Task :spring-aop:compileTestJava
22-Jun-2019 16:06:07 > Task :spring-aop:processTestResources
22-Jun-2019 16:06:07 > Task :spring-aop:testClasses
22-Jun-2019 16:06:07 > Task :spring-expression:compileKotlin
22-Jun-2019 16:06:07 > Task :spring-expression:compileJava
22-Jun-2019 16:06:07 > Task :spring-expression:processResources
22-Jun-2019 16:06:07 > Task :spring-expression:classes
22-Jun-2019 16:06:07 > Task :spring-expression:inspectClassesForKotlinIC
22-Jun-2019 16:06:07 > Task :spring-expression:jar
22-Jun-2019 16:06:07 > Task :spring-instrument:compileKotlin
22-Jun-2019 16:06:07 > Task :spring-instrument:compileJava
22-Jun-2019 16:06:07 > Task :spring-instrument:processResources NO-SOURCE
22-Jun-2019 16:06:07 > Task :spring-instrument:classes
22-Jun-2019 16:06:07 > Task :spring-instrument:inspectClassesForKotlinIC
22-Jun-2019 16:06:07 > Task :spring-instrument:jar
22-Jun-2019 16:06:13 > Task :spring-context:compileKotlin
22-Jun-2019 16:06:14 > Task :spring-context:compileJava
22-Jun-2019 16:06:14 > Task :spring-context:compileGroovy NO-SOURCE
22-Jun-2019 16:06:14 > Task :spring-context:processResources
22-Jun-2019 16:06:14 > Task :spring-context:classes
22-Jun-2019 16:06:14 > Task :spring-expression:compileTestKotlin
22-Jun-2019 16:06:17 > Task :spring-expression:compileTestJava
22-Jun-2019 16:06:17 > Task :spring-expression:processTestResources
22-Jun-2019 16:06:17 > Task :spring-expression:testClasses
22-Jun-2019 16:06:17 > Task :spring-instrument:compileTestKotlin NO-SOURCE
22-Jun-2019 16:06:17 > Task :spring-instrument:compileTestJava NO-SOURCE
22-Jun-2019 16:06:17 > Task :spring-instrument:processTestResources
22-Jun-2019 16:06:17 > Task :spring-instrument:testClasses
22-Jun-2019 16:06:18 > Task :spring-context:compileTestKotlin
22-Jun-2019 16:06:18 > Task :spring-context:inspectClassesForKotlinIC
22-Jun-2019 16:06:19 > Task :spring-context:jar
22-Jun-2019 16:06:23
22-Jun-2019 16:06:23 Note: Some input files use or override a deprecated API.
22-Jun-2019 16:06:23 > Task :spring-context:compileTestJava
22-Jun-2019 16:06:23 Note: Recompile with -Xlint:deprecation for details.
22-Jun-2019 16:06:23 Note: Some input files use unchecked or unsafe operations.
22-Jun-2019 16:06:23 Note: Recompile with -Xlint:unchecked for details.
22-Jun-2019 16:06:24
22-Jun-2019 16:06:24 > Task :spring-context:compileTestGroovy
22-Jun-2019 16:06:24 > Task :spring-context:processTestResources
22-Jun-2019 16:06:24 > Task :spring-context:testClasses
22-Jun-2019 16:06:24 > Task :spring-tx:compileKotlin
22-Jun-2019 16:06:25 > Task :spring-tx:compileJava
22-Jun-2019 16:06:25 > Task :spring-tx:processResources
22-Jun-2019 16:06:25 > Task :spring-tx:classes
22-Jun-2019 16:06:25 > Task :spring-tx:inspectClassesForKotlinIC
22-Jun-2019 16:06:25 > Task :spring-tx:jar
22-Jun-2019 16:06:26 > Task :spring-jdbc:compileKotlin
22-Jun-2019 16:06:26 > Task :spring-jdbc:compileJava
22-Jun-2019 16:06:26 > Task :spring-jdbc:processResources
22-Jun-2019 16:06:26 > Task :spring-jdbc:classes
22-Jun-2019 16:06:26 > Task :spring-tx:compileTestKotlin
22-Jun-2019 16:06:42 > Task :spring-tx:compileTestJava
22-Jun-2019 16:06:42 > Task :spring-tx:processTestResources
22-Jun-2019 16:06:42 > Task :spring-tx:testClasses
22-Jun-2019 16:06:43 > Task :spring-jdbc:compileTestKotlin
22-Jun-2019 16:06:43 > Task :spring-jdbc:inspectClassesForKotlinIC
22-Jun-2019 16:06:43 > Task :spring-jdbc:jar
22-Jun-2019 16:06:44 > Task :spring-jdbc:compileTestJava
22-Jun-2019 16:06:44 > Task :spring-jdbc:processTestResources
22-Jun-2019 16:06:44 > Task :spring-jdbc:testClasses
22-Jun-2019 16:06:44 > Task :spring-oxm:compileKotlin
22-Jun-2019 16:06:44 > Task :spring-oxm:compileJava
22-Jun-2019 16:06:44 > Task :spring-oxm:processResources
22-Jun-2019 16:06:44 > Task :spring-oxm:classes
22-Jun-2019 16:06:44 > Task :spring-oxm:inspectClassesForKotlinIC
22-Jun-2019 16:06:44 > Task :spring-oxm:jar
22-Jun-2019 16:06:46 > Task :spring-web:compileKotlin
22-Jun-2019 16:06:49 > Task :spring-web:compileJava
22-Jun-2019 16:06:49 > Task :spring-web:processResources
22-Jun-2019 16:06:49 > Task :spring-web:classes
22-Jun-2019 16:06:49 > Task :spring-web:inspectClassesForKotlinIC
22-Jun-2019 16:06:49 > Task :spring-web:jar
22-Jun-2019 16:06:49 > Task :spring-orm:compileKotlin
22-Jun-2019 16:06:50 > Task :spring-orm:compileJava
22-Jun-2019 16:06:50 > Task :spring-orm:processResources NO-SOURCE
22-Jun-2019 16:06:50 > Task :spring-orm:classes
22-Jun-2019 16:06:50
22-Jun-2019 16:06:50 > Task :spring-oxm:genJaxb
22-Jun-2019 16:06:50 [ant:javac] : warning: 'includeantruntime' was not set, defaulting to build.sysclasspath=last; set to false for repeatable builds
22-Jun-2019 16:06:51
22-Jun-2019 16:06:51 > Task :spring-oxm:compileTestKotlin
22-Jun-2019 16:06:51 > Task :spring-oxm:compileTestJava
22-Jun-2019 16:06:51 > Task :spring-oxm:processTestResources
22-Jun-2019 16:06:51 > Task :spring-oxm:testClasses
22-Jun-2019 16:06:54 > Task :spring-web:compileTestKotlin
22-Jun-2019 16:06:57 > Task :spring-web:compileTestJava
22-Jun-2019 16:06:57 > Task :spring-web:processTestResources
22-Jun-2019 16:06:57 > Task :spring-web:testClasses
22-Jun-2019 16:06:57 > Task :spring-orm:compileTestKotlin
22-Jun-2019 16:06:57 > Task :spring-orm:inspectClassesForKotlinIC
22-Jun-2019 16:06:57 > Task :spring-orm:jar
22-Jun-2019 16:06:58 > Task :spring-orm:compileTestJava
22-Jun-2019 16:06:58 > Task :spring-orm:processTestResources
22-Jun-2019 16:06:58 > Task :spring-orm:testClasses
22-Jun-2019 16:06:58 > Task :spring-context-support:compileKotlin
22-Jun-2019 16:06:59 > Task :spring-context-support:compileJava
22-Jun-2019 16:06:59 > Task :spring-context-support:processResources
22-Jun-2019 16:06:59 > Task :spring-context-support:classes
22-Jun-2019 16:06:59 > Task :spring-context-support:compileTestKotlin
22-Jun-2019 16:06:59 > Task :spring-context-support:inspectClassesForKotlinIC
22-Jun-2019 16:06:59 > Task :spring-context-support:jar
22-Jun-2019 16:07:00 > Task :spring-context-support:compileTestJava
22-Jun-2019 16:07:00 > Task :spring-context-support:processTestResources
22-Jun-2019 16:07:00 > Task :spring-context-support:testClasses
22-Jun-2019 16:07:02 > Task :spring-webflux:compileKotlin
22-Jun-2019 16:07:03 > Task :spring-webflux:compileJava
22-Jun-2019 16:07:03 > Task :spring-webflux:processResources
22-Jun-2019 16:07:03 > Task :spring-webflux:classes
22-Jun-2019 16:07:03 > Task :spring-webflux:inspectClassesForKotlinIC
22-Jun-2019 16:07:03 > Task :spring-webflux:jar
22-Jun-2019 16:07:05 > Task :spring-webmvc:compileKotlin
22-Jun-2019 16:07:06 > Task :spring-webmvc:compileJava
22-Jun-2019 16:07:06 > Task :spring-webmvc:processResources
22-Jun-2019 16:07:06 > Task :spring-webmvc:classes
22-Jun-2019 16:07:06 > Task :spring-webmvc:inspectClassesForKotlinIC
22-Jun-2019 16:07:06 > Task :spring-webmvc:jar
22-Jun-2019 16:07:06 > Task :spring-messaging:compileKotlin
22-Jun-2019 16:07:07 > Task :spring-messaging:compileJava
22-Jun-2019 16:07:07 > Task :spring-messaging:processResources NO-SOURCE
22-Jun-2019 16:07:07 > Task :spring-messaging:classes
22-Jun-2019 16:07:07 > Task :spring-messaging:inspectClassesForKotlinIC
22-Jun-2019 16:07:07 > Task :spring-messaging:jar
22-Jun-2019 16:07:07 > Task :spring-websocket:compileKotlin
22-Jun-2019 16:07:08 > Task :spring-websocket:compileJava
22-Jun-2019 16:07:08 > Task :spring-websocket:processResources
22-Jun-2019 16:07:08 > Task :spring-websocket:classes
22-Jun-2019 16:07:08 > Task :spring-websocket:inspectClassesForKotlinIC
22-Jun-2019 16:07:08 > Task :spring-websocket:jar
22-Jun-2019 16:07:10 > Task :spring-test:compileKotlin
22-Jun-2019 16:07:11 > Task :spring-test:compileJava
22-Jun-2019 16:07:11 > Task :spring-test:processResources
22-Jun-2019 16:07:11 > Task :spring-test:classes
22-Jun-2019 16:07:13 > Task :spring-webflux:compileTestKotlin
22-Jun-2019 16:07:15 > Task :spring-webflux:compileTestJava
22-Jun-2019 16:07:15 > Task :spring-webflux:processTestResources
22-Jun-2019 16:07:15 > Task :spring-webflux:testClasses
22-Jun-2019 16:07:16 > Task :spring-webmvc:compileTestKotlin
22-Jun-2019 16:07:20 > Task :spring-webmvc:compileTestJava
22-Jun-2019 16:07:20 > Task :spring-webmvc:processTestResources
22-Jun-2019 16:07:20 > Task :spring-webmvc:testClasses
22-Jun-2019 16:07:21
22-Jun-2019 16:07:21 > Task :spring-messaging:compileTestKotlin
22-Jun-2019 16:07:21 w: /opt/bamboo-home/xml-data/build-dir/SPR-PUB-JOB1/spring-messaging/src/test/kotlin/org/springframework/messaging/rsocket/RSocketClientToServerCoroutinesIntegrationTests.kt: (202, 7): 'addServerPlugin(RSocketInterceptor!): RSocketFactory.ServerRSocketFactory!' is deprecated. Deprecated in Java
22-Jun-2019 16:07:23
22-Jun-2019 16:07:23 > Task :spring-messaging:compileTestJava
22-Jun-2019 16:07:23 > Task :spring-messaging:processTestResources
22-Jun-2019 16:07:23 > Task :spring-messaging:testClasses
22-Jun-2019 16:07:23 > Task :spring-websocket:compileTestKotlin
22-Jun-2019 16:07:24 > Task :spring-websocket:compileTestJava
22-Jun-2019 16:07:24 > Task :spring-websocket:processTestResources
22-Jun-2019 16:07:24 > Task :spring-websocket:testClasses
22-Jun-2019 16:07:25 > Task :spring-test:compileTestKotlin
22-Jun-2019 16:07:25 > Task :spring-test:inspectClassesForKotlinIC
22-Jun-2019 16:07:25 > Task :spring-test:jar
22-Jun-2019 16:07:27 > Task :spring-test:compileTestJava
22-Jun-2019 16:07:27 > Task :spring-test:processTestResources
22-Jun-2019 16:07:27 > Task :spring-test:testClasses
22-Jun-2019 16:07:28 > Task :compileTestKotlin
22-Jun-2019 16:07:28 > Task :compileTestJava
22-Jun-2019 16:07:28 > Task :compileTestGroovy NO-SOURCE
22-Jun-2019 16:07:28 > Task :processTestResources
22-Jun-2019 16:07:28 > Task :testClasses
22-Jun-2019 16:07:30 > Task :checkstyleTest
22-Jun-2019 16:07:34 > Task :test
22-Jun-2019 16:07:34 > Task :check
22-Jun-2019 16:07:37 > Task :spring-aop:checkstyleMain
22-Jun-2019 16:07:38 > Task :spring-aop:checkstyleTest
22-Jun-2019 16:07:41 > Task :spring-aop:test
22-Jun-2019 16:07:41 > Task :spring-aop:check
22-Jun-2019 16:07:41 > Task :spring-aspects:compileKotlin
22-Jun-2019 16:07:43 > Task :spring-aspects:compileJava
22-Jun-2019 16:07:43 > Task :spring-aspects:processResources
22-Jun-2019 16:07:43 > Task :spring-aspects:classes
22-Jun-2019 16:07:43 > Task :spring-aspects:checkstyleMain
22-Jun-2019 16:07:43 > Task :spring-aspects:compileTestKotlin
22-Jun-2019 16:07:43 > Task :spring-aspects:inspectClassesForKotlinIC
22-Jun-2019 16:07:43 > Task :spring-aspects:jar
22-Jun-2019 16:07:45 > Task :spring-aspects:compileTestJava
22-Jun-2019 16:07:45 > Task :spring-aspects:processTestResources
22-Jun-2019 16:07:45 > Task :spring-aspects:testClasses
22-Jun-2019 16:07:45 > Task :spring-aspects:checkstyleTest
22-Jun-2019 16:07:49 > Task :spring-aspects:test
22-Jun-2019 16:07:49 > Task :spring-aspects:check
22-Jun-2019 16:07:52 > Task :spring-beans:checkstyleMain
22-Jun-2019 16:07:53 > Task :spring-beans:checkstyleTest
22-Jun-2019 16:08:02 > Task :spring-beans:test
22-Jun-2019 16:08:02 > Task :spring-beans:check
22-Jun-2019 16:08:02 > Task :spring-build-src:compileKotlin NO-SOURCE
22-Jun-2019 16:08:02 > Task :spring-build-src:compileJava NO-SOURCE
22-Jun-2019 16:08:02 > Task :spring-build-src:compileGroovy
22-Jun-2019 16:08:02 > Task :spring-build-src:processResources
22-Jun-2019 16:08:02 > Task :spring-build-src:classes
22-Jun-2019 16:08:02 > Task :spring-build-src:checkstyleMain NO-SOURCE
22-Jun-2019 16:08:02 > Task :spring-build-src:compileTestKotlin NO-SOURCE
22-Jun-2019 16:08:02 > Task :spring-build-src:compileTestJava NO-SOURCE
22-Jun-2019 16:08:02 > Task :spring-build-src:compileTestGroovy NO-SOURCE
22-Jun-2019 16:08:02 > Task :spring-build-src:processTestResources NO-SOURCE
22-Jun-2019 16:08:02 > Task :spring-build-src:testClasses UP-TO-DATE
22-Jun-2019 16:08:02 > Task :spring-build-src:checkstyleTest NO-SOURCE
22-Jun-2019 16:08:02 > Task :spring-build-src:test NO-SOURCE
22-Jun-2019 16:08:02 > Task :spring-build-src:check UP-TO-DATE
22-Jun-2019 16:08:06 > Task :spring-context:checkstyleMain
22-Jun-2019 16:08:10 > Task :spring-context:checkstyleTest
22-Jun-2019 16:08:40 > Task :spring-context:test
22-Jun-2019 16:08:42 > Task :spring-context:check
22-Jun-2019 16:08:42 > Task :spring-context-indexer:compileKotlin
22-Jun-2019 16:08:42 > Task :spring-context-indexer:compileJava
22-Jun-2019 16:08:42 > Task :spring-context-indexer:processResources
22-Jun-2019 16:08:42 > Task :spring-context-indexer:classes
22-Jun-2019 16:08:42 > Task :spring-context-indexer:checkstyleMain
22-Jun-2019 16:08:42 > Task :spring-context-indexer:compileTestKotlin
22-Jun-2019 16:08:42 > Task :spring-context-indexer:compileTestJava
22-Jun-2019 16:08:42 > Task :spring-context-indexer:processTestResources NO-SOURCE
22-Jun-2019 16:08:42 > Task :spring-context-indexer:testClasses
22-Jun-2019 16:08:43 > Task :spring-context-indexer:checkstyleTest
22-Jun-2019 16:08:45 > Task :spring-context-indexer:test
22-Jun-2019 16:08:45 > Task :spring-context-indexer:check
22-Jun-2019 16:08:45 > Task :spring-context-support:checkstyleMain
22-Jun-2019 16:08:46 > Task :spring-context-support:checkstyleTest
22-Jun-2019 16:08:55 > Task :spring-context-support:test
22-Jun-2019 16:08:55 > Task :spring-context-support:check
22-Jun-2019 16:09:00 > Task :spring-core:checkstyleMain
22-Jun-2019 16:09:02 > Task :spring-core:checkstyleTest
22-Jun-2019 16:09:14 > Task :spring-core:test
22-Jun-2019 16:09:14 > Task :spring-core:check
22-Jun-2019 16:09:14 > Task :spring-core-coroutines:checkstyleMain NO-SOURCE
22-Jun-2019 16:09:14 > Task :spring-core-coroutines:checkstyleTest NO-SOURCE
22-Jun-2019 16:09:14 > Task :spring-core-coroutines:test NO-SOURCE
22-Jun-2019 16:09:14 > Task :spring-core-coroutines:check UP-TO-DATE
22-Jun-2019 16:09:15 > Task :spring-expression:checkstyleMain
22-Jun-2019 16:09:16 > Task :spring-expression:checkstyleTest
22-Jun-2019 16:09:18 > Task :spring-expression:test
22-Jun-2019 16:09:18 > Task :spring-expression:check
22-Jun-2019 16:09:18 > Task :spring-framework-bom:compileKotlin NO-SOURCE
22-Jun-2019 16:09:18 > Task :spring-framework-bom:compileJava NO-SOURCE
22-Jun-2019 16:09:18 > Task :spring-framework-bom:processResources NO-SOURCE
22-Jun-2019 16:09:18 > Task :spring-framework-bom:classes UP-TO-DATE
22-Jun-2019 16:09:18 > Task :spring-framework-bom:checkstyleMain NO-SOURCE
22-Jun-2019 16:09:18 > Task :spring-framework-bom:compileTestKotlin NO-SOURCE
22-Jun-2019 16:09:18 > Task :spring-framework-bom:compileTestJava NO-SOURCE
22-Jun-2019 16:09:18 > Task :spring-framework-bom:processTestResources NO-SOURCE
22-Jun-2019 16:09:18 > Task :spring-framework-bom:testClasses UP-TO-DATE
22-Jun-2019 16:09:18 > Task :spring-framework-bom:checkstyleTest NO-SOURCE
22-Jun-2019 16:09:18 > Task :spring-framework-bom:test NO-SOURCE
22-Jun-2019 16:09:18 > Task :spring-framework-bom:check UP-TO-DATE
22-Jun-2019 16:09:18 > Task :spring-instrument:checkstyleMain
22-Jun-2019 16:09:18 > Task :spring-instrument:checkstyleTest NO-SOURCE
22-Jun-2019 16:09:18 > Task :spring-instrument:test NO-SOURCE
22-Jun-2019 16:09:18 > Task :spring-instrument:check
22-Jun-2019 16:09:18 > Task :spring-jcl:checkstyleMain
22-Jun-2019 16:09:18 > Task :spring-jcl:checkstyleTest NO-SOURCE
22-Jun-2019 16:09:18 > Task :spring-jcl:test NO-SOURCE
22-Jun-2019 16:09:18 > Task :spring-jcl:check
22-Jun-2019 16:09:20 > Task :spring-jdbc:checkstyleMain
22-Jun-2019 16:09:21 > Task :spring-jdbc:checkstyleTest
22-Jun-2019 16:09:30 > Task :spring-jdbc:test
22-Jun-2019 16:09:30 > Task :spring-jdbc:check
22-Jun-2019 16:09:30 > Task :spring-jms:compileKotlin
22-Jun-2019 16:09:30 > Task :spring-jms:compileJava
22-Jun-2019 16:09:30 > Task :spring-jms:processResources
22-Jun-2019 16:09:30 > Task :spring-jms:classes
22-Jun-2019 16:09:31 > Task :spring-jms:checkstyleMain
22-Jun-2019 16:09:31 > Task :spring-jms:compileTestKotlin
22-Jun-2019 16:09:32 > Task :spring-jms:compileTestJava
22-Jun-2019 16:09:32 > Task :spring-jms:processTestResources
22-Jun-2019 16:09:32 > Task :spring-jms:testClasses
22-Jun-2019 16:09:33 > Task :spring-jms:checkstyleTest
22-Jun-2019 16:09:37 > Task :spring-jms:test
22-Jun-2019 16:09:37 > Task :spring-jms:check
22-Jun-2019 16:09:38 > Task :spring-messaging:checkstyleMain
22-Jun-2019 16:09:39 > Task :spring-messaging:checkstyleTest
22-Jun-2019 16:10:09 > Task :spring-messaging:test
22-Jun-2019 16:10:25 > Task :spring-messaging:check
22-Jun-2019 16:10:26 > Task :spring-orm:checkstyleMain
22-Jun-2019 16:10:26 > Task :spring-orm:checkstyleTest
22-Jun-2019 16:10:32 > Task :spring-orm:test
22-Jun-2019 16:10:32 > Task :spring-orm:check
22-Jun-2019 16:10:33 > Task :spring-oxm:checkstyleMain
22-Jun-2019 16:10:33 > Task :spring-oxm:checkstyleTest
22-Jun-2019 16:10:36 > Task :spring-oxm:test
22-Jun-2019 16:10:36 > Task :spring-oxm:check
22-Jun-2019 16:10:46 > Task :spring-test:testJUnitJupiter
22-Jun-2019 16:10:52 > Task :spring-test:testNG
22-Jun-2019 16:11:22 > Task :spring-test:test
22-Jun-2019 16:11:26 > Task :spring-test:aggregateTestReports
22-Jun-2019 16:11:29 > Task :spring-test:checkstyleMain
22-Jun-2019 16:11:31 > Task :spring-test:checkstyleTest
22-Jun-2019 16:11:31 > Task :spring-test:check
22-Jun-2019 16:11:32 > Task :spring-tx:checkstyleMain
22-Jun-2019 16:11:33 > Task :spring-tx:checkstyleTest
22-Jun-2019 16:11:37 > Task :spring-tx:test
22-Jun-2019 16:11:37 > Task :spring-tx:check
22-Jun-2019 16:11:41 > Task :spring-web:checkstyleMain
22-Jun-2019 16:11:44 > Task :spring-web:checkstyleTest
22-Jun-2019 16:12:05 > Task :spring-web:test
22-Jun-2019 16:12:05 > Task :spring-web:check
22-Jun-2019 16:12:06 > Task :spring-webflux:checkstyleMain
22-Jun-2019 16:12:08 > Task :spring-webflux:checkstyleTest
22-Jun-2019 16:12:30
22-Jun-2019 16:12:30 > Task :spring-webflux:test
22-Jun-2019 16:12:30
22-Jun-2019 16:12:30 org.springframework.web.reactive.result.method.annotation.MultipartIntegrationTests > transferTo[server [org.springframework.http.server.reactive.bootstrap.UndertowHttpServer@5874adc4]] FAILED
22-Jun-2019 16:12:30     org.junit.ComparisonFailure at MultipartIntegrationTests.java:173
22-Jun-2019 16:13:41
22-Jun-2019 16:13:41 1752 tests completed, 1 failed, 18 skipped
22-Jun-2019 16:13:41
22-Jun-2019 16:13:41 > Task :spring-webflux:test FAILED
22-Jun-2019 16:13:41
22-Jun-2019 16:13:41 Deprecated Gradle features were used in this build, making it incompatible with Gradle 6.0.
22-Jun-2019 16:13:41 Use '--warning-mode all' to show the individual deprecation warnings.
22-Jun-2019 16:13:41 See https://docs.gradle.org/5.4.1/userguide/command_line_interface.html#sec:command_line_warnings
22-Jun-2019 16:13:41 249 actionable tasks: 225 executed, 24 up-to-date
22-Jun-2019 16:13:41
22-Jun-2019 16:13:41 FAILURE: Build failed with an exception.
22-Jun-2019 16:13:41
22-Jun-2019 16:13:41 * What went wrong:
22-Jun-2019 16:13:41 Execution failed for task ':spring-webflux:test'.
22-Jun-2019 16:13:41 > There were failing tests. See the report at: file:///opt/bamboo-home/xml-data/build-dir/SPR-PUB-JOB1/spring-webflux/build/reports/tests/test/index.html
22-Jun-2019 16:13:41
22-Jun-2019 16:13:41 * Try:
22-Jun-2019 16:13:41 Run with --info or --debug option to get more log output. Run with --scan to get full insights.
22-Jun-2019 16:13:41
22-Jun-2019 16:13:41 * Exception is:
22-Jun-2019 16:13:41 org.gradle.api.tasks.TaskExecutionException: Execution failed for task ':spring-webflux:test'.
22-Jun-2019 16:13:41         at org.gradle.api.internal.tasks.execution.ExecuteActionsTaskExecuter$3.accept(ExecuteActionsTaskExecuter.java:151)
22-Jun-2019 16:13:41         at org.gradle.api.internal.tasks.execution.ExecuteActionsTaskExecuter$3.accept(ExecuteActionsTaskExecuter.java:148)
22-Jun-2019 16:13:41         at org.gradle.internal.Try$Failure.ifSuccessfulOrElse(Try.java:191)
22-Jun-2019 16:13:41         at org.gradle.api.internal.tasks.execution.ExecuteActionsTaskExecuter.execute(ExecuteActionsTaskExecuter.java:141)
22-Jun-2019 16:13:41         at org.gradle.api.internal.tasks.execution.ResolveBeforeExecutionStateTaskExecuter.execute(ResolveBeforeExecutionStateTaskExecuter.java:75)
22-Jun-2019 16:13:41         at org.gradle.api.internal.tasks.execution.ValidatingTaskExecuter.execute(ValidatingTaskExecuter.java:62)
22-Jun-2019 16:13:41         at org.gradle.api.internal.tasks.execution.SkipEmptySourceFilesTaskExecuter.execute(SkipEmptySourceFilesTaskExecuter.java:108)
22-Jun-2019 16:13:41         at org.gradle.api.internal.tasks.execution.ResolveBeforeExecutionOutputsTaskExecuter.execute(ResolveBeforeExecutionOutputsTaskExecuter.java:67)
22-Jun-2019 16:13:41         at org.gradle.api.internal.tasks.execution.ResolveAfterPreviousExecutionStateTaskExecuter.execute(ResolveAfterPreviousExecutionStateTaskExecuter.java:46)
22-Jun-2019 16:13:41         at org.gradle.api.internal.tasks.execution.CleanupStaleOutputsExecuter.execute(CleanupStaleOutputsExecuter.java:94)
22-Jun-2019 16:13:41         at org.gradle.api.internal.tasks.execution.FinalizePropertiesTaskExecuter.execute(FinalizePropertiesTaskExecuter.java:46)
22-Jun-2019 16:13:41         at org.gradle.api.internal.tasks.execution.ResolveTaskExecutionModeExecuter.execute(ResolveTaskExecutionModeExecuter.java:95)
22-Jun-2019 16:13:41         at org.gradle.api.internal.tasks.execution.SkipTaskWithNoActionsExecuter.execute(SkipTaskWithNoActionsExecuter.java:57)
22-Jun-2019 16:13:41         at org.gradle.api.internal.tasks.execution.SkipOnlyIfTaskExecuter.execute(SkipOnlyIfTaskExecuter.java:56)
22-Jun-2019 16:13:41         at org.gradle.api.internal.tasks.execution.CatchExceptionTaskExecuter.execute(CatchExceptionTaskExecuter.java:36)
22-Jun-2019 16:13:41         at org.gradle.api.internal.tasks.execution.EventFiringTaskExecuter$1.executeTask(EventFiringTaskExecuter.java:73)
22-Jun-2019 16:13:41         at org.gradle.api.internal.tasks.execution.EventFiringTaskExecuter$1.call(EventFiringTaskExecuter.java:52)
22-Jun-2019 16:13:41         at org.gradle.api.internal.tasks.execution.EventFiringTaskExecuter$1.call(EventFiringTaskExecuter.java:49)
22-Jun-2019 16:13:41         at org.gradle.internal.operations.DefaultBuildOperationExecutor$CallableBuildOperationWorker.execute(DefaultBuildOperationExecutor.java:416)
22-Jun-2019 16:13:41         at org.gradle.internal.operations.DefaultBuildOperationExecutor$CallableBuildOperationWorker.execute(DefaultBuildOperationExecutor.java:406)
22-Jun-2019 16:13:41         at org.gradle.internal.operations.DefaultBuildOperationExecutor$1.execute(DefaultBuildOperationExecutor.java:165)
22-Jun-2019 16:13:41         at org.gradle.internal.operations.DefaultBuildOperationExecutor.execute(DefaultBuildOperationExecutor.java:250)
22-Jun-2019 16:13:41         at org.gradle.internal.operations.DefaultBuildOperationExecutor.execute(DefaultBuildOperationExecutor.java:158)
22-Jun-2019 16:13:41         at org.gradle.internal.operations.DefaultBuildOperationExecutor.call(DefaultBuildOperationExecutor.java:102)
22-Jun-2019 16:13:41         at org.gradle.internal.operations.DelegatingBuildOperationExecutor.call(DelegatingBuildOperationExecutor.java:36)
22-Jun-2019 16:13:41         at org.gradle.api.internal.tasks.execution.EventFiringTaskExecuter.execute(EventFiringTaskExecuter.java:49)
22-Jun-2019 16:13:41         at org.gradle.execution.plan.LocalTaskNodeExecutor.execute(LocalTaskNodeExecutor.java:43)
22-Jun-2019 16:13:41         at org.gradle.execution.taskgraph.DefaultTaskExecutionGraph$InvokeNodeExecutorsAction.execute(DefaultTaskExecutionGraph.java:355)
22-Jun-2019 16:13:41         at org.gradle.execution.taskgraph.DefaultTaskExecutionGraph$InvokeNodeExecutorsAction.execute(DefaultTaskExecutionGraph.java:343)
22-Jun-2019 16:13:41         at org.gradle.execution.taskgraph.DefaultTaskExecutionGraph$BuildOperationAwareExecutionAction.execute(DefaultTaskExecutionGraph.java:336)
22-Jun-2019 16:13:41         at org.gradle.execution.taskgraph.DefaultTaskExecutionGraph$BuildOperationAwareExecutionAction.execute(DefaultTaskExecutionGraph.java:322)
22-Jun-2019 16:13:41         at org.gradle.execution.plan.DefaultPlanExecutor$ExecutorWorker$1.execute(DefaultPlanExecutor.java:134)
22-Jun-2019 16:13:41         at org.gradle.execution.plan.DefaultPlanExecutor$ExecutorWorker$1.execute(DefaultPlanExecutor.java:129)
22-Jun-2019 16:13:41         at org.gradle.execution.plan.DefaultPlanExecutor$ExecutorWorker.execute(DefaultPlanExecutor.java:202)
22-Jun-2019 16:13:41         at org.gradle.execution.plan.DefaultPlanExecutor$ExecutorWorker.executeNextNode(DefaultPlanExecutor.java:193)
22-Jun-2019 16:13:41         at org.gradle.execution.plan.DefaultPlanExecutor$ExecutorWorker.run(DefaultPlanExecutor.java:129)
22-Jun-2019 16:13:41         at org.gradle.execution.plan.DefaultPlanExecutor.process(DefaultPlanExecutor.java:74)
22-Jun-2019 16:13:41         at org.gradle.execution.taskgraph.DefaultTaskExecutionGraph.executeWithServices(DefaultTaskExecutionGraph.java:178)
22-Jun-2019 16:13:41         at org.gradle.execution.taskgraph.DefaultTaskExecutionGraph.execute(DefaultTaskExecutionGraph.java:154)
22-Jun-2019 16:13:41         at org.gradle.execution.SelectedTaskExecutionAction.execute(SelectedTaskExecutionAction.java:41)
22-Jun-2019 16:13:41         at org.gradle.execution.DefaultBuildExecuter.execute(DefaultBuildExecuter.java:40)
22-Jun-2019 16:13:41         at org.gradle.execution.DefaultBuildExecuter.access$000(DefaultBuildExecuter.java:24)
22-Jun-2019 16:13:41         at org.gradle.execution.DefaultBuildExecuter$1.proceed(DefaultBuildExecuter.java:46)
22-Jun-2019 16:13:41         at org.gradle.execution.DryRunBuildExecutionAction.execute(DryRunBuildExecutionAction.java:49)
22-Jun-2019 16:13:41         at org.gradle.execution.DefaultBuildExecuter.execute(DefaultBuildExecuter.java:40)
22-Jun-2019 16:13:41         at org.gradle.execution.DefaultBuildExecuter.execute(DefaultBuildExecuter.java:33)
22-Jun-2019 16:13:41         at org.gradle.initialization.DefaultGradleLauncher$ExecuteTasks.run(DefaultGradleLauncher.java:383)
22-Jun-2019 16:13:41         at org.gradle.internal.operations.DefaultBuildOperationExecutor$RunnableBuildOperationWorker.execute(DefaultBuildOperationExecutor.java:402)
22-Jun-2019 16:13:41         at org.gradle.internal.operations.DefaultBuildOperationExecutor$RunnableBuildOperationWorker.execute(DefaultBuildOperationExecutor.java:394)
22-Jun-2019 16:13:41         at org.gradle.internal.operations.DefaultBuildOperationExecutor$1.execute(DefaultBuildOperationExecutor.java:165)
22-Jun-2019 16:13:41         at org.gradle.internal.operations.DefaultBuildOperationExecutor.execute(DefaultBuildOperationExecutor.java:250)
22-Jun-2019 16:13:41         at org.gradle.internal.operations.DefaultBuildOperationExecutor.execute(DefaultBuildOperationExecutor.java:158)
22-Jun-2019 16:13:41         at org.gradle.internal.operations.DefaultBuildOperationExecutor.run(DefaultBuildOperationExecutor.java:92)
22-Jun-2019 16:13:41         at org.gradle.internal.operations.DelegatingBuildOperationExecutor.run(DelegatingBuildOperationExecutor.java:31)
22-Jun-2019 16:13:41         at org.gradle.initialization.DefaultGradleLauncher.runTasks(DefaultGradleLauncher.java:247)
22-Jun-2019 16:13:41         at org.gradle.initialization.DefaultGradleLauncher.doBuildStages(DefaultGradleLauncher.java:159)
22-Jun-2019 16:13:41         at org.gradle.initialization.DefaultGradleLauncher.executeTasks(DefaultGradleLauncher.java:134)
22-Jun-2019 16:13:41         at org.gradle.internal.invocation.GradleBuildController$1.execute(GradleBuildController.java:58)
22-Jun-2019 16:13:41         at org.gradle.internal.invocation.GradleBuildController$1.execute(GradleBuildController.java:55)
22-Jun-2019 16:13:41         at org.gradle.internal.invocation.GradleBuildController$3.create(GradleBuildController.java:82)
22-Jun-2019 16:13:41         at org.gradle.internal.invocation.GradleBuildController$3.create(GradleBuildController.java:75)
22-Jun-2019 16:13:41         at org.gradle.internal.work.DefaultWorkerLeaseService.withLocks(DefaultWorkerLeaseService.java:183)
22-Jun-2019 16:13:41         at org.gradle.internal.work.StopShieldingWorkerLeaseService.withLocks(StopShieldingWorkerLeaseService.java:40)
22-Jun-2019 16:13:41         at org.gradle.internal.invocation.GradleBuildController.doBuild(GradleBuildController.java:75)
22-Jun-2019 16:13:41         at org.gradle.internal.invocation.GradleBuildController.run(GradleBuildController.java:55)
22-Jun-2019 16:13:41         at org.gradle.tooling.internal.provider.ExecuteBuildActionRunner.run(ExecuteBuildActionRunner.java:31)
22-Jun-2019 16:13:41         at org.gradle.launcher.exec.ChainingBuildActionRunner.run(ChainingBuildActionRunner.java:35)
22-Jun-2019 16:13:41         at org.gradle.launcher.exec.BuildOutcomeReportingBuildActionRunner.run(BuildOutcomeReportingBuildActionRunner.java:58)
22-Jun-2019 16:13:41         at org.gradle.tooling.internal.provider.ValidatingBuildActionRunner.run(ValidatingBuildActionRunner.java:32)
22-Jun-2019 16:13:41         at org.gradle.launcher.exec.BuildCompletionNotifyingBuildActionRunner.run(BuildCompletionNotifyingBuildActionRunner.java:39)
22-Jun-2019 16:13:41         at org.gradle.launcher.exec.RunAsBuildOperationBuildActionRunner$3.call(RunAsBuildOperationBuildActionRunner.java:51)
22-Jun-2019 16:13:41         at org.gradle.launcher.exec.RunAsBuildOperationBuildActionRunner$3.call(RunAsBuildOperationBuildActionRunner.java:45)
22-Jun-2019 16:13:41         at org.gradle.internal.operations.DefaultBuildOperationExecutor$CallableBuildOperationWorker.execute(DefaultBuildOperationExecutor.java:416)
22-Jun-2019 16:13:41         at org.gradle.internal.operations.DefaultBuildOperationExecutor$CallableBuildOperationWorker.execute(DefaultBuildOperationExecutor.java:406)
22-Jun-2019 16:13:41         at org.gradle.internal.operations.DefaultBuildOperationExecutor$1.execute(DefaultBuildOperationExecutor.java:165)
22-Jun-2019 16:13:41         at org.gradle.internal.operations.DefaultBuildOperationExecutor.execute(DefaultBuildOperationExecutor.java:250)
22-Jun-2019 16:13:41         at org.gradle.internal.operations.DefaultBuildOperationExecutor.execute(DefaultBuildOperationExecutor.java:158)
22-Jun-2019 16:13:41         at org.gradle.internal.operations.DefaultBuildOperationExecutor.call(DefaultBuildOperationExecutor.java:102)
22-Jun-2019 16:13:41         at org.gradle.internal.operations.DelegatingBuildOperationExecutor.call(DelegatingBuildOperationExecutor.java:36)
22-Jun-2019 16:13:41         at org.gradle.launcher.exec.RunAsBuildOperationBuildActionRunner.run(RunAsBuildOperationBuildActionRunner.java:45)
22-Jun-2019 16:13:41         at org.gradle.launcher.exec.InProcessBuildActionExecuter$1.transform(InProcessBuildActionExecuter.java:49)
22-Jun-2019 16:13:41         at org.gradle.launcher.exec.InProcessBuildActionExecuter$1.transform(InProcessBuildActionExecuter.java:46)
22-Jun-2019 16:13:41         at org.gradle.composite.internal.DefaultRootBuildState.run(DefaultRootBuildState.java:78)
22-Jun-2019 16:13:41         at org.gradle.launcher.exec.InProcessBuildActionExecuter.execute(InProcessBuildActionExecuter.java:46)
22-Jun-2019 16:13:41         at org.gradle.launcher.exec.InProcessBuildActionExecuter.execute(InProcessBuildActionExecuter.java:31)
22-Jun-2019 16:13:41         at org.gradle.launcher.exec.BuildTreeScopeBuildActionExecuter.execute(BuildTreeScopeBuildActionExecuter.java:42)
22-Jun-2019 16:13:41         at org.gradle.launcher.exec.BuildTreeScopeBuildActionExecuter.execute(BuildTreeScopeBuildActionExecuter.java:28)
22-Jun-2019 16:13:41         at org.gradle.tooling.internal.provider.ContinuousBuildActionExecuter.execute(ContinuousBuildActionExecuter.java:78)
22-Jun-2019 16:13:41         at org.gradle.tooling.internal.provider.ContinuousBuildActionExecuter.execute(ContinuousBuildActionExecuter.java:52)
22-Jun-2019 16:13:41         at org.gradle.tooling.internal.provider.SubscribableBuildActionExecuter.execute(SubscribableBuildActionExecuter.java:59)
22-Jun-2019 16:13:41         at org.gradle.tooling.internal.provider.SubscribableBuildActionExecuter.execute(SubscribableBuildActionExecuter.java:36)
22-Jun-2019 16:13:41         at org.gradle.tooling.internal.provider.SessionScopeBuildActionExecuter.execute(SessionScopeBuildActionExecuter.java:68)
22-Jun-2019 16:13:41         at org.gradle.tooling.internal.provider.SessionScopeBuildActionExecuter.execute(SessionScopeBuildActionExecuter.java:38)
22-Jun-2019 16:13:41         at org.gradle.tooling.internal.provider.GradleThreadBuildActionExecuter.execute(GradleThreadBuildActionExecuter.java:37)
22-Jun-2019 16:13:41         at org.gradle.tooling.internal.provider.GradleThreadBuildActionExecuter.execute(GradleThreadBuildActionExecuter.java:26)
22-Jun-2019 16:13:41         at org.gradle.tooling.internal.provider.ParallelismConfigurationBuildActionExecuter.execute(ParallelismConfigurationBuildActionExecuter.java:43)
22-Jun-2019 16:13:41         at org.gradle.tooling.internal.provider.ParallelismConfigurationBuildActionExecuter.execute(ParallelismConfigurationBuildActionExecuter.java:29)
22-Jun-2019 16:13:41         at org.gradle.tooling.internal.provider.StartParamsValidatingActionExecuter.execute(StartParamsValidatingActionExecuter.java:60)
22-Jun-2019 16:13:41         at org.gradle.tooling.internal.provider.StartParamsValidatingActionExecuter.execute(StartParamsValidatingActionExecuter.java:32)
22-Jun-2019 16:13:41         at org.gradle.tooling.internal.provider.SessionFailureReportingActionExecuter.execute(SessionFailureReportingActionExecuter.java:55)
22-Jun-2019 16:13:41         at org.gradle.tooling.internal.provider.SessionFailureReportingActionExecuter.execute(SessionFailureReportingActionExecuter.java:41)
22-Jun-2019 16:13:41         at org.gradle.tooling.internal.provider.SetupLoggingActionExecuter.execute(SetupLoggingActionExecuter.java:48)
22-Jun-2019 16:13:41         at org.gradle.tooling.internal.provider.SetupLoggingActionExecuter.execute(SetupLoggingActionExecuter.java:32)
22-Jun-2019 16:13:41         at org.gradle.launcher.cli.RunBuildAction.run(RunBuildAction.java:55)
22-Jun-2019 16:13:41         at org.gradle.internal.Actions$RunnableActionAdapter.execute(Actions.java:208)
22-Jun-2019 16:13:41         at org.gradle.launcher.cli.CommandLineActionFactory$ParseAndBuildAction.execute(CommandLineActionFactory.java:394)
22-Jun-2019 16:13:41         at org.gradle.launcher.cli.CommandLineActionFactory$ParseAndBuildAction.execute(CommandLineActionFactory.java:367)
22-Jun-2019 16:13:41         at org.gradle.launcher.cli.ExceptionReportingAction.execute(ExceptionReportingAction.java:37)
22-Jun-2019 16:13:41         at org.gradle.launcher.cli.ExceptionReportingAction.execute(ExceptionReportingAction.java:23)
22-Jun-2019 16:13:41         at org.gradle.launcher.cli.CommandLineActionFactory$WithLogging.execute(CommandLineActionFactory.java:360)
22-Jun-2019 16:13:41         at org.gradle.launcher.cli.CommandLineActionFactory$WithLogging.execute(CommandLineActionFactory.java:292)
22-Jun-2019 16:13:41         at org.gradle.launcher.Main.doAction(Main.java:36)
22-Jun-2019 16:13:41         at org.gradle.launcher.bootstrap.EntryPoint.run(EntryPoint.java:45)
22-Jun-2019 16:13:41         at org.gradle.launcher.bootstrap.ProcessBootstrap.runNoExit(ProcessBootstrap.java:60)
22-Jun-2019 16:13:41         at org.gradle.launcher.bootstrap.ProcessBootstrap.run(ProcessBootstrap.java:37)
22-Jun-2019 16:13:41         at org.gradle.launcher.GradleMain.main(GradleMain.java:23)
22-Jun-2019 16:13:41         at org.gradle.wrapper.BootstrapMainStarter.start(BootstrapMainStarter.java:31)
22-Jun-2019 16:13:41         at org.gradle.wrapper.WrapperExecutor.execute(WrapperExecutor.java:108)
22-Jun-2019 16:13:41         at org.gradle.wrapper.GradleWrapperMain.main(GradleWrapperMain.java:63)
22-Jun-2019 16:13:41 Caused by: org.gradle.api.GradleException: There were failing tests. See the report at: file:///opt/bamboo-home/xml-data/build-dir/SPR-PUB-JOB1/spring-webflux/build/reports/tests/test/index.html
22-Jun-2019 16:13:41         at org.gradle.api.tasks.testing.AbstractTestTask.handleTestFailures(AbstractTestTask.java:626)
22-Jun-2019 16:13:41         at org.gradle.api.tasks.testing.AbstractTestTask.executeTests(AbstractTestTask.java:498)
22-Jun-2019 16:13:41         at org.gradle.api.tasks.testing.Test.executeTests(Test.java:594)
22-Jun-2019 16:13:41         at org.gradle.internal.reflect.JavaMethod.invoke(JavaMethod.java:103)
22-Jun-2019 16:13:41         at org.gradle.api.internal.project.taskfactory.StandardTaskAction.doExecute(StandardTaskAction.java:48)
22-Jun-2019 16:13:41         at org.gradle.api.internal.project.taskfactory.StandardTaskAction.execute(StandardTaskAction.java:41)
22-Jun-2019 16:13:41         at org.gradle.api.internal.project.taskfactory.StandardTaskAction.execute(StandardTaskAction.java:28)
22-Jun-2019 16:13:41         at org.gradle.api.internal.AbstractTask$TaskActionWrapper.execute(AbstractTask.java:702)
22-Jun-2019 16:13:41         at org.gradle.api.internal.AbstractTask$TaskActionWrapper.execute(AbstractTask.java:669)
22-Jun-2019 16:13:41         at org.gradle.api.internal.tasks.execution.ExecuteActionsTaskExecuter$5.run(ExecuteActionsTaskExecuter.java:404)
22-Jun-2019 16:13:41         at org.gradle.internal.operations.DefaultBuildOperationExecutor$RunnableBuildOperationWorker.execute(DefaultBuildOperationExecutor.java:402)
22-Jun-2019 16:13:41         at org.gradle.internal.operations.DefaultBuildOperationExecutor$RunnableBuildOperationWorker.execute(DefaultBuildOperationExecutor.java:394)
22-Jun-2019 16:13:41         at org.gradle.internal.operations.DefaultBuildOperationExecutor$1.execute(DefaultBuildOperationExecutor.java:165)
22-Jun-2019 16:13:41         at org.gradle.internal.operations.DefaultBuildOperationExecutor.execute(DefaultBuildOperationExecutor.java:250)
22-Jun-2019 16:13:41         at org.gradle.internal.operations.DefaultBuildOperationExecutor.execute(DefaultBuildOperationExecutor.java:158)
22-Jun-2019 16:13:41         at org.gradle.internal.operations.DefaultBuildOperationExecutor.run(DefaultBuildOperationExecutor.java:92)
22-Jun-2019 16:13:41         at org.gradle.internal.operations.DelegatingBuildOperationExecutor.run(DelegatingBuildOperationExecutor.java:31)
22-Jun-2019 16:13:41         at org.gradle.api.internal.tasks.execution.ExecuteActionsTaskExecuter.executeAction(ExecuteActionsTaskExecuter.java:393)
22-Jun-2019 16:13:41         at org.gradle.api.internal.tasks.execution.ExecuteActionsTaskExecuter.executeActions(ExecuteActionsTaskExecuter.java:376)
22-Jun-2019 16:13:41         at org.gradle.api.internal.tasks.execution.ExecuteActionsTaskExecuter.access$200(ExecuteActionsTaskExecuter.java:80)
22-Jun-2019 16:13:41         at org.gradle.api.internal.tasks.execution.ExecuteActionsTaskExecuter$TaskExecution.execute(ExecuteActionsTaskExecuter.java:213)
22-Jun-2019 16:13:41         at org.gradle.internal.execution.steps.ExecuteStep.lambda$execute$1(ExecuteStep.java:33)
22-Jun-2019 16:13:41         at org.gradle.internal.execution.steps.ExecuteStep.execute(ExecuteStep.java:33)
22-Jun-2019 16:13:41         at org.gradle.internal.execution.steps.ExecuteStep.execute(ExecuteStep.java:26)
22-Jun-2019 16:13:41         at org.gradle.internal.execution.steps.CleanupOutputsStep.execute(CleanupOutputsStep.java:58)
22-Jun-2019 16:13:41         at org.gradle.internal.execution.steps.CleanupOutputsStep.execute(CleanupOutputsStep.java:35)
22-Jun-2019 16:13:41         at org.gradle.internal.execution.steps.ResolveInputChangesStep.execute(ResolveInputChangesStep.java:48)
22-Jun-2019 16:13:41         at org.gradle.internal.execution.steps.ResolveInputChangesStep.execute(ResolveInputChangesStep.java:33)
22-Jun-2019 16:13:41         at org.gradle.internal.execution.steps.CancelExecutionStep.execute(CancelExecutionStep.java:39)
22-Jun-2019 16:13:41         at org.gradle.internal.execution.steps.TimeoutStep.executeWithoutTimeout(TimeoutStep.java:73)
22-Jun-2019 16:13:41         at org.gradle.internal.execution.steps.TimeoutStep.execute(TimeoutStep.java:54)
22-Jun-2019 16:13:41         at org.gradle.internal.execution.steps.CatchExceptionStep.execute(CatchExceptionStep.java:35)
22-Jun-2019 16:13:41         at org.gradle.internal.execution.steps.CreateOutputsStep.execute(CreateOutputsStep.java:51)
22-Jun-2019 16:13:41         at org.gradle.internal.execution.steps.SnapshotOutputsStep.execute(SnapshotOutputsStep.java:45)
22-Jun-2019 16:13:41         at org.gradle.internal.execution.steps.SnapshotOutputsStep.execute(SnapshotOutputsStep.java:31)
22-Jun-2019 16:13:41         at org.gradle.internal.execution.steps.CacheStep.executeWithoutCache(CacheStep.java:201)
22-Jun-2019 16:13:41         at org.gradle.internal.execution.steps.CacheStep.execute(CacheStep.java:70)
22-Jun-2019 16:13:41         at org.gradle.internal.execution.steps.CacheStep.execute(CacheStep.java:45)
22-Jun-2019 16:13:41         at org.gradle.internal.execution.steps.BroadcastChangingOutputsStep.execute(BroadcastChangingOutputsStep.java:49)
22-Jun-2019 16:13:41         at org.gradle.internal.execution.steps.StoreSnapshotsStep.execute(StoreSnapshotsStep.java:43)
22-Jun-2019 16:13:41         at org.gradle.internal.execution.steps.StoreSnapshotsStep.execute(StoreSnapshotsStep.java:32)
22-Jun-2019 16:13:41         at org.gradle.internal.execution.steps.RecordOutputsStep.execute(RecordOutputsStep.java:38)
22-Jun-2019 16:13:41         at org.gradle.internal.execution.steps.RecordOutputsStep.execute(RecordOutputsStep.java:24)
22-Jun-2019 16:13:41         at org.gradle.internal.execution.steps.SkipUpToDateStep.executeBecause(SkipUpToDateStep.java:96)
22-Jun-2019 16:13:41         at org.gradle.internal.execution.steps.SkipUpToDateStep.lambda$execute$0(SkipUpToDateStep.java:89)
22-Jun-2019 16:13:41         at org.gradle.internal.execution.steps.SkipUpToDateStep.execute(SkipUpToDateStep.java:54)
22-Jun-2019 16:13:41         at org.gradle.internal.execution.steps.SkipUpToDateStep.execute(SkipUpToDateStep.java:38)
22-Jun-2019 16:13:41         at org.gradle.internal.execution.steps.ResolveChangesStep.execute(ResolveChangesStep.java:77)
22-Jun-2019 16:13:41         at org.gradle.internal.execution.steps.ResolveChangesStep.execute(ResolveChangesStep.java:37)
22-Jun-2019 16:13:41         at org.gradle.internal.execution.steps.legacy.MarkSnapshottingInputsFinishedStep.execute(MarkSnapshottingInputsFinishedStep.java:36)
22-Jun-2019 16:13:41         at org.gradle.internal.execution.steps.legacy.MarkSnapshottingInputsFinishedStep.execute(MarkSnapshottingInputsFinishedStep.java:26)
22-Jun-2019 16:13:41         at org.gradle.internal.execution.steps.ResolveCachingStateStep.execute(ResolveCachingStateStep.java:90)
22-Jun-2019 16:13:41         at org.gradle.internal.execution.steps.ResolveCachingStateStep.execute(ResolveCachingStateStep.java:48)
22-Jun-2019 16:13:41         at org.gradle.internal.execution.impl.DefaultWorkExecutor.execute(DefaultWorkExecutor.java:33)
22-Jun-2019 16:13:41         at org.gradle.api.internal.tasks.execution.ExecuteActionsTaskExecuter.execute(ExecuteActionsTaskExecuter.java:120)
22-Jun-2019 16:13:41         ... 115 more
22-Jun-2019 16:13:41
22-Jun-2019 16:13:41
22-Jun-2019 16:13:41 * Get more help at https://help.gradle.org
22-Jun-2019 16:13:41
22-Jun-2019 16:13:41 BUILD FAILED in 8m 22s
22-Jun-2019 16:13:42
22-Jun-2019 16:13:42 Failing task since return code of [./gradlew --refresh-dependencies --no-daemon -PtestGroups=ci -P BRANCH_NAME=master --stacktrace clean check build -I /tmp/artifactory.init.script6021048187155596934gradle -DbuildInfoConfig.propertiesFile=/tmp/buildinfo4360716733063334079properties artifactoryPublish -Dartifactory.resolve.password=******** -Dartifactory.publish.password=********] was 1 while expected 0
22-Jun-2019 16:13:42 Parsing test results under /opt/bamboo-home/xml-data/build-dir/SPR-PUB-JOB1...
22-Jun-2019 16:13:44 Finished task 'Artifactory Gradle' with result: Failed
22-Jun-2019 16:13:44 Running post build plugin 'Docker Container Cleanup'
22-Jun-2019 16:13:44 Running post build plugin 'NCover Results Collector'
22-Jun-2019 16:13:44 Running post build plugin 'Artifactory Release Management Staging'
22-Jun-2019 16:13:44 Running post build plugin 'Artifactory Build Info Copier'
22-Jun-2019 16:13:44 Running post build plugin 'Artifactory Gradle Properties Info Copier'
22-Jun-2019 16:13:44 Running post build plugin 'Clover Results Collector'
22-Jun-2019 16:13:44 Running post build plugin 'npm Cache Cleanup'
22-Jun-2019 16:13:44 Running post build plugin 'Artifact Copier'
22-Jun-2019 16:13:44 Successfully removed working directory at '/opt/bamboo-home/xml-data/build-dir/SPR-PUB-JOB1'
22-Jun-2019 16:13:44 Finalising the build...
22-Jun-2019 16:13:44 Stopping timer.
22-Jun-2019 16:13:44 Build SPR-PUB-JOB1-7517 completed.
22-Jun-2019 16:13:53 Running on server: post build plugin 'NCover Results Collector'
22-Jun-2019 16:13:53 Running on server: post build plugin 'Build Hanging Detection Configuration'
22-Jun-2019 16:13:53 Running on server: post build plugin 'Clover Delta Calculator'
22-Jun-2019 16:13:53 Running on server: post build plugin 'Maven Dependencies Postprocessor'
22-Jun-2019 16:13:53 All post build plugins have finished
22-Jun-2019 16:13:53 Generating build results summary...
22-Jun-2019 16:14:10 Saving build results to disk...
22-Jun-2019 16:14:10 Logging substituted variables...
22-Jun-2019 16:14:11 Indexing build results...
22-Jun-2019 16:14:11 Finished building SPR-PUB-JOB1-7517.