Build #7,522

Build: #7522 failed

Job: Default Job failed

Stages & jobs

  1. Default Stage

Test results

  • 17,307 tests in total
  • 1 test failed
  • 1 failure is new
  • 202 tests were quarantined / skipped
  • 3 minutes taken in total.

Build 7,522 has the following 1 errors: 1 new failure(s) occurred since the previous build.

New test failures 1
Status Test Duration
Collapse Failed CauchoRemotingTests simpleHessianServiceExporter History
< 1 sec
java.net.BindException: java.net.BindException: Address already in use
java.net.BindException: Address already in use
	at sun.nio.ch.Net.bind0(Native Method)
	at sun.nio.ch.Net.bind(Net.java:433)
	at sun.nio.ch.Net.bind(Net.java:425)
	at sun.nio.ch.ServerSocketChannelImpl.bind(ServerSocketChannelImpl.java:223)
	at sun.nio.ch.ServerSocketAdaptor.bind(ServerSocketAdaptor.java:74)
	at sun.net.httpserver.ServerImpl.<init>(ServerImpl.java:100)
(52 more lines...)