Build #7,537

Build: #7537 failed

Job: Default Job failed

Stages & jobs

  1. Default Stage

Build log

The build generated 592 lines of output. Download or view full build log

27-Jun-2019 14:19:57 Build Spring Framework - Publication - Default Job #7537 (SPR-PUB-JOB1-7537) started building on agent bamboo-17.af.pivotal.io
27-Jun-2019 14:19:57 Remote agent on host bamboo-17.af.pivotal.io
27-Jun-2019 14:19:57 Build working directory is /opt/bamboo-home/xml-data/build-dir/SPR-PUB-JOB1
27-Jun-2019 14:19:57 Executing build Spring Framework - Publication - Default Job #7537 (SPR-PUB-JOB1-7537)
27-Jun-2019 14:19:57 Starting task 'Checkout Default Repository' of type 'com.atlassian.bamboo.plugins.vcs:task.vcs.checkout'
27-Jun-2019 14:19:57 Build always requires a clean checkout
27-Jun-2019 14:19:57 Cleaning build directory '/opt/bamboo-home/xml-data/build-dir/SPR-PUB-JOB1'
27-Jun-2019 14:19:57 Checking out into /opt/bamboo-home/xml-data/build-dir/SPR-PUB-JOB1
27-Jun-2019 14:19:57 Updating source code to revision: 7bc727c895b5542268ea441bfc3217a680cff528
27-Jun-2019 14:19:57 Creating local git repository in '/opt/bamboo-home/xml-data/build-dir/SPR-PUB-JOB1/.git'.
27-Jun-2019 14:19:57 Initialized empty Git repository in /opt/bamboo-home/xml-data/build-dir/SPR-PUB-JOB1/.git/
27-Jun-2019 14:19:59 Fetching 'refs/heads/master' from 'https://github.com/spring-projects/spring-framework.git'.
27-Jun-2019 14:20:47 From https://github.com/spring-projects/spring-framework
27-Jun-2019 14:20:47 * [new branch]      master     -> master
27-Jun-2019 14:20:47 * [new tag]               v3.1.0.RELEASE -> v3.1.0.RELEASE
27-Jun-2019 14:20:47 * [new tag]               v3.2.0.M1      -> v3.2.0.M1
27-Jun-2019 14:20:47 * [new tag]               v3.2.0.M2      -> v3.2.0.M2
27-Jun-2019 14:20:47 * [new tag]               v3.2.0.RC1     -> v3.2.0.RC1
27-Jun-2019 14:20:47 * [new tag]               v3.2.0.RC2-A   -> v3.2.0.RC2-A
27-Jun-2019 14:20:47 * [new tag]               v3.2.0.RELEASE -> v3.2.0.RELEASE
27-Jun-2019 14:20:47 * [new tag]               v3.2.1.RELEASE -> v3.2.1.RELEASE
27-Jun-2019 14:20:47 * [new tag]               v3.2.2.RELEASE -> v3.2.2.RELEASE
27-Jun-2019 14:20:47 * [new tag]               v4.0.0.M1      -> v4.0.0.M1
27-Jun-2019 14:20:47 * [new tag]               v4.0.0.M2      -> v4.0.0.M2
27-Jun-2019 14:20:47 * [new tag]               v4.0.0.M3      -> v4.0.0.M3
27-Jun-2019 14:20:47 * [new tag]               v4.0.0.RC1     -> v4.0.0.RC1
27-Jun-2019 14:20:47 * [new tag]               v4.0.0.RC2     -> v4.0.0.RC2
27-Jun-2019 14:20:47 Checking out revision 7bc727c895b5542268ea441bfc3217a680cff528.
27-Jun-2019 14:20:48 Already on 'master'
27-Jun-2019 14:20:48 Updated source code to revision: 7bc727c895b5542268ea441bfc3217a680cff528
27-Jun-2019 14:20:48 Finished task 'Checkout Default Repository' with result: Success
27-Jun-2019 14:20:48 Running pre-build action: Artifactory Release Staging
27-Jun-2019 14:20:48 Running pre-build action: VCS Version Collector
27-Jun-2019 14:20:48
Substituting variable: ${bamboo.spr.jdk.home} with /opt/jdk-8
27-Jun-2019 14:20:48
Substituting variable: ${bamboo.repository.branch.name} with master
27-Jun-2019 14:20:48 Starting task 'Artifactory Gradle' of type 'org.jfrog.bamboo.bamboo-artifactory-plugin:artifactoryGradleTask'
27-Jun-2019 14:20:48 Bamboo Artifactory Plugin version: 2.6.3
27-Jun-2019 14:20:48
Beginning to execute external process for build 'Spring Framework - Publication - Default Job #7537 (SPR-PUB-JOB1-7537)'
... running command line:
./gradlew --refresh-dependencies --no-daemon -PtestGroups=ci -P BRANCH_NAME=master --stacktrace clean check build -I /tmp/artifactory.init.script2456089709725290415gradle -DbuildInfoConfig.propertiesFile=/tmp/buildinfo930146274758787963properties artifactoryPublish -Dartifactory.resolve.password=******** -Dartifactory.publish.password=********
... in: /opt/bamboo-home/xml-data/build-dir/SPR-PUB-JOB1
... using extra environment variables:
bamboo_planRepository_1_branch=master
bamboo_********_username_password=********
bamboo_signing_store_password=********
bamboo_planRepository_2_branch=master
bamboo_capability_system_builder_ant_Ant_1_9=/opt/ant-1.9
bamboo_repository_137199621_git_repositoryUrl=https://github.com/spring-projects/spring-framework.git
bamboo_capability_system_builder_ant_Ant_1_8=/opt/ant-1.8
bamboo_planRepository_1_branchDisplayName=master
bamboo_artifactory_override_resolve_repo=libs-milestone
bamboo_capability_system_builder_node_Node_js_10_16=/opt/node-10.16/bin/node
bamboo_repository_revision_number=7bc727c895b5542268ea441bfc3217a680cff528
bamboo_repository_262406229_git_repositoryUrl=https://github.com/spring-projects/spring-framework.git
bamboo_artifactory_task_override_jdk=true
bamboo_RIAK_BIN=/usr/sbin/riak
WRAPPER_BITS=32
bamboo_buildKey=SPR-PUB-JOB1
bamboo_repository_137199621_name=Plan Repository
bamboo_spr_jdk_home=/opt/jdk-8
bamboo_bintray_password=********
bamboo_sonar_token_password=********
PWD=/opt/bamboo-home/bin
bamboo_planRepository_2_branchDisplayName=master
bamboo_shortJobName=Default Job
bamboo_artifactory_override_resolver_password=********
bamboo_sonatype_token=RSJChaox
bamboo_capability_system_builder_gradle___gradlew=./gradlew
bamboo_buildResultsUrl=https://build.spring.io/browse/SPR-PUB-JOB1-7537
bamboo_capability_system_builder_mvn3_Maven_3_3=/opt/maven-3.3
bamboo_capability_system_builder_mvn3_Maven_3_2=/opt/maven-3.2
bamboo_capability_system_builder_mvn3_Maven_3_1=/opt/maven-3.1
bamboo_planRepository_repositoryUrl=https://github.com/spring-projects/spring-framework.git
bamboo_capability_system_builder_mvn3_Maven_3_6=/opt/maven-3.6
bamboo_agentId=286195718
bamboo_capability_system_builder_mvn3_Maven_3_5=/opt/maven-3.5
bamboo_capability_system_builder_mvn3_Maven_3_0=/opt/maven-3.0
bamboo_planRepository_revision=7bc727c895b5542268ea441bfc3217a680cff528
bamboo_planRepository_previousRevision=1ef60f2d3b491fbc37762b7e9f2fe425013a06cb
bamboo_repository_137199621_revision_number=7bc727c895b5542268ea441bfc3217a680cff528
bamboo_capability_remote_build=true
bamboo_repository_branch_name=master
bamboo_sonatype_token_password=********
bamboo_sonatype_user=springsource
SHLVL=1
bamboo_org_jfrog_bamboo_buildInfo_serverUrl=https://repo.spring.io
bamboo_scdf_acceptance_tests_password=********
bamboo_repository_262406229_branch_name=master
WRAPPER_OS=linux
JAVA_HOME=/opt/jdk-8/
TERM=linux
XDG_SESSION_ID=c1
bamboo_planRepository_branch=master
bamboo_org_jfrog_bamboo_release_activated=false
bamboo_planRepository_1_type=gitv2
bamboo_planRepository_branchName=master
bamboo_repository_137199621_git_username=spring-buildmaster
bamboo_capability_system_jdk_JDK_12=/opt/jdk-12
WRAPPER_FILE_SEPARATOR=/
_=/opt/bamboo-home/bin/bamboo-agent.sh
bamboo_repository_262406229_revision_number=7bc727c895b5542268ea441bfc3217a680cff528
bamboo_capability_system_builder_ant_Ant_1_10=/opt/ant-1.10
WRAPPER_PATH_SEPARATOR=:
bamboo_sonar_password=********
bamboo_hg_cache_directory=/opt/bamboo-home/xml-data/build-dir/_hg-repositories-cache
bamboo_planRepository_1_username=spring-buildmaster
bamboo_planRepository_type=gitv2
bamboo_repository_262406229_git_branch=master
bamboo_git_cache_directory=/opt/bamboo-home/xml-data/build-dir/_git-repositories-cache
bamboo_planRepository_2_branchName=master
bamboo_artifactory_username=buildmaster
bamboo_tmp_directory=/opt/bamboo-home/temp
bamboo_planKey=SPR-PUB
bamboo_planRepository_username=spring-buildmaster
bamboo_JDK8_HOME=/opt/jdk-8
bamboo_snifftask=sniff
bamboo_planRepository_1_branchName=master
bamboo_sonar_version=5.6.3
bamboo_sonar_jdbc_password=********
bamboo_bintray_api_key_password=********
GRADLE_OPTS=-Xms128m
bamboo_repository_262406229_git_username=spring-buildmaster
XDG_DATA_DIRS=/usr/local/share:/usr/share:/var/lib/snapd/desktop
bamboo_capability_system_jdk_JDK_1_11=/opt/jdk-11
bamboo_resultsUrl=https://build.spring.io/browse/SPR-PUB-JOB1-7537
bamboo_capability_system_jdk_JDK_1_10=/opt/jdk-10
bamboo_build_working_directory=/opt/bamboo-home/xml-data/build-dir/SPR-PUB-JOB1
bamboo_planRepository_1_name=Spring Framework
bamboo_capability_system_os=ubuntu1804
bamboo_nexusPush_stagingProfile=buildmaster
bamboo_shortPlanName=Publication
MAIL=/var/mail/bamboo
bamboo_planRepository_2_username=spring-buildmaster
bamboo_repository_137199621_branch_name=master
bamboo_planRepository_name=Spring Framework
LOGNAME=bamboo
bamboo_buildNumber=7537
bamboo_repository_137199621_git_branch=master
SHELL=/bin/bash
bamboo_planName=Spring Framework - Publication
bamboo_JDK7_HOME=/opt/jdk-7
bamboo_repository_137199621_previous_revision_number=1ef60f2d3b491fbc37762b7e9f2fe425013a06cb
bamboo_shortPlanKey=PUB
OLDPWD=/opt/users/bamboo
bamboo_shortJobKey=JOB1
bamboo_artifactory_password=********
bamboo_repository_262406229_name=Spring Framework
bamboo_planRepository_2_name=Plan Repository
bamboo_repository_262406229_previous_revision_number=1ef60f2d3b491fbc37762b7e9f2fe425013a06cb
bamboo_buildTimeStamp=2019-06-27T14:19:06.562Z
bamboo_repository_previous_revision_number=1ef60f2d3b491fbc37762b7e9f2fe425013a06cb
bamboo_sonar_username=buildmaster
bamboo_********_password=********
bamboo_repository_git_branch=master
bamboo_buildResultKey=SPR-PUB-JOB1-7537
bamboo_nexusPush_close=true
bamboo_artifactory_override_resolver_username=buildmaster
bamboo_buildPlanName=Spring Framework - Publication - Default Job
bamboo_planRepository_1_revision=7bc727c895b5542268ea441bfc3217a680cff528
bamboo_repository_name=Plan Repository
bamboo_signing_key_password=********
bamboo_planRepository_2_previousRevision=1ef60f2d3b491fbc37762b7e9f2fe425013a06cb
bamboo_capability_system_builder_groovy_Groovy_2_5=/opt/groovy-2.5
LANG=en_US.UTF-8
bamboo_buildFailed=false
bamboo_capability_system_docker_executable=/usr/bin/docker
DISPLAY=localhost:1.0
bamboo_capability_system_jdk_OpenJDK_7=/opt/jdk-7
bamboo_capability_system_builder_groovy_Groovy_2_4=/opt/groovy-2.4
bamboo_artifactory_override_deployer_username=buildmaster
bamboo_artifactory_password_mask_b=********
bamboo_capability_system_builder_command_Bash=/bin/bash
bamboo_artifactory_password_mask_a=********
bamboo_agentWorkingDirectory=/opt/bamboo-home/xml-data/build-dir
bamboo_planRepository_2_revision=7bc727c895b5542268ea441bfc3217a680cff528
bamboo_capability_system_git_executable=/usr/bin/git
bamboo_repository_git_username=spring-buildmaster
bamboo_planRepository_1_previousRevision=1ef60f2d3b491fbc37762b7e9f2fe425013a06cb
bamboo_capability_os_family=unix
bamboo_planRepository_branchDisplayName=master
bamboo_capability_system_builder_maven_Artifactory_Maven_3_6=/opt/maven-3.6
bamboo_capability_system_builder_maven_Artifactory_Maven_3_5=/opt/maven-3.5
GIT_SSL_NO_VERIFY=true
bamboo_capability_system_builder_maven_Artifactory_Maven_3_3=/opt/maven-3.3
bamboo_planRepository_2_type=gitv2
bamboo_capability_system_builder_maven_Artifactory_Maven_3_2=/opt/maven-3.2
bamboo_s3_properties=/home/bamboo/tools/s3.properties
bamboo_capability_system_builder_maven_Artifactory_Maven_3_1=/opt/maven-3.1
bamboo_artifactory_override_deploy_repo=libs-snapshot-local
bamboo_capability_system_builder_maven_Artifactory_Maven_3_0=/opt/maven-3.0
bamboo_plan_storageTag=SPR-PUB
bamboo_bintray_username_password=********
bamboo_planRepository_2_repositoryUrl=https://github.com/spring-projects/spring-framework.git
USER=bamboo
bamboo_repository_git_repositoryUrl=https://github.com/spring-projects/spring-framework.git
bamboo_working_directory=/opt/bamboo-home/xml-data/build-dir/SPR-PUB-JOB1
bamboo_org_jfrog_bamboo_buildInfo_activated=true
bamboo_planRepository_1_repositoryUrl=https://github.com/spring-projects/spring-framework.git
bamboo_capability_system_jdk_JDK_1_8=/opt/jdk-8
bamboo_artifactory_override_deployer_password=********
bamboo_capability_system_jdk_JDK_1_9=/opt/jdk-9
WRAPPER_ARCH=x86
bamboo_capability_system_jdk_JDK_1_6=/opt/jdk-6
bamboo_sonatype_password=********
bamboo_capability_system_jdk_JDK_1_7=/opt/jdk-7
bamboo_sonar_ip=10.194.6.9
XDG_RUNTIME_DIR=/run/user/1002
HOME=/home/bamboo
PATH=/bin:/home/bamboo/bin:/usr/local/sbin:/usr/local/bin:/usr/sbin:/usr/bin:/sbin:/bin:/usr/games:/usr/local/games:/snap/bin:/home/bamboo/bin:/usr/local/bin:/bin:/home/bamboo/bin:/usr/local/sbin:/usr/local/bin:/usr/sbin:/usr/bin:/sbin:/bin:/usr/games:/usr/local/games:/snap/bin:/home/bamboo/bin:/usr/local/bin
27-Jun-2019 14:20:51 > Task :buildSrc:compileJava NO-SOURCE
27-Jun-2019 14:20:53 > Task :buildSrc:compileGroovy
27-Jun-2019 14:20:53 > Task :buildSrc:processResources
27-Jun-2019 14:20:53 > Task :buildSrc:classes
27-Jun-2019 14:20:53 > Task :buildSrc:jar
27-Jun-2019 14:20:53 > Task :buildSrc:assemble
27-Jun-2019 14:20:53 > Task :buildSrc:compileTestJava NO-SOURCE
27-Jun-2019 14:20:53 > Task :buildSrc:compileTestGroovy NO-SOURCE
27-Jun-2019 14:20:53 > Task :buildSrc:processTestResources NO-SOURCE
27-Jun-2019 14:20:53 > Task :buildSrc:testClasses UP-TO-DATE
27-Jun-2019 14:20:53 > Task :buildSrc:test NO-SOURCE
27-Jun-2019 14:20:53 > Task :buildSrc:check UP-TO-DATE
27-Jun-2019 14:20:53 > Task :buildSrc:build
27-Jun-2019 14:21:03 Cannot publish pom for project ':' since it does not contain the Maven plugin install task and task ':artifactoryPublish' does not specify a custom pom path.
27-Jun-2019 14:21:03 Cannot publish pom for project ':spring-build-src' since it does not contain the Maven plugin install task and task ':spring-build-src:artifactoryPublish' does not specify a custom pom path.
27-Jun-2019 14:21:03 Cannot publish pom for project ':spring-core-coroutines' since it does not contain the Maven plugin install task and task ':spring-core-coroutines:artifactoryPublish' does not specify a custom pom path.
27-Jun-2019 14:21:06 > Task :clean UP-TO-DATE
27-Jun-2019 14:21:06 > Task :spring-aop:clean UP-TO-DATE
27-Jun-2019 14:21:06 > Task :spring-aspects:clean UP-TO-DATE
27-Jun-2019 14:21:06 > Task :spring-beans:clean UP-TO-DATE
27-Jun-2019 14:21:06 > Task :spring-build-src:clean
27-Jun-2019 14:21:06 > Task :spring-context:clean UP-TO-DATE
27-Jun-2019 14:21:06 > Task :spring-context-indexer:clean UP-TO-DATE
27-Jun-2019 14:21:06 > Task :spring-context-support:clean UP-TO-DATE
27-Jun-2019 14:21:06 > Task :spring-core:clean UP-TO-DATE
27-Jun-2019 14:21:06 > Task :spring-core-coroutines:clean UP-TO-DATE
27-Jun-2019 14:21:06 > Task :spring-expression:clean UP-TO-DATE
27-Jun-2019 14:21:06 > Task :spring-framework-bom:clean UP-TO-DATE
27-Jun-2019 14:21:06 > Task :spring-instrument:clean UP-TO-DATE
27-Jun-2019 14:21:06 > Task :spring-jcl:clean UP-TO-DATE
27-Jun-2019 14:21:06 > Task :spring-jdbc:clean UP-TO-DATE
27-Jun-2019 14:21:06 > Task :spring-jms:clean UP-TO-DATE
27-Jun-2019 14:21:06 > Task :spring-messaging:clean UP-TO-DATE
27-Jun-2019 14:21:06 > Task :spring-orm:clean UP-TO-DATE
27-Jun-2019 14:21:06 > Task :spring-oxm:clean UP-TO-DATE
27-Jun-2019 14:21:06 > Task :spring-test:clean UP-TO-DATE
27-Jun-2019 14:21:06 > Task :spring-tx:clean UP-TO-DATE
27-Jun-2019 14:21:06 > Task :spring-web:clean UP-TO-DATE
27-Jun-2019 14:21:06 > Task :spring-webflux:clean UP-TO-DATE
27-Jun-2019 14:21:06 > Task :spring-webmvc:clean UP-TO-DATE
27-Jun-2019 14:21:06 > Task :spring-websocket:clean UP-TO-DATE
27-Jun-2019 14:21:06 > Task :compileKotlin NO-SOURCE
27-Jun-2019 14:21:06 > Task :compileJava NO-SOURCE
27-Jun-2019 14:21:06 > Task :compileGroovy NO-SOURCE
27-Jun-2019 14:21:06 > Task :processResources NO-SOURCE
27-Jun-2019 14:21:06 > Task :classes UP-TO-DATE
27-Jun-2019 14:21:06 > Task :checkstyleMain NO-SOURCE
27-Jun-2019 14:21:07 > Task :spring-core:cglibRepackJar
27-Jun-2019 14:21:07 > Task :spring-core:objenesisRepackJar
27-Jun-2019 14:21:11 > Task :spring-core-coroutines:compileKotlin
27-Jun-2019 14:21:11 > Task :spring-core-coroutines:compileJava NO-SOURCE
27-Jun-2019 14:21:11 > Task :spring-core-coroutines:processResources NO-SOURCE
27-Jun-2019 14:21:11 > Task :spring-core-coroutines:classes UP-TO-DATE
27-Jun-2019 14:21:11 > Task :spring-core-coroutines:inspectClassesForKotlinIC
27-Jun-2019 14:21:11 > Task :spring-core-coroutines:jar
27-Jun-2019 14:21:11 > Task :spring-jcl:compileKotlin
27-Jun-2019 14:21:12 > Task :spring-jcl:compileJava
27-Jun-2019 14:21:12 > Task :spring-jcl:processResources
27-Jun-2019 14:21:12 > Task :spring-jcl:classes
27-Jun-2019 14:21:12 > Task :spring-jcl:inspectClassesForKotlinIC
27-Jun-2019 14:21:12 > Task :spring-jcl:jar
27-Jun-2019 14:21:13 > Task :spring-core:compileKotlin
27-Jun-2019 14:21:16 > Task :spring-core:compileJava
27-Jun-2019 14:21:16 > Task :spring-core:processResources NO-SOURCE
27-Jun-2019 14:21:16 > Task :spring-core:classes
27-Jun-2019 14:21:16 > Task :spring-core:inspectClassesForKotlinIC
27-Jun-2019 14:21:16 > Task :spring-core:jar
27-Jun-2019 14:21:20 > Task :spring-beans:compileGroovy
27-Jun-2019 14:21:21 > Task :spring-beans:compileKotlin
27-Jun-2019 14:21:21 > Task :spring-beans:compileJava NO-SOURCE
27-Jun-2019 14:21:21 > Task :spring-beans:processResources
27-Jun-2019 14:21:21 > Task :spring-beans:classes
27-Jun-2019 14:21:21 > Task :spring-beans:inspectClassesForKotlinIC
27-Jun-2019 14:21:21 > Task :spring-beans:jar
27-Jun-2019 14:21:21 > Task :spring-aop:compileKotlin
27-Jun-2019 14:21:22 > Task :spring-aop:compileJava
27-Jun-2019 14:21:22 > Task :spring-aop:processResources
27-Jun-2019 14:21:22 > Task :spring-aop:classes
27-Jun-2019 14:21:22 > Task :spring-core-coroutines:compileTestKotlin NO-SOURCE
27-Jun-2019 14:21:22 > Task :spring-core-coroutines:compileTestJava NO-SOURCE
27-Jun-2019 14:21:22 > Task :spring-core-coroutines:processTestResources NO-SOURCE
27-Jun-2019 14:21:22 > Task :spring-core-coroutines:testClasses UP-TO-DATE
27-Jun-2019 14:21:22 > Task :spring-jcl:compileTestKotlin NO-SOURCE
27-Jun-2019 14:21:22 > Task :spring-jcl:compileTestJava NO-SOURCE
27-Jun-2019 14:21:22 > Task :spring-jcl:processTestResources NO-SOURCE
27-Jun-2019 14:21:22 > Task :spring-jcl:testClasses UP-TO-DATE
27-Jun-2019 14:21:24 > Task :spring-core:compileTestKotlin
27-Jun-2019 14:21:30 > Task :spring-core:compileTestJava
27-Jun-2019 14:21:30 > Task :spring-core:processTestResources
27-Jun-2019 14:21:30 > Task :spring-core:testClasses
27-Jun-2019 14:21:32 > Task :spring-beans:compileTestKotlin
27-Jun-2019 14:21:35
27-Jun-2019 14:21:35 > Task :spring-beans:compileTestJava
27-Jun-2019 14:21:35 Note: Some input files use unchecked or unsafe operations.
27-Jun-2019 14:21:35 Note: Recompile with -Xlint:unchecked for details.
27-Jun-2019 14:21:35
27-Jun-2019 14:21:35 > Task :spring-beans:compileTestGroovy NO-SOURCE
27-Jun-2019 14:21:35 > Task :spring-beans:processTestResources
27-Jun-2019 14:21:35 > Task :spring-beans:testClasses
27-Jun-2019 14:21:35 > Task :spring-aop:compileTestKotlin
27-Jun-2019 14:21:35 > Task :spring-aop:inspectClassesForKotlinIC
27-Jun-2019 14:21:35 > Task :spring-aop:jar
27-Jun-2019 14:21:36 > Task :spring-aop:compileTestJava
27-Jun-2019 14:21:36 > Task :spring-aop:processTestResources
27-Jun-2019 14:21:36 > Task :spring-aop:testClasses
27-Jun-2019 14:21:36 > Task :spring-expression:compileKotlin
27-Jun-2019 14:21:36 > Task :spring-expression:compileJava
27-Jun-2019 14:21:36 > Task :spring-expression:processResources
27-Jun-2019 14:21:36 > Task :spring-expression:classes
27-Jun-2019 14:21:36 > Task :spring-expression:inspectClassesForKotlinIC
27-Jun-2019 14:21:36 > Task :spring-expression:jar
27-Jun-2019 14:21:36 > Task :spring-instrument:compileKotlin
27-Jun-2019 14:21:36 > Task :spring-instrument:compileJava
27-Jun-2019 14:21:36 > Task :spring-instrument:processResources NO-SOURCE
27-Jun-2019 14:21:36 > Task :spring-instrument:classes
27-Jun-2019 14:21:36 > Task :spring-instrument:inspectClassesForKotlinIC
27-Jun-2019 14:21:36 > Task :spring-instrument:jar
27-Jun-2019 14:21:41 > Task :spring-context:compileKotlin
27-Jun-2019 14:21:42 > Task :spring-context:compileJava
27-Jun-2019 14:21:42 > Task :spring-context:compileGroovy NO-SOURCE
27-Jun-2019 14:21:42 > Task :spring-context:processResources
27-Jun-2019 14:21:42 > Task :spring-context:classes
27-Jun-2019 14:21:42 > Task :spring-expression:compileTestKotlin
27-Jun-2019 14:21:46 > Task :spring-expression:compileTestJava
27-Jun-2019 14:21:46 > Task :spring-expression:processTestResources
27-Jun-2019 14:21:46 > Task :spring-expression:testClasses
27-Jun-2019 14:21:46 > Task :spring-instrument:compileTestKotlin NO-SOURCE
27-Jun-2019 14:21:46 > Task :spring-instrument:compileTestJava NO-SOURCE
27-Jun-2019 14:21:46 > Task :spring-instrument:processTestResources
27-Jun-2019 14:21:46 > Task :spring-instrument:testClasses
27-Jun-2019 14:21:47 > Task :spring-context:compileTestKotlin
27-Jun-2019 14:21:47 > Task :spring-context:inspectClassesForKotlinIC
27-Jun-2019 14:21:47 > Task :spring-context:jar
27-Jun-2019 14:21:52 Note: Some input files use or override a deprecated API.
27-Jun-2019 14:21:52
27-Jun-2019 14:21:52 Note: Recompile with -Xlint:deprecation for details.
27-Jun-2019 14:21:52 > Task :spring-context:compileTestJava
27-Jun-2019 14:21:52 Note: Some input files use unchecked or unsafe operations.
27-Jun-2019 14:21:52 Note: Recompile with -Xlint:unchecked for details.
27-Jun-2019 14:21:53
27-Jun-2019 14:21:53 > Task :spring-context:compileTestGroovy
27-Jun-2019 14:21:53 > Task :spring-context:processTestResources
27-Jun-2019 14:21:53 > Task :spring-context:testClasses
27-Jun-2019 14:21:53 > Task :spring-tx:compileKotlin
27-Jun-2019 14:21:53 > Task :spring-tx:compileJava
27-Jun-2019 14:21:53 > Task :spring-tx:processResources
27-Jun-2019 14:21:53 > Task :spring-tx:classes
27-Jun-2019 14:21:53 > Task :spring-tx:inspectClassesForKotlinIC
27-Jun-2019 14:21:54 > Task :spring-tx:jar
27-Jun-2019 14:21:54 > Task :spring-jdbc:compileKotlin
27-Jun-2019 14:21:55 > Task :spring-jdbc:compileJava
27-Jun-2019 14:21:55 > Task :spring-jdbc:processResources
27-Jun-2019 14:21:55 > Task :spring-jdbc:classes
27-Jun-2019 14:21:55 > Task :spring-tx:compileTestKotlin
27-Jun-2019 14:22:13 > Task :spring-tx:compileTestJava
27-Jun-2019 14:22:13 > Task :spring-tx:processTestResources
27-Jun-2019 14:22:13 > Task :spring-tx:testClasses
27-Jun-2019 14:22:14 > Task :spring-jdbc:compileTestKotlin
27-Jun-2019 14:22:14 > Task :spring-jdbc:inspectClassesForKotlinIC
27-Jun-2019 14:22:14 > Task :spring-jdbc:jar
27-Jun-2019 14:22:15 > Task :spring-jdbc:compileTestJava
27-Jun-2019 14:22:15 > Task :spring-jdbc:processTestResources
27-Jun-2019 14:22:15 > Task :spring-jdbc:testClasses
27-Jun-2019 14:22:15 > Task :spring-oxm:compileKotlin
27-Jun-2019 14:22:15 > Task :spring-oxm:compileJava
27-Jun-2019 14:22:15 > Task :spring-oxm:processResources
27-Jun-2019 14:22:15 > Task :spring-oxm:classes
27-Jun-2019 14:22:15 > Task :spring-oxm:inspectClassesForKotlinIC
27-Jun-2019 14:22:15 > Task :spring-oxm:jar
27-Jun-2019 14:22:17 > Task :spring-web:compileKotlin
27-Jun-2019 14:22:18 > Task :spring-web:compileJava
27-Jun-2019 14:22:18 > Task :spring-web:processResources
27-Jun-2019 14:22:18 > Task :spring-web:classes
27-Jun-2019 14:22:18 > Task :spring-web:inspectClassesForKotlinIC
27-Jun-2019 14:22:19 > Task :spring-web:jar
27-Jun-2019 14:22:19 > Task :spring-orm:compileKotlin
27-Jun-2019 14:22:20 > Task :spring-orm:compileJava
27-Jun-2019 14:22:20 > Task :spring-orm:processResources NO-SOURCE
27-Jun-2019 14:22:20 > Task :spring-orm:classes
27-Jun-2019 14:22:21
27-Jun-2019 14:22:21 > Task :spring-oxm:genJaxb
27-Jun-2019 14:22:21 [ant:javac] : warning: 'includeantruntime' was not set, defaulting to build.sysclasspath=last; set to false for repeatable builds
27-Jun-2019 14:22:21
27-Jun-2019 14:22:21 > Task :spring-oxm:compileTestKotlin
27-Jun-2019 14:22:22 > Task :spring-oxm:compileTestJava
27-Jun-2019 14:22:22 > Task :spring-oxm:processTestResources
27-Jun-2019 14:22:22 > Task :spring-oxm:testClasses
27-Jun-2019 14:22:24 > Task :spring-web:compileTestKotlin
27-Jun-2019 14:22:28 > Task :spring-web:compileTestJava
27-Jun-2019 14:22:28 > Task :spring-web:processTestResources
27-Jun-2019 14:22:28 > Task :spring-web:testClasses
27-Jun-2019 14:22:28 > Task :spring-orm:compileTestKotlin
27-Jun-2019 14:22:28 > Task :spring-orm:inspectClassesForKotlinIC
27-Jun-2019 14:22:28 > Task :spring-orm:jar
27-Jun-2019 14:22:29 > Task :spring-orm:compileTestJava
27-Jun-2019 14:22:29 > Task :spring-orm:processTestResources
27-Jun-2019 14:22:29 > Task :spring-orm:testClasses
27-Jun-2019 14:22:29 > Task :spring-context-support:compileKotlin
27-Jun-2019 14:22:29 > Task :spring-context-support:compileJava
27-Jun-2019 14:22:29 > Task :spring-context-support:processResources
27-Jun-2019 14:22:29 > Task :spring-context-support:classes
27-Jun-2019 14:22:29 > Task :spring-context-support:compileTestKotlin
27-Jun-2019 14:22:29 > Task :spring-context-support:inspectClassesForKotlinIC
27-Jun-2019 14:22:29 > Task :spring-context-support:jar
27-Jun-2019 14:22:30 > Task :spring-context-support:compileTestJava
27-Jun-2019 14:22:30 > Task :spring-context-support:processTestResources
27-Jun-2019 14:22:30 > Task :spring-context-support:testClasses
27-Jun-2019 14:22:34 > Task :spring-webflux:compileKotlin
27-Jun-2019 14:22:35 > Task :spring-webflux:compileJava
27-Jun-2019 14:22:35 > Task :spring-webflux:processResources
27-Jun-2019 14:22:35 > Task :spring-webflux:classes
27-Jun-2019 14:22:35 > Task :spring-webflux:inspectClassesForKotlinIC
27-Jun-2019 14:22:35 > Task :spring-webflux:jar
27-Jun-2019 14:22:36 > Task :spring-webmvc:compileKotlin
27-Jun-2019 14:22:38 > Task :spring-webmvc:compileJava
27-Jun-2019 14:22:38 > Task :spring-webmvc:processResources
27-Jun-2019 14:22:38 > Task :spring-webmvc:classes
27-Jun-2019 14:22:38 > Task :spring-webmvc:inspectClassesForKotlinIC
27-Jun-2019 14:22:38 > Task :spring-webmvc:jar
27-Jun-2019 14:22:39 > Task :spring-messaging:compileKotlin
27-Jun-2019 14:22:39 > Task :spring-messaging:compileJava
27-Jun-2019 14:22:39 > Task :spring-messaging:processResources NO-SOURCE
27-Jun-2019 14:22:39 > Task :spring-messaging:classes
27-Jun-2019 14:22:39 > Task :spring-messaging:inspectClassesForKotlinIC
27-Jun-2019 14:22:39 > Task :spring-messaging:jar
27-Jun-2019 14:22:40 > Task :spring-websocket:compileKotlin
27-Jun-2019 14:22:40 > Task :spring-websocket:compileJava
27-Jun-2019 14:22:40 > Task :spring-websocket:processResources
27-Jun-2019 14:22:40 > Task :spring-websocket:classes
27-Jun-2019 14:22:40 > Task :spring-websocket:inspectClassesForKotlinIC
27-Jun-2019 14:22:40 > Task :spring-websocket:jar
27-Jun-2019 14:22:42 > Task :spring-test:compileKotlin
27-Jun-2019 14:22:43 > Task :spring-test:compileJava
27-Jun-2019 14:22:43 > Task :spring-test:processResources
27-Jun-2019 14:22:43 > Task :spring-test:classes
27-Jun-2019 14:22:45 > Task :spring-webflux:compileTestKotlin
27-Jun-2019 14:22:48 > Task :spring-webflux:compileTestJava
27-Jun-2019 14:22:48 > Task :spring-webflux:processTestResources
27-Jun-2019 14:22:48 > Task :spring-webflux:testClasses
27-Jun-2019 14:22:49 > Task :spring-webmvc:compileTestKotlin
27-Jun-2019 14:22:52 > Task :spring-webmvc:compileTestJava
27-Jun-2019 14:22:52 > Task :spring-webmvc:processTestResources
27-Jun-2019 14:22:52 > Task :spring-webmvc:testClasses
27-Jun-2019 14:22:54
27-Jun-2019 14:22:54 > Task :spring-messaging:compileTestKotlin
27-Jun-2019 14:22:54 w: /opt/bamboo-home/xml-data/build-dir/SPR-PUB-JOB1/spring-messaging/src/test/kotlin/org/springframework/messaging/rsocket/RSocketClientToServerCoroutinesIntegrationTests.kt: (202, 7): 'addServerPlugin(RSocketInterceptor!): RSocketFactory.ServerRSocketFactory!' is deprecated. Deprecated in Java
27-Jun-2019 14:22:55
27-Jun-2019 14:22:55 > Task :spring-messaging:compileTestJava
27-Jun-2019 14:22:55 > Task :spring-messaging:processTestResources
27-Jun-2019 14:22:55 > Task :spring-messaging:testClasses
27-Jun-2019 14:22:56 > Task :spring-websocket:compileTestKotlin
27-Jun-2019 14:22:57 > Task :spring-websocket:compileTestJava
27-Jun-2019 14:22:57 > Task :spring-websocket:processTestResources
27-Jun-2019 14:22:57 > Task :spring-websocket:testClasses
27-Jun-2019 14:22:58 > Task :spring-test:compileTestKotlin
27-Jun-2019 14:22:58 > Task :spring-test:inspectClassesForKotlinIC
27-Jun-2019 14:22:58 > Task :spring-test:jar
27-Jun-2019 14:23:01 > Task :spring-test:compileTestJava
27-Jun-2019 14:23:01 > Task :spring-test:processTestResources
27-Jun-2019 14:23:01 > Task :spring-test:testClasses
27-Jun-2019 14:23:01 > Task :compileTestKotlin
27-Jun-2019 14:23:02 > Task :compileTestJava
27-Jun-2019 14:23:02 > Task :compileTestGroovy NO-SOURCE
27-Jun-2019 14:23:02 > Task :processTestResources
27-Jun-2019 14:23:02 > Task :testClasses
27-Jun-2019 14:23:04 > Task :checkstyleTest
27-Jun-2019 14:23:07 > Task :test
27-Jun-2019 14:23:07 > Task :check
27-Jun-2019 14:23:10 > Task :spring-aop:checkstyleMain
27-Jun-2019 14:23:10 > Task :spring-aop:checkstyleTest
27-Jun-2019 14:23:13 > Task :spring-aop:test
27-Jun-2019 14:23:13 > Task :spring-aop:check
27-Jun-2019 14:23:13 > Task :spring-aspects:compileKotlin
27-Jun-2019 14:23:15 > Task :spring-aspects:compileJava
27-Jun-2019 14:23:15 > Task :spring-aspects:processResources
27-Jun-2019 14:23:15 > Task :spring-aspects:classes
27-Jun-2019 14:23:15 > Task :spring-aspects:checkstyleMain
27-Jun-2019 14:23:15 > Task :spring-aspects:compileTestKotlin
27-Jun-2019 14:23:15 > Task :spring-aspects:inspectClassesForKotlinIC
27-Jun-2019 14:23:15 > Task :spring-aspects:jar
27-Jun-2019 14:23:17 > Task :spring-aspects:compileTestJava
27-Jun-2019 14:23:17 > Task :spring-aspects:processTestResources
27-Jun-2019 14:23:17 > Task :spring-aspects:testClasses
27-Jun-2019 14:23:17 > Task :spring-aspects:checkstyleTest
27-Jun-2019 14:23:22 > Task :spring-aspects:test
27-Jun-2019 14:23:22 > Task :spring-aspects:check
27-Jun-2019 14:23:25 > Task :spring-beans:checkstyleMain
27-Jun-2019 14:23:26 > Task :spring-beans:checkstyleTest
27-Jun-2019 14:23:35 > Task :spring-beans:test
27-Jun-2019 14:23:35 > Task :spring-beans:check
27-Jun-2019 14:23:35 > Task :spring-build-src:compileKotlin NO-SOURCE
27-Jun-2019 14:23:35 > Task :spring-build-src:compileJava NO-SOURCE
27-Jun-2019 14:23:35 > Task :spring-build-src:compileGroovy
27-Jun-2019 14:23:35 > Task :spring-build-src:processResources
27-Jun-2019 14:23:35 > Task :spring-build-src:classes
27-Jun-2019 14:23:35 > Task :spring-build-src:checkstyleMain NO-SOURCE
27-Jun-2019 14:23:35 > Task :spring-build-src:compileTestKotlin NO-SOURCE
27-Jun-2019 14:23:35 > Task :spring-build-src:compileTestJava NO-SOURCE
27-Jun-2019 14:23:35 > Task :spring-build-src:compileTestGroovy NO-SOURCE
27-Jun-2019 14:23:35 > Task :spring-build-src:processTestResources NO-SOURCE
27-Jun-2019 14:23:35 > Task :spring-build-src:testClasses UP-TO-DATE
27-Jun-2019 14:23:35 > Task :spring-build-src:checkstyleTest NO-SOURCE
27-Jun-2019 14:23:35 > Task :spring-build-src:test NO-SOURCE
27-Jun-2019 14:23:35 > Task :spring-build-src:check UP-TO-DATE
27-Jun-2019 14:23:39 > Task :spring-context:checkstyleMain
27-Jun-2019 14:23:42 > Task :spring-context:checkstyleTest
27-Jun-2019 14:24:12 > Task :spring-context:test
27-Jun-2019 14:24:14 > Task :spring-context:check
27-Jun-2019 14:24:14 > Task :spring-context-indexer:compileKotlin
27-Jun-2019 14:24:14 > Task :spring-context-indexer:compileJava
27-Jun-2019 14:24:14 > Task :spring-context-indexer:processResources
27-Jun-2019 14:24:14 > Task :spring-context-indexer:classes
27-Jun-2019 14:24:14 > Task :spring-context-indexer:checkstyleMain
27-Jun-2019 14:24:14 > Task :spring-context-indexer:compileTestKotlin
27-Jun-2019 14:24:14 > Task :spring-context-indexer:compileTestJava
27-Jun-2019 14:24:14 > Task :spring-context-indexer:processTestResources NO-SOURCE
27-Jun-2019 14:24:14 > Task :spring-context-indexer:testClasses
27-Jun-2019 14:24:14 > Task :spring-context-indexer:checkstyleTest
27-Jun-2019 14:24:16 > Task :spring-context-indexer:test
27-Jun-2019 14:24:16 > Task :spring-context-indexer:check
27-Jun-2019 14:24:17 > Task :spring-context-support:checkstyleMain
27-Jun-2019 14:24:17 > Task :spring-context-support:checkstyleTest
27-Jun-2019 14:24:26 > Task :spring-context-support:test
27-Jun-2019 14:24:26 > Task :spring-context-support:check
27-Jun-2019 14:24:31 > Task :spring-core:checkstyleMain
27-Jun-2019 14:24:33 > Task :spring-core:checkstyleTest
27-Jun-2019 14:24:45 > Task :spring-core:test
27-Jun-2019 14:24:45 > Task :spring-core:check
27-Jun-2019 14:24:45 > Task :spring-core-coroutines:checkstyleMain NO-SOURCE
27-Jun-2019 14:24:45 > Task :spring-core-coroutines:checkstyleTest NO-SOURCE
27-Jun-2019 14:24:45 > Task :spring-core-coroutines:test NO-SOURCE
27-Jun-2019 14:24:45 > Task :spring-core-coroutines:check UP-TO-DATE
27-Jun-2019 14:24:46 > Task :spring-expression:checkstyleMain
27-Jun-2019 14:24:47 > Task :spring-expression:checkstyleTest
27-Jun-2019 14:24:49 > Task :spring-expression:test
27-Jun-2019 14:24:49 > Task :spring-expression:check
27-Jun-2019 14:24:49 > Task :spring-framework-bom:compileKotlin NO-SOURCE
27-Jun-2019 14:24:49 > Task :spring-framework-bom:compileJava NO-SOURCE
27-Jun-2019 14:24:49 > Task :spring-framework-bom:processResources NO-SOURCE
27-Jun-2019 14:24:49 > Task :spring-framework-bom:classes UP-TO-DATE
27-Jun-2019 14:24:49 > Task :spring-framework-bom:checkstyleMain NO-SOURCE
27-Jun-2019 14:24:49 > Task :spring-framework-bom:compileTestKotlin NO-SOURCE
27-Jun-2019 14:24:49 > Task :spring-framework-bom:compileTestJava NO-SOURCE
27-Jun-2019 14:24:49 > Task :spring-framework-bom:processTestResources NO-SOURCE
27-Jun-2019 14:24:49 > Task :spring-framework-bom:testClasses UP-TO-DATE
27-Jun-2019 14:24:49 > Task :spring-framework-bom:checkstyleTest NO-SOURCE
27-Jun-2019 14:24:49 > Task :spring-framework-bom:test NO-SOURCE
27-Jun-2019 14:24:49 > Task :spring-framework-bom:check UP-TO-DATE
27-Jun-2019 14:24:49 > Task :spring-instrument:checkstyleMain
27-Jun-2019 14:24:49 > Task :spring-instrument:checkstyleTest NO-SOURCE
27-Jun-2019 14:24:49 > Task :spring-instrument:test NO-SOURCE
27-Jun-2019 14:24:49 > Task :spring-instrument:check
27-Jun-2019 14:24:49 > Task :spring-jcl:checkstyleMain
27-Jun-2019 14:24:49 > Task :spring-jcl:checkstyleTest NO-SOURCE
27-Jun-2019 14:24:49 > Task :spring-jcl:test NO-SOURCE
27-Jun-2019 14:24:49 > Task :spring-jcl:check
27-Jun-2019 14:24:50 > Task :spring-jdbc:checkstyleMain
27-Jun-2019 14:24:51 > Task :spring-jdbc:checkstyleTest
27-Jun-2019 14:25:00 > Task :spring-jdbc:test
27-Jun-2019 14:25:00 > Task :spring-jdbc:check
27-Jun-2019 14:25:00 > Task :spring-jms:compileKotlin
27-Jun-2019 14:25:01 > Task :spring-jms:compileJava
27-Jun-2019 14:25:01 > Task :spring-jms:processResources
27-Jun-2019 14:25:01 > Task :spring-jms:classes
27-Jun-2019 14:25:02 > Task :spring-jms:checkstyleMain
27-Jun-2019 14:25:02 > Task :spring-jms:compileTestKotlin
27-Jun-2019 14:25:02 > Task :spring-jms:compileTestJava
27-Jun-2019 14:25:02 > Task :spring-jms:processTestResources
27-Jun-2019 14:25:02 > Task :spring-jms:testClasses
27-Jun-2019 14:25:03 > Task :spring-jms:checkstyleTest
27-Jun-2019 14:25:07 > Task :spring-jms:test
27-Jun-2019 14:25:07 > Task :spring-jms:check
27-Jun-2019 14:25:09 > Task :spring-messaging:checkstyleMain
27-Jun-2019 14:25:09 > Task :spring-messaging:checkstyleTest
27-Jun-2019 14:25:39 > Task :spring-messaging:test
27-Jun-2019 14:25:55 > Task :spring-messaging:check
27-Jun-2019 14:25:56 > Task :spring-orm:checkstyleMain
27-Jun-2019 14:25:56 > Task :spring-orm:checkstyleTest
27-Jun-2019 14:26:02 > Task :spring-orm:test
27-Jun-2019 14:26:02 > Task :spring-orm:check
27-Jun-2019 14:26:02 > Task :spring-oxm:checkstyleMain
27-Jun-2019 14:26:03 > Task :spring-oxm:checkstyleTest
27-Jun-2019 14:26:05 > Task :spring-oxm:test
27-Jun-2019 14:26:05 > Task :spring-oxm:check
27-Jun-2019 14:26:15 > Task :spring-test:testJUnitJupiter
27-Jun-2019 14:26:22 > Task :spring-test:testNG
27-Jun-2019 14:26:52 > Task :spring-test:test
27-Jun-2019 14:26:56 > Task :spring-test:aggregateTestReports
27-Jun-2019 14:26:59 > Task :spring-test:checkstyleMain
27-Jun-2019 14:27:01 > Task :spring-test:checkstyleTest
27-Jun-2019 14:27:01 > Task :spring-test:check
27-Jun-2019 14:27:02 > Task :spring-tx:checkstyleMain
27-Jun-2019 14:27:03 > Task :spring-tx:checkstyleTest
27-Jun-2019 14:27:07 > Task :spring-tx:test
27-Jun-2019 14:27:07 > Task :spring-tx:check
27-Jun-2019 14:27:11 > Task :spring-web:checkstyleMain
27-Jun-2019 14:27:14 > Task :spring-web:checkstyleTest
27-Jun-2019 14:27:35 > Task :spring-web:test
27-Jun-2019 14:27:35 > Task :spring-web:check
27-Jun-2019 14:27:37 > Task :spring-webflux:checkstyleMain
27-Jun-2019 14:27:38 > Task :spring-webflux:checkstyleTest
27-Jun-2019 14:28:00
27-Jun-2019 14:28:00 > Task :spring-webflux:test
27-Jun-2019 14:28:00
27-Jun-2019 14:28:00 org.springframework.web.reactive.result.method.annotation.MultipartIntegrationTests > transferTo[server [org.springframework.http.server.reactive.bootstrap.TomcatHttpServer@4eff5bdb]] FAILED
27-Jun-2019 14:28:00     org.junit.ComparisonFailure at MultipartIntegrationTests.java:173
27-Jun-2019 14:29:12
27-Jun-2019 14:29:12 1752 tests completed, 1 failed, 18 skipped
27-Jun-2019 14:29:13
27-Jun-2019 14:29:13 > Task :spring-webflux:test FAILED
27-Jun-2019 14:29:13
27-Jun-2019 14:29:13 FAILURE: Build failed with an exception.
27-Jun-2019 14:29:13
27-Jun-2019 14:29:13 * What went wrong:
27-Jun-2019 14:29:13 Execution failed for task ':spring-webflux:test'.
27-Jun-2019 14:29:13 > There were failing tests. See the report at: file:///opt/bamboo-home/xml-data/build-dir/SPR-PUB-JOB1/spring-webflux/build/reports/tests/test/index.html
27-Jun-2019 14:29:13
27-Jun-2019 14:29:13 * Try:
27-Jun-2019 14:29:13 Run with --info or --debug option to get more log output. Run with --scan to get full insights.
27-Jun-2019 14:29:13
27-Jun-2019 14:29:13 * Exception is:
27-Jun-2019 14:29:13 org.gradle.api.tasks.TaskExecutionException: Execution failed for task ':spring-webflux:test'.
27-Jun-2019 14:29:13         at org.gradle.api.internal.tasks.execution.ExecuteActionsTaskExecuter$3.accept(ExecuteActionsTaskExecuter.java:151)
27-Jun-2019 14:29:13         at org.gradle.api.internal.tasks.execution.ExecuteActionsTaskExecuter$3.accept(ExecuteActionsTaskExecuter.java:148)
27-Jun-2019 14:29:13         at org.gradle.internal.Try$Failure.ifSuccessfulOrElse(Try.java:191)
27-Jun-2019 14:29:13         at org.gradle.api.internal.tasks.execution.ExecuteActionsTaskExecuter.execute(ExecuteActionsTaskExecuter.java:141)
27-Jun-2019 14:29:13         at org.gradle.api.internal.tasks.execution.ResolveBeforeExecutionStateTaskExecuter.execute(ResolveBeforeExecutionStateTaskExecuter.java:75)
27-Jun-2019 14:29:13         at org.gradle.api.internal.tasks.execution.ValidatingTaskExecuter.execute(ValidatingTaskExecuter.java:62)
27-Jun-2019 14:29:13         at org.gradle.api.internal.tasks.execution.SkipEmptySourceFilesTaskExecuter.execute(SkipEmptySourceFilesTaskExecuter.java:108)
27-Jun-2019 14:29:13         at org.gradle.api.internal.tasks.execution.ResolveBeforeExecutionOutputsTaskExecuter.execute(ResolveBeforeExecutionOutputsTaskExecuter.java:67)
27-Jun-2019 14:29:13         at org.gradle.api.internal.tasks.execution.ResolveAfterPreviousExecutionStateTaskExecuter.execute(ResolveAfterPreviousExecutionStateTaskExecuter.java:46)
27-Jun-2019 14:29:13         at org.gradle.api.internal.tasks.execution.CleanupStaleOutputsExecuter.execute(CleanupStaleOutputsExecuter.java:94)
27-Jun-2019 14:29:13         at org.gradle.api.internal.tasks.execution.FinalizePropertiesTaskExecuter.execute(FinalizePropertiesTaskExecuter.java:46)
27-Jun-2019 14:29:13         at org.gradle.api.internal.tasks.execution.ResolveTaskExecutionModeExecuter.execute(ResolveTaskExecutionModeExecuter.java:95)
27-Jun-2019 14:29:13         at org.gradle.api.internal.tasks.execution.SkipTaskWithNoActionsExecuter.execute(SkipTaskWithNoActionsExecuter.java:57)
27-Jun-2019 14:29:13         at org.gradle.api.internal.tasks.execution.SkipOnlyIfTaskExecuter.execute(SkipOnlyIfTaskExecuter.java:56)
27-Jun-2019 14:29:13         at org.gradle.api.internal.tasks.execution.CatchExceptionTaskExecuter.execute(CatchExceptionTaskExecuter.java:36)
27-Jun-2019 14:29:13         at org.gradle.api.internal.tasks.execution.EventFiringTaskExecuter$1.executeTask(EventFiringTaskExecuter.java:73)
27-Jun-2019 14:29:13         at org.gradle.api.internal.tasks.execution.EventFiringTaskExecuter$1.call(EventFiringTaskExecuter.java:52)
27-Jun-2019 14:29:13         at org.gradle.api.internal.tasks.execution.EventFiringTaskExecuter$1.call(EventFiringTaskExecuter.java:49)
27-Jun-2019 14:29:13         at org.gradle.internal.operations.DefaultBuildOperationExecutor$CallableBuildOperationWorker.execute(DefaultBuildOperationExecutor.java:416)
27-Jun-2019 14:29:13         at org.gradle.internal.operations.DefaultBuildOperationExecutor$CallableBuildOperationWorker.execute(DefaultBuildOperationExecutor.java:406)
27-Jun-2019 14:29:13         at org.gradle.internal.operations.DefaultBuildOperationExecutor$1.execute(DefaultBuildOperationExecutor.java:165)
27-Jun-2019 14:29:13         at org.gradle.internal.operations.DefaultBuildOperationExecutor.execute(DefaultBuildOperationExecutor.java:250)
27-Jun-2019 14:29:13         at org.gradle.internal.operations.DefaultBuildOperationExecutor.execute(DefaultBuildOperationExecutor.java:158)
27-Jun-2019 14:29:13         at org.gradle.internal.operations.DefaultBuildOperationExecutor.call(DefaultBuildOperationExecutor.java:102)
27-Jun-2019 14:29:13         at org.gradle.internal.operations.DelegatingBuildOperationExecutor.call(DelegatingBuildOperationExecutor.java:36)
27-Jun-2019 14:29:13         at org.gradle.api.internal.tasks.execution.EventFiringTaskExecuter.execute(EventFiringTaskExecuter.java:49)
27-Jun-2019 14:29:13         at org.gradle.execution.plan.LocalTaskNodeExecutor.execute(LocalTaskNodeExecutor.java:43)
27-Jun-2019 14:29:13         at org.gradle.execution.taskgraph.DefaultTaskExecutionGraph$InvokeNodeExecutorsAction.execute(DefaultTaskExecutionGraph.java:355)
27-Jun-2019 14:29:13         at org.gradle.execution.taskgraph.DefaultTaskExecutionGraph$InvokeNodeExecutorsAction.execute(DefaultTaskExecutionGraph.java:343)
27-Jun-2019 14:29:13         at org.gradle.execution.taskgraph.DefaultTaskExecutionGraph$BuildOperationAwareExecutionAction.execute(DefaultTaskExecutionGraph.java:336)
27-Jun-2019 14:29:13         at org.gradle.execution.taskgraph.DefaultTaskExecutionGraph$BuildOperationAwareExecutionAction.execute(DefaultTaskExecutionGraph.java:322)
27-Jun-2019 14:29:13         at org.gradle.execution.plan.DefaultPlanExecutor$ExecutorWorker$1.execute(DefaultPlanExecutor.java:134)
27-Jun-2019 14:29:13         at org.gradle.execution.plan.DefaultPlanExecutor$ExecutorWorker$1.execute(DefaultPlanExecutor.java:129)
27-Jun-2019 14:29:13         at org.gradle.execution.plan.DefaultPlanExecutor$ExecutorWorker.execute(DefaultPlanExecutor.java:202)
27-Jun-2019 14:29:13         at org.gradle.execution.plan.DefaultPlanExecutor$ExecutorWorker.executeNextNode(DefaultPlanExecutor.java:193)
27-Jun-2019 14:29:13         at org.gradle.execution.plan.DefaultPlanExecutor$ExecutorWorker.run(DefaultPlanExecutor.java:129)
27-Jun-2019 14:29:13         at org.gradle.internal.concurrent.ExecutorPolicy$CatchAndRecordFailures.onExecute(ExecutorPolicy.java:63)
27-Jun-2019 14:29:13         at org.gradle.internal.concurrent.ManagedExecutorImpl$1.run(ManagedExecutorImpl.java:46)
27-Jun-2019 14:29:13         at org.gradle.internal.concurrent.ThreadFactoryImpl$ManagedThreadRunnable.run(ThreadFactoryImpl.java:55)
27-Jun-2019 14:29:13 Caused by: org.gradle.api.GradleException: There were failing tests. See the report at: file:///opt/bamboo-home/xml-data/build-dir/SPR-PUB-JOB1/spring-webflux/build/reports/tests/test/index.html
27-Jun-2019 14:29:13         at org.gradle.api.tasks.testing.AbstractTestTask.handleTestFailures(AbstractTestTask.java:626)
27-Jun-2019 14:29:13         at org.gradle.api.tasks.testing.AbstractTestTask.executeTests(AbstractTestTask.java:498)
27-Jun-2019 14:29:13         at org.gradle.api.tasks.testing.Test.executeTests(Test.java:594)
27-Jun-2019 14:29:13         at org.gradle.internal.reflect.JavaMethod.invoke(JavaMethod.java:103)
27-Jun-2019 14:29:13         at org.gradle.api.internal.project.taskfactory.StandardTaskAction.doExecute(StandardTaskAction.java:48)
27-Jun-2019 14:29:13         at org.gradle.api.internal.project.taskfactory.StandardTaskAction.execute(StandardTaskAction.java:41)
27-Jun-2019 14:29:13         at org.gradle.api.internal.project.taskfactory.StandardTaskAction.execute(StandardTaskAction.java:28)
27-Jun-2019 14:29:13         at org.gradle.api.internal.AbstractTask$TaskActionWrapper.execute(AbstractTask.java:702)
27-Jun-2019 14:29:13         at org.gradle.api.internal.AbstractTask$TaskActionWrapper.execute(AbstractTask.java:669)
27-Jun-2019 14:29:13         at org.gradle.api.internal.tasks.execution.ExecuteActionsTaskExecuter$5.run(ExecuteActionsTaskExecuter.java:404)
27-Jun-2019 14:29:13         at org.gradle.internal.operations.DefaultBuildOperationExecutor$RunnableBuildOperationWorker.execute(DefaultBuildOperationExecutor.java:402)
27-Jun-2019 14:29:13         at org.gradle.internal.operations.DefaultBuildOperationExecutor$RunnableBuildOperationWorker.execute(DefaultBuildOperationExecutor.java:394)
27-Jun-2019 14:29:13         at org.gradle.internal.operations.DefaultBuildOperationExecutor$1.execute(DefaultBuildOperationExecutor.java:165)
27-Jun-2019 14:29:13         at org.gradle.internal.operations.DefaultBuildOperationExecutor.execute(DefaultBuildOperationExecutor.java:250)
27-Jun-2019 14:29:13         at org.gradle.internal.operations.DefaultBuildOperationExecutor.execute(DefaultBuildOperationExecutor.java:158)
27-Jun-2019 14:29:13         at org.gradle.internal.operations.DefaultBuildOperationExecutor.run(DefaultBuildOperationExecutor.java:92)
27-Jun-2019 14:29:13         at org.gradle.internal.operations.DelegatingBuildOperationExecutor.run(DelegatingBuildOperationExecutor.java:31)
27-Jun-2019 14:29:13         at org.gradle.api.internal.tasks.execution.ExecuteActionsTaskExecuter.executeAction(ExecuteActionsTaskExecuter.java:393)
27-Jun-2019 14:29:13         at org.gradle.api.internal.tasks.execution.ExecuteActionsTaskExecuter.executeActions(ExecuteActionsTaskExecuter.java:376)
27-Jun-2019 14:29:13         at org.gradle.api.internal.tasks.execution.ExecuteActionsTaskExecuter.access$200(ExecuteActionsTaskExecuter.java:80)
27-Jun-2019 14:29:13         at org.gradle.api.internal.tasks.execution.ExecuteActionsTaskExecuter$TaskExecution.execute(ExecuteActionsTaskExecuter.java:213)
27-Jun-2019 14:29:13         at org.gradle.internal.execution.steps.ExecuteStep.lambda$execute$1(ExecuteStep.java:33)
27-Jun-2019 14:29:13         at org.gradle.internal.execution.steps.ExecuteStep.execute(ExecuteStep.java:33)
27-Jun-2019 14:29:13         at org.gradle.internal.execution.steps.ExecuteStep.execute(ExecuteStep.java:26)
27-Jun-2019 14:29:13         at org.gradle.internal.execution.steps.CleanupOutputsStep.execute(CleanupOutputsStep.java:58)
27-Jun-2019 14:29:13         at org.gradle.internal.execution.steps.CleanupOutputsStep.execute(CleanupOutputsStep.java:35)
27-Jun-2019 14:29:13         at org.gradle.internal.execution.steps.ResolveInputChangesStep.execute(ResolveInputChangesStep.java:48)
27-Jun-2019 14:29:13         at org.gradle.internal.execution.steps.ResolveInputChangesStep.execute(ResolveInputChangesStep.java:33)
27-Jun-2019 14:29:13         at org.gradle.internal.execution.steps.CancelExecutionStep.execute(CancelExecutionStep.java:39)
27-Jun-2019 14:29:13         at org.gradle.internal.execution.steps.TimeoutStep.executeWithoutTimeout(TimeoutStep.java:73)
27-Jun-2019 14:29:13         at org.gradle.internal.execution.steps.TimeoutStep.execute(TimeoutStep.java:54)
27-Jun-2019 14:29:13         at org.gradle.internal.execution.steps.CatchExceptionStep.execute(CatchExceptionStep.java:35)
27-Jun-2019 14:29:13         at org.gradle.internal.execution.steps.CreateOutputsStep.execute(CreateOutputsStep.java:51)
27-Jun-2019 14:29:13         at org.gradle.internal.execution.steps.SnapshotOutputsStep.execute(SnapshotOutputsStep.java:45)
27-Jun-2019 14:29:13         at org.gradle.internal.execution.steps.SnapshotOutputsStep.execute(SnapshotOutputsStep.java:31)
27-Jun-2019 14:29:13         at org.gradle.internal.execution.steps.CacheStep.executeWithoutCache(CacheStep.java:201)
27-Jun-2019 14:29:13         at org.gradle.internal.execution.steps.CacheStep.execute(CacheStep.java:70)
27-Jun-2019 14:29:13         at org.gradle.internal.execution.steps.CacheStep.execute(CacheStep.java:45)
27-Jun-2019 14:29:13         at org.gradle.internal.execution.steps.BroadcastChangingOutputsStep.execute(BroadcastChangingOutputsStep.java:49)
27-Jun-2019 14:29:13         at org.gradle.internal.execution.steps.StoreSnapshotsStep.execute(StoreSnapshotsStep.java:43)
27-Jun-2019 14:29:13         at org.gradle.internal.execution.steps.StoreSnapshotsStep.execute(StoreSnapshotsStep.java:32)
27-Jun-2019 14:29:13         at org.gradle.internal.execution.steps.RecordOutputsStep.execute(RecordOutputsStep.java:38)
27-Jun-2019 14:29:13         at org.gradle.internal.execution.steps.RecordOutputsStep.execute(RecordOutputsStep.java:24)
27-Jun-2019 14:29:13         at org.gradle.internal.execution.steps.SkipUpToDateStep.executeBecause(SkipUpToDateStep.java:96)
27-Jun-2019 14:29:13         at org.gradle.internal.execution.steps.SkipUpToDateStep.lambda$execute$0(SkipUpToDateStep.java:89)
27-Jun-2019 14:29:13         at org.gradle.internal.execution.steps.SkipUpToDateStep.execute(SkipUpToDateStep.java:54)
27-Jun-2019 14:29:13         at org.gradle.internal.execution.steps.SkipUpToDateStep.execute(SkipUpToDateStep.java:38)
27-Jun-2019 14:29:13         at org.gradle.internal.execution.steps.ResolveChangesStep.execute(ResolveChangesStep.java:77)
27-Jun-2019 14:29:13         at org.gradle.internal.execution.steps.ResolveChangesStep.execute(ResolveChangesStep.java:37)
27-Jun-2019 14:29:13         at org.gradle.internal.execution.steps.legacy.MarkSnapshottingInputsFinishedStep.execute(MarkSnapshottingInputsFinishedStep.java:36)
27-Jun-2019 14:29:13         at org.gradle.internal.execution.steps.legacy.MarkSnapshottingInputsFinishedStep.execute(MarkSnapshottingInputsFinishedStep.java:26)
27-Jun-2019 14:29:13         at org.gradle.internal.execution.steps.ResolveCachingStateStep.execute(ResolveCachingStateStep.java:90)
27-Jun-2019 14:29:13         at org.gradle.internal.execution.steps.ResolveCachingStateStep.execute(ResolveCachingStateStep.java:48)
27-Jun-2019 14:29:13         at org.gradle.internal.execution.impl.DefaultWorkExecutor.execute(DefaultWorkExecutor.java:33)
27-Jun-2019 14:29:13         at org.gradle.api.internal.tasks.execution.ExecuteActionsTaskExecuter.execute(ExecuteActionsTaskExecuter.java:120)
27-Jun-2019 14:29:13         ... 35 more
27-Jun-2019 14:29:13
27-Jun-2019 14:29:13
27-Jun-2019 14:29:13 * Get more help at https://help.gradle.org
27-Jun-2019 14:29:13
27-Jun-2019 14:29:13 Deprecated Gradle features were used in this build, making it incompatible with Gradle 6.0.
27-Jun-2019 14:29:13
27-Jun-2019 14:29:13 Use '--warning-mode all' to show the individual deprecation warnings.
27-Jun-2019 14:29:13 BUILD FAILED in 8m 24s
27-Jun-2019 14:29:13 See https://docs.gradle.org/5.4.1/userguide/command_line_interface.html#sec:command_line_warnings
27-Jun-2019 14:29:13 249 actionable tasks: 225 executed, 24 up-to-date
27-Jun-2019 14:29:13
27-Jun-2019 14:29:13 Failing task since return code of [./gradlew --refresh-dependencies --no-daemon -PtestGroups=ci -P BRANCH_NAME=master --stacktrace clean check build -I /tmp/artifactory.init.script2456089709725290415gradle -DbuildInfoConfig.propertiesFile=/tmp/buildinfo930146274758787963properties artifactoryPublish -Dartifactory.resolve.password=******** -Dartifactory.publish.password=********] was 1 while expected 0
27-Jun-2019 14:29:13 Parsing test results under /opt/bamboo-home/xml-data/build-dir/SPR-PUB-JOB1...
27-Jun-2019 14:29:15 Finished task 'Artifactory Gradle' with result: Failed
27-Jun-2019 14:29:15 Running post build plugin 'Docker Container Cleanup'
27-Jun-2019 14:29:15 Running post build plugin 'NCover Results Collector'
27-Jun-2019 14:29:15 Running post build plugin 'Artifactory Release Management Staging'
27-Jun-2019 14:29:15 Running post build plugin 'Artifactory Build Info Copier'
27-Jun-2019 14:29:15 Running post build plugin 'Artifactory Gradle Properties Info Copier'
27-Jun-2019 14:29:15 Running post build plugin 'Clover Results Collector'
27-Jun-2019 14:29:15 Running post build plugin 'npm Cache Cleanup'
27-Jun-2019 14:29:15 Running post build plugin 'Artifact Copier'
27-Jun-2019 14:29:16 Successfully removed working directory at '/opt/bamboo-home/xml-data/build-dir/SPR-PUB-JOB1'
27-Jun-2019 14:29:16 Finalising the build...
27-Jun-2019 14:29:16 Stopping timer.
27-Jun-2019 14:29:16 Build SPR-PUB-JOB1-7537 completed.
27-Jun-2019 14:29:16 Running on server: post build plugin 'NCover Results Collector'
27-Jun-2019 14:29:16 Running on server: post build plugin 'Build Hanging Detection Configuration'
27-Jun-2019 14:29:16 Running on server: post build plugin 'Clover Delta Calculator'
27-Jun-2019 14:29:16 Running on server: post build plugin 'Maven Dependencies Postprocessor'
27-Jun-2019 14:29:16 All post build plugins have finished
27-Jun-2019 14:29:16 Generating build results summary...
27-Jun-2019 14:29:36 Saving build results to disk...
27-Jun-2019 14:29:36 Logging substituted variables...
27-Jun-2019 14:29:36 Indexing build results...
27-Jun-2019 14:29:36 Finished building SPR-PUB-JOB1-7537.