Build #7,554

Build: #7554 failed

Job: Default Job failed

Stages & jobs

  1. Default Stage

Build log

The build generated 592 lines of output. Download or view full build log

05-Jul-2019 09:56:31 Build Spring Framework - Publication - Default Job #7554 (SPR-PUB-JOB1-7554) started building on agent bamboo-15.af.pivotal.io
05-Jul-2019 09:56:31 Remote agent on host bamboo-15.af.pivotal.io
05-Jul-2019 09:56:31 Build working directory is /opt/bamboo-home/xml-data/build-dir/SPR-PUB-JOB1
05-Jul-2019 09:56:31 Executing build Spring Framework - Publication - Default Job #7554 (SPR-PUB-JOB1-7554)
05-Jul-2019 09:56:31 Starting task 'Checkout Default Repository' of type 'com.atlassian.bamboo.plugins.vcs:task.vcs.checkout'
05-Jul-2019 09:56:31 Build always requires a clean checkout
05-Jul-2019 09:56:31 Cleaning build directory '/opt/bamboo-home/xml-data/build-dir/SPR-PUB-JOB1'
05-Jul-2019 09:56:31 Checking out into /opt/bamboo-home/xml-data/build-dir/SPR-PUB-JOB1
05-Jul-2019 09:56:31 Updating source code to revision: 97d020c509f939babbd6a65ce98e6ffef3847af4
05-Jul-2019 09:56:31 Creating local git repository in '/opt/bamboo-home/xml-data/build-dir/SPR-PUB-JOB1/.git'.
05-Jul-2019 09:56:31 Initialized empty Git repository in /opt/bamboo-home/xml-data/build-dir/SPR-PUB-JOB1/.git/
05-Jul-2019 09:56:32 Fetching 'refs/heads/master' from 'https://github.com/spring-projects/spring-framework.git'.
05-Jul-2019 09:56:46 From https://github.com/spring-projects/spring-framework
05-Jul-2019 09:56:46 * [new branch]      master     -> master
05-Jul-2019 09:56:46 * [new tag]               v3.1.0.RELEASE -> v3.1.0.RELEASE
05-Jul-2019 09:56:46 * [new tag]               v3.2.0.M1      -> v3.2.0.M1
05-Jul-2019 09:56:46 * [new tag]               v3.2.0.M2      -> v3.2.0.M2
05-Jul-2019 09:56:46 * [new tag]               v3.2.0.RC1     -> v3.2.0.RC1
05-Jul-2019 09:56:46 * [new tag]               v3.2.0.RC2-A   -> v3.2.0.RC2-A
05-Jul-2019 09:56:46 * [new tag]               v3.2.0.RELEASE -> v3.2.0.RELEASE
05-Jul-2019 09:56:46 * [new tag]               v3.2.1.RELEASE -> v3.2.1.RELEASE
05-Jul-2019 09:56:46 * [new tag]               v3.2.2.RELEASE -> v3.2.2.RELEASE
05-Jul-2019 09:56:46 * [new tag]               v4.0.0.M1      -> v4.0.0.M1
05-Jul-2019 09:56:46 * [new tag]               v4.0.0.M2      -> v4.0.0.M2
05-Jul-2019 09:56:46 * [new tag]               v4.0.0.M3      -> v4.0.0.M3
05-Jul-2019 09:56:46 * [new tag]               v4.0.0.RC1     -> v4.0.0.RC1
05-Jul-2019 09:56:46 * [new tag]               v4.0.0.RC2     -> v4.0.0.RC2
05-Jul-2019 09:56:46 Checking out revision 97d020c509f939babbd6a65ce98e6ffef3847af4.
05-Jul-2019 09:56:46 Already on 'master'
05-Jul-2019 09:56:46 Updated source code to revision: 97d020c509f939babbd6a65ce98e6ffef3847af4
05-Jul-2019 09:56:46 Finished task 'Checkout Default Repository' with result: Success
05-Jul-2019 09:56:46 Running pre-build action: Artifactory Release Staging
05-Jul-2019 09:56:46 Running pre-build action: VCS Version Collector
05-Jul-2019 09:56:47
Substituting variable: ${bamboo.spr.jdk.home} with /opt/jdk-8
05-Jul-2019 09:56:47
Substituting variable: ${bamboo.repository.branch.name} with master
05-Jul-2019 09:56:47 Starting task 'Artifactory Gradle' of type 'org.jfrog.bamboo.bamboo-artifactory-plugin:artifactoryGradleTask'
05-Jul-2019 09:56:47 Bamboo Artifactory Plugin version: 2.6.3
05-Jul-2019 09:56:47
Beginning to execute external process for build 'Spring Framework - Publication - Default Job #7554 (SPR-PUB-JOB1-7554)'
... running command line:
./gradlew --refresh-dependencies --no-daemon -PtestGroups=ci -P BRANCH_NAME=master --stacktrace clean check build -I /tmp/artifactory.init.script3043945794577963886gradle -DbuildInfoConfig.propertiesFile=/tmp/buildinfo2981556400385977756properties artifactoryPublish -Dartifactory.resolve.password=******** -Dartifactory.publish.password=********
... in: /opt/bamboo-home/xml-data/build-dir/SPR-PUB-JOB1
... using extra environment variables:
bamboo_planRepository_1_branch=master
bamboo_capability_system_builder_ant_Ant_1_7=/opt/ant-1.7
bamboo_********_username_password=********
bamboo_signing_store_password=********
bamboo_planRepository_2_branch=master
bamboo_capability_system_builder_ant_Ant_1_9=/opt/ant-1.9
bamboo_repository_137199621_git_repositoryUrl=https://github.com/spring-projects/spring-framework.git
bamboo_capability_system_builder_ant_Ant_1_8=/opt/ant-1.8
bamboo_planRepository_1_branchDisplayName=master
bamboo_artifactory_override_resolve_repo=libs-milestone
bamboo_capability_system_builder_node_Node_js_10_16=/opt/node-10.16/bin/node
bamboo_repository_revision_number=97d020c509f939babbd6a65ce98e6ffef3847af4
bamboo_repository_262406229_git_repositoryUrl=https://github.com/spring-projects/spring-framework.git
bamboo_artifactory_task_override_jdk=true
bamboo_RIAK_BIN=/usr/sbin/riak
WRAPPER_BITS=32
bamboo_buildKey=SPR-PUB-JOB1
bamboo_repository_137199621_name=Plan Repository
bamboo_spr_jdk_home=/opt/jdk-8
bamboo_bintray_password=********
bamboo_sonar_token_password=********
PWD=/opt/bamboo-home/bin
bamboo_planRepository_2_branchDisplayName=master
bamboo_shortJobName=Default Job
bamboo_artifactory_override_resolver_password=********
bamboo_sonatype_token=RSJChaox
bamboo_capability_system_builder_gradle___gradlew=./gradlew
bamboo_buildResultsUrl=https://build.spring.io/browse/SPR-PUB-JOB1-7554
bamboo_capability_system_builder_mvn3_Maven_3_3=/opt/maven-3.3
bamboo_capability_system_builder_mvn3_Maven_3_2=/opt/maven-3.2
bamboo_capability_system_builder_mvn3_Maven_3_1=/opt/maven-3.1
bamboo_planRepository_repositoryUrl=https://github.com/spring-projects/spring-framework.git
bamboo_capability_system_builder_mvn3_Maven_3_6=/opt/maven-3.6
bamboo_agentId=286195723
bamboo_capability_system_builder_mvn3_Maven_3_5=/opt/maven-3.5
bamboo_capability_system_builder_mvn3_Maven_3_0=/opt/maven-3.0
bamboo_planRepository_revision=97d020c509f939babbd6a65ce98e6ffef3847af4
bamboo_planRepository_previousRevision=3d913b813412c38e1a235b23e1e61adf39711175
bamboo_repository_137199621_revision_number=97d020c509f939babbd6a65ce98e6ffef3847af4
bamboo_capability_remote_build=true
bamboo_repository_branch_name=master
bamboo_sonatype_token_password=********
bamboo_sonatype_user=springsource
SHLVL=1
bamboo_org_jfrog_bamboo_buildInfo_serverUrl=https://repo.spring.io
bamboo_scdf_acceptance_tests_password=********
bamboo_repository_262406229_branch_name=master
WRAPPER_OS=linux
JAVA_HOME=/opt/jdk-8/
TERM=linux
XDG_SESSION_ID=c1
bamboo_planRepository_branch=master
bamboo_org_jfrog_bamboo_release_activated=false
bamboo_planRepository_1_type=gitv2
bamboo_planRepository_branchName=master
bamboo_repository_137199621_git_username=spring-buildmaster
bamboo_capability_system_jdk_JDK_12=/opt/jdk-12
WRAPPER_FILE_SEPARATOR=/
_=/opt/bamboo-home/bin/bamboo-agent.sh
bamboo_repository_262406229_revision_number=97d020c509f939babbd6a65ce98e6ffef3847af4
bamboo_capability_system_builder_ant_Ant_1_10=/opt/ant-1.10
WRAPPER_PATH_SEPARATOR=:
bamboo_sonar_password=********
bamboo_hg_cache_directory=/opt/bamboo-home/xml-data/build-dir/_hg-repositories-cache
bamboo_planRepository_1_username=spring-buildmaster
bamboo_planRepository_type=gitv2
bamboo_repository_262406229_git_branch=master
bamboo_git_cache_directory=/opt/bamboo-home/xml-data/build-dir/_git-repositories-cache
bamboo_planRepository_2_branchName=master
bamboo_artifactory_username=buildmaster
bamboo_tmp_directory=/opt/bamboo-home/temp
bamboo_planKey=SPR-PUB
bamboo_planRepository_username=spring-buildmaster
bamboo_JDK8_HOME=/opt/jdk-8
bamboo_snifftask=sniff
bamboo_planRepository_1_branchName=master
bamboo_sonar_version=5.6.3
bamboo_sonar_jdbc_password=********
bamboo_bintray_api_key_password=********
GRADLE_OPTS=-Xms128m
bamboo_repository_262406229_git_username=spring-buildmaster
XDG_DATA_DIRS=/usr/local/share:/usr/share:/var/lib/snapd/desktop
bamboo_capability_system_jdk_JDK_1_11=/opt/jdk-11
bamboo_resultsUrl=https://build.spring.io/browse/SPR-PUB-JOB1-7554
bamboo_capability_system_jdk_JDK_1_10=/opt/jdk-10
bamboo_build_working_directory=/opt/bamboo-home/xml-data/build-dir/SPR-PUB-JOB1
bamboo_planRepository_1_name=Spring Framework
bamboo_capability_system_os=ubuntu1804
bamboo_nexusPush_stagingProfile=buildmaster
bamboo_shortPlanName=Publication
MAIL=/var/mail/bamboo
bamboo_planRepository_2_username=spring-buildmaster
bamboo_repository_137199621_branch_name=master
bamboo_planRepository_name=Spring Framework
LOGNAME=bamboo
bamboo_buildNumber=7554
bamboo_repository_137199621_git_branch=master
SHELL=/bin/bash
bamboo_planName=Spring Framework - Publication
bamboo_JDK7_HOME=/opt/jdk-7
bamboo_repository_137199621_previous_revision_number=3d913b813412c38e1a235b23e1e61adf39711175
bamboo_shortPlanKey=PUB
OLDPWD=/opt/users/bamboo
bamboo_shortJobKey=JOB1
bamboo_artifactory_password=********
bamboo_repository_262406229_name=Spring Framework
bamboo_planRepository_2_name=Plan Repository
bamboo_repository_262406229_previous_revision_number=3d913b813412c38e1a235b23e1e61adf39711175
bamboo_buildTimeStamp=2019-07-05T09:56:31.765Z
bamboo_repository_previous_revision_number=3d913b813412c38e1a235b23e1e61adf39711175
bamboo_sonar_username=buildmaster
bamboo_********_password=********
bamboo_repository_git_branch=master
bamboo_buildResultKey=SPR-PUB-JOB1-7554
bamboo_nexusPush_close=true
bamboo_artifactory_override_resolver_username=buildmaster
bamboo_buildPlanName=Spring Framework - Publication - Default Job
bamboo_planRepository_1_revision=97d020c509f939babbd6a65ce98e6ffef3847af4
bamboo_repository_name=Plan Repository
bamboo_signing_key_password=********
bamboo_planRepository_2_previousRevision=3d913b813412c38e1a235b23e1e61adf39711175
bamboo_capability_system_builder_groovy_Groovy_2_5=/opt/groovy-2.5
LANG=en_US.UTF-8
bamboo_buildFailed=false
bamboo_capability_system_docker_executable=/usr/bin/docker
DISPLAY=localhost:1.0
bamboo_capability_system_jdk_OpenJDK_7=/opt/jdk-7
bamboo_capability_system_builder_groovy_Groovy_2_4=/opt/groovy-2.4
bamboo_artifactory_override_deployer_username=buildmaster
bamboo_artifactory_password_mask_b=********
bamboo_capability_system_builder_command_Bash=/bin/bash
bamboo_artifactory_password_mask_a=********
bamboo_agentWorkingDirectory=/opt/bamboo-home/xml-data/build-dir
bamboo_planRepository_2_revision=97d020c509f939babbd6a65ce98e6ffef3847af4
bamboo_capability_system_git_executable=/usr/bin/git
bamboo_repository_git_username=spring-buildmaster
bamboo_planRepository_1_previousRevision=3d913b813412c38e1a235b23e1e61adf39711175
bamboo_capability_os_family=unix
bamboo_planRepository_branchDisplayName=master
bamboo_capability_system_builder_maven_Artifactory_Maven_3_6=/opt/maven-3.6
bamboo_capability_system_builder_maven_Artifactory_Maven_3_5=/opt/maven-3.5
GIT_SSL_NO_VERIFY=true
bamboo_capability_system_builder_maven_Artifactory_Maven_3_3=/opt/maven-3.3
bamboo_planRepository_2_type=gitv2
bamboo_capability_system_builder_maven_Artifactory_Maven_3_2=/opt/maven-3.2
bamboo_s3_properties=/home/bamboo/tools/s3.properties
bamboo_capability_system_builder_maven_Artifactory_Maven_3_1=/opt/maven-3.1
bamboo_artifactory_override_deploy_repo=libs-snapshot-local
bamboo_capability_system_builder_maven_Artifactory_Maven_3_0=/opt/maven-3.0
bamboo_plan_storageTag=SPR-PUB
bamboo_bintray_username_password=********
bamboo_planRepository_2_repositoryUrl=https://github.com/spring-projects/spring-framework.git
USER=bamboo
bamboo_repository_git_repositoryUrl=https://github.com/spring-projects/spring-framework.git
bamboo_working_directory=/opt/bamboo-home/xml-data/build-dir/SPR-PUB-JOB1
bamboo_org_jfrog_bamboo_buildInfo_activated=true
bamboo_planRepository_1_repositoryUrl=https://github.com/spring-projects/spring-framework.git
bamboo_capability_system_jdk_JDK_1_8=/opt/jdk-8
bamboo_artifactory_override_deployer_password=********
bamboo_capability_system_jdk_JDK_1_9=/opt/jdk-9
WRAPPER_ARCH=x86
bamboo_capability_system_jdk_JDK_1_6=/opt/jdk-6
bamboo_sonatype_password=********
bamboo_capability_system_jdk_JDK_1_7=/opt/jdk-7
bamboo_sonar_ip=10.194.6.9
XDG_RUNTIME_DIR=/run/user/1002
HOME=/home/bamboo
PATH=/bin:/home/bamboo/bin:/usr/local/sbin:/usr/local/bin:/usr/sbin:/usr/bin:/sbin:/bin:/usr/games:/usr/local/games:/snap/bin:/home/bamboo/bin:/usr/local/bin:/bin:/home/bamboo/bin:/usr/local/sbin:/usr/local/bin:/usr/sbin:/usr/bin:/sbin:/bin:/usr/games:/usr/local/games:/snap/bin:/home/bamboo/bin:/usr/local/bin
05-Jul-2019 09:56:49 > Task :buildSrc:compileJava NO-SOURCE
05-Jul-2019 09:56:51 > Task :buildSrc:compileGroovy
05-Jul-2019 09:56:51 > Task :buildSrc:processResources
05-Jul-2019 09:56:51 > Task :buildSrc:classes
05-Jul-2019 09:56:51 > Task :buildSrc:jar
05-Jul-2019 09:56:51 > Task :buildSrc:assemble
05-Jul-2019 09:56:51 > Task :buildSrc:compileTestJava NO-SOURCE
05-Jul-2019 09:56:51 > Task :buildSrc:compileTestGroovy NO-SOURCE
05-Jul-2019 09:56:51 > Task :buildSrc:processTestResources NO-SOURCE
05-Jul-2019 09:56:51 > Task :buildSrc:testClasses UP-TO-DATE
05-Jul-2019 09:56:51 > Task :buildSrc:test NO-SOURCE
05-Jul-2019 09:56:51 > Task :buildSrc:check UP-TO-DATE
05-Jul-2019 09:56:51 > Task :buildSrc:build
05-Jul-2019 09:57:01 Cannot publish pom for project ':spring-core-coroutines' since it does not contain the Maven plugin install task and task ':spring-core-coroutines:artifactoryPublish' does not specify a custom pom path.
05-Jul-2019 09:57:01 Cannot publish pom for project ':' since it does not contain the Maven plugin install task and task ':artifactoryPublish' does not specify a custom pom path.
05-Jul-2019 09:57:01 Cannot publish pom for project ':spring-build-src' since it does not contain the Maven plugin install task and task ':spring-build-src:artifactoryPublish' does not specify a custom pom path.
05-Jul-2019 09:57:03 > Task :clean UP-TO-DATE
05-Jul-2019 09:57:03 > Task :spring-aop:clean UP-TO-DATE
05-Jul-2019 09:57:03 > Task :spring-aspects:clean UP-TO-DATE
05-Jul-2019 09:57:03 > Task :spring-beans:clean UP-TO-DATE
05-Jul-2019 09:57:03 > Task :spring-build-src:clean
05-Jul-2019 09:57:03 > Task :spring-context:clean UP-TO-DATE
05-Jul-2019 09:57:03 > Task :spring-context-indexer:clean UP-TO-DATE
05-Jul-2019 09:57:03 > Task :spring-context-support:clean UP-TO-DATE
05-Jul-2019 09:57:03 > Task :spring-core:clean UP-TO-DATE
05-Jul-2019 09:57:03 > Task :spring-core-coroutines:clean UP-TO-DATE
05-Jul-2019 09:57:03 > Task :spring-expression:clean UP-TO-DATE
05-Jul-2019 09:57:03 > Task :spring-framework-bom:clean UP-TO-DATE
05-Jul-2019 09:57:03 > Task :spring-instrument:clean UP-TO-DATE
05-Jul-2019 09:57:03 > Task :spring-jcl:clean UP-TO-DATE
05-Jul-2019 09:57:03 > Task :spring-jdbc:clean UP-TO-DATE
05-Jul-2019 09:57:03 > Task :spring-jms:clean UP-TO-DATE
05-Jul-2019 09:57:03 > Task :spring-messaging:clean UP-TO-DATE
05-Jul-2019 09:57:03 > Task :spring-orm:clean UP-TO-DATE
05-Jul-2019 09:57:03 > Task :spring-oxm:clean UP-TO-DATE
05-Jul-2019 09:57:03 > Task :spring-test:clean UP-TO-DATE
05-Jul-2019 09:57:03 > Task :spring-tx:clean UP-TO-DATE
05-Jul-2019 09:57:03 > Task :spring-web:clean UP-TO-DATE
05-Jul-2019 09:57:03 > Task :spring-webflux:clean UP-TO-DATE
05-Jul-2019 09:57:03 > Task :spring-webmvc:clean UP-TO-DATE
05-Jul-2019 09:57:03 > Task :spring-websocket:clean UP-TO-DATE
05-Jul-2019 09:57:03 > Task :compileKotlin NO-SOURCE
05-Jul-2019 09:57:03 > Task :compileJava NO-SOURCE
05-Jul-2019 09:57:03 > Task :compileGroovy NO-SOURCE
05-Jul-2019 09:57:03 > Task :processResources NO-SOURCE
05-Jul-2019 09:57:03 > Task :classes UP-TO-DATE
05-Jul-2019 09:57:03 > Task :checkstyleMain NO-SOURCE
05-Jul-2019 09:57:04 > Task :spring-core:cglibRepackJar
05-Jul-2019 09:57:04 > Task :spring-core:objenesisRepackJar
05-Jul-2019 09:57:09 > Task :spring-core-coroutines:compileKotlin
05-Jul-2019 09:57:09 > Task :spring-core-coroutines:compileJava NO-SOURCE
05-Jul-2019 09:57:09 > Task :spring-core-coroutines:processResources NO-SOURCE
05-Jul-2019 09:57:09 > Task :spring-core-coroutines:classes UP-TO-DATE
05-Jul-2019 09:57:09 > Task :spring-core-coroutines:inspectClassesForKotlinIC
05-Jul-2019 09:57:09 > Task :spring-core-coroutines:jar
05-Jul-2019 09:57:09 > Task :spring-jcl:compileKotlin
05-Jul-2019 09:57:09 > Task :spring-jcl:compileJava
05-Jul-2019 09:57:09 > Task :spring-jcl:processResources
05-Jul-2019 09:57:09 > Task :spring-jcl:classes
05-Jul-2019 09:57:09 > Task :spring-jcl:inspectClassesForKotlinIC
05-Jul-2019 09:57:09 > Task :spring-jcl:jar
05-Jul-2019 09:57:11 > Task :spring-core:compileKotlin
05-Jul-2019 09:57:14 > Task :spring-core:compileJava
05-Jul-2019 09:57:14 > Task :spring-core:processResources NO-SOURCE
05-Jul-2019 09:57:14 > Task :spring-core:classes
05-Jul-2019 09:57:14 > Task :spring-core:inspectClassesForKotlinIC
05-Jul-2019 09:57:14 > Task :spring-core:jar
05-Jul-2019 09:57:17 > Task :spring-beans:compileGroovy
05-Jul-2019 09:57:18 > Task :spring-beans:compileKotlin
05-Jul-2019 09:57:18 > Task :spring-beans:compileJava NO-SOURCE
05-Jul-2019 09:57:18 > Task :spring-beans:processResources
05-Jul-2019 09:57:18 > Task :spring-beans:classes
05-Jul-2019 09:57:18 > Task :spring-beans:inspectClassesForKotlinIC
05-Jul-2019 09:57:18 > Task :spring-beans:jar
05-Jul-2019 09:57:18 > Task :spring-aop:compileKotlin
05-Jul-2019 09:57:19 > Task :spring-aop:compileJava
05-Jul-2019 09:57:19 > Task :spring-aop:processResources
05-Jul-2019 09:57:19 > Task :spring-aop:classes
05-Jul-2019 09:57:19 > Task :spring-core-coroutines:compileTestKotlin NO-SOURCE
05-Jul-2019 09:57:19 > Task :spring-core-coroutines:compileTestJava NO-SOURCE
05-Jul-2019 09:57:19 > Task :spring-core-coroutines:processTestResources NO-SOURCE
05-Jul-2019 09:57:19 > Task :spring-core-coroutines:testClasses UP-TO-DATE
05-Jul-2019 09:57:19 > Task :spring-jcl:compileTestKotlin NO-SOURCE
05-Jul-2019 09:57:19 > Task :spring-jcl:compileTestJava NO-SOURCE
05-Jul-2019 09:57:19 > Task :spring-jcl:processTestResources NO-SOURCE
05-Jul-2019 09:57:19 > Task :spring-jcl:testClasses UP-TO-DATE
05-Jul-2019 09:57:22 > Task :spring-core:compileTestKotlin
05-Jul-2019 09:57:28 > Task :spring-core:compileTestJava
05-Jul-2019 09:57:28 > Task :spring-core:processTestResources
05-Jul-2019 09:57:28 > Task :spring-core:testClasses
05-Jul-2019 09:57:29 > Task :spring-beans:compileTestKotlin
05-Jul-2019 09:57:32
05-Jul-2019 09:57:32 > Task :spring-beans:compileTestJava
05-Jul-2019 09:57:32 Note: Some input files use unchecked or unsafe operations.
05-Jul-2019 09:57:32 Note: Recompile with -Xlint:unchecked for details.
05-Jul-2019 09:57:32
05-Jul-2019 09:57:32 > Task :spring-beans:compileTestGroovy NO-SOURCE
05-Jul-2019 09:57:32 > Task :spring-beans:processTestResources
05-Jul-2019 09:57:32 > Task :spring-beans:testClasses
05-Jul-2019 09:57:32 > Task :spring-aop:compileTestKotlin
05-Jul-2019 09:57:32 > Task :spring-aop:inspectClassesForKotlinIC
05-Jul-2019 09:57:32 > Task :spring-aop:jar
05-Jul-2019 09:57:33 > Task :spring-aop:compileTestJava
05-Jul-2019 09:57:33 > Task :spring-aop:processTestResources
05-Jul-2019 09:57:33 > Task :spring-aop:testClasses
05-Jul-2019 09:57:33 > Task :spring-expression:compileKotlin
05-Jul-2019 09:57:34 > Task :spring-expression:compileJava
05-Jul-2019 09:57:34 > Task :spring-expression:processResources
05-Jul-2019 09:57:34 > Task :spring-expression:classes
05-Jul-2019 09:57:34 > Task :spring-expression:inspectClassesForKotlinIC
05-Jul-2019 09:57:34 > Task :spring-expression:jar
05-Jul-2019 09:57:34 > Task :spring-instrument:compileKotlin
05-Jul-2019 09:57:34 > Task :spring-instrument:compileJava
05-Jul-2019 09:57:34 > Task :spring-instrument:processResources NO-SOURCE
05-Jul-2019 09:57:34 > Task :spring-instrument:classes
05-Jul-2019 09:57:34 > Task :spring-instrument:inspectClassesForKotlinIC
05-Jul-2019 09:57:34 > Task :spring-instrument:jar
05-Jul-2019 09:57:38 > Task :spring-context:compileKotlin
05-Jul-2019 09:57:40 > Task :spring-context:compileJava
05-Jul-2019 09:57:40 > Task :spring-context:compileGroovy NO-SOURCE
05-Jul-2019 09:57:40 > Task :spring-context:processResources
05-Jul-2019 09:57:40 > Task :spring-context:classes
05-Jul-2019 09:57:40 > Task :spring-expression:compileTestKotlin
05-Jul-2019 09:57:43 > Task :spring-expression:compileTestJava
05-Jul-2019 09:57:43 > Task :spring-expression:processTestResources
05-Jul-2019 09:57:43 > Task :spring-expression:testClasses
05-Jul-2019 09:57:43 > Task :spring-instrument:compileTestKotlin NO-SOURCE
05-Jul-2019 09:57:43 > Task :spring-instrument:compileTestJava NO-SOURCE
05-Jul-2019 09:57:43 > Task :spring-instrument:processTestResources
05-Jul-2019 09:57:43 > Task :spring-instrument:testClasses
05-Jul-2019 09:57:45 > Task :spring-context:compileTestKotlin
05-Jul-2019 09:57:45 > Task :spring-context:inspectClassesForKotlinIC
05-Jul-2019 09:57:45 > Task :spring-context:jar
05-Jul-2019 09:57:49
05-Jul-2019 09:57:49 > Task :spring-context:compileTestJava
05-Jul-2019 09:57:49 Note: Some input files use or override a deprecated API.
05-Jul-2019 09:57:49 Note: Recompile with -Xlint:deprecation for details.
05-Jul-2019 09:57:49 Note: Some input files use unchecked or unsafe operations.
05-Jul-2019 09:57:49 Note: Recompile with -Xlint:unchecked for details.
05-Jul-2019 09:57:50
05-Jul-2019 09:57:50 > Task :spring-context:compileTestGroovy
05-Jul-2019 09:57:50 > Task :spring-context:processTestResources
05-Jul-2019 09:57:50 > Task :spring-context:testClasses
05-Jul-2019 09:57:51 > Task :spring-tx:compileKotlin
05-Jul-2019 09:57:51 > Task :spring-tx:compileJava
05-Jul-2019 09:57:51 > Task :spring-tx:processResources
05-Jul-2019 09:57:51 > Task :spring-tx:classes
05-Jul-2019 09:57:51 > Task :spring-tx:inspectClassesForKotlinIC
05-Jul-2019 09:57:51 > Task :spring-tx:jar
05-Jul-2019 09:57:52 > Task :spring-jdbc:compileKotlin
05-Jul-2019 09:57:52 > Task :spring-jdbc:compileJava
05-Jul-2019 09:57:53 > Task :spring-jdbc:processResources
05-Jul-2019 09:57:53 > Task :spring-jdbc:classes
05-Jul-2019 09:57:53 > Task :spring-tx:compileTestKotlin
05-Jul-2019 09:58:09 > Task :spring-tx:compileTestJava
05-Jul-2019 09:58:09 > Task :spring-tx:processTestResources
05-Jul-2019 09:58:09 > Task :spring-tx:testClasses
05-Jul-2019 09:58:10 > Task :spring-jdbc:compileTestKotlin
05-Jul-2019 09:58:10 > Task :spring-jdbc:inspectClassesForKotlinIC
05-Jul-2019 09:58:10 > Task :spring-jdbc:jar
05-Jul-2019 09:58:11 > Task :spring-jdbc:compileTestJava
05-Jul-2019 09:58:11 > Task :spring-jdbc:processTestResources
05-Jul-2019 09:58:11 > Task :spring-jdbc:testClasses
05-Jul-2019 09:58:12 > Task :spring-oxm:compileKotlin
05-Jul-2019 09:58:12 > Task :spring-oxm:compileJava
05-Jul-2019 09:58:12 > Task :spring-oxm:processResources
05-Jul-2019 09:58:12 > Task :spring-oxm:classes
05-Jul-2019 09:58:12 > Task :spring-oxm:inspectClassesForKotlinIC
05-Jul-2019 09:58:12 > Task :spring-oxm:jar
05-Jul-2019 09:58:13 > Task :spring-web:compileKotlin
05-Jul-2019 09:58:15 > Task :spring-web:compileJava
05-Jul-2019 09:58:15 > Task :spring-web:processResources
05-Jul-2019 09:58:15 > Task :spring-web:classes
05-Jul-2019 09:58:15 > Task :spring-web:inspectClassesForKotlinIC
05-Jul-2019 09:58:16 > Task :spring-web:jar
05-Jul-2019 09:58:16 > Task :spring-orm:compileKotlin
05-Jul-2019 09:58:17 > Task :spring-orm:compileJava
05-Jul-2019 09:58:17 > Task :spring-orm:processResources NO-SOURCE
05-Jul-2019 09:58:17 > Task :spring-orm:classes
05-Jul-2019 09:58:17
05-Jul-2019 09:58:17 > Task :spring-oxm:genJaxb
05-Jul-2019 09:58:17 [ant:javac] : warning: 'includeantruntime' was not set, defaulting to build.sysclasspath=last; set to false for repeatable builds
05-Jul-2019 09:58:17
05-Jul-2019 09:58:17 > Task :spring-oxm:compileTestKotlin
05-Jul-2019 09:58:18 > Task :spring-oxm:compileTestJava
05-Jul-2019 09:58:18 > Task :spring-oxm:processTestResources
05-Jul-2019 09:58:18 > Task :spring-oxm:testClasses
05-Jul-2019 09:58:20 > Task :spring-web:compileTestKotlin
05-Jul-2019 09:58:24 > Task :spring-web:compileTestJava
05-Jul-2019 09:58:24 > Task :spring-web:processTestResources
05-Jul-2019 09:58:24 > Task :spring-web:testClasses
05-Jul-2019 09:58:24 > Task :spring-orm:compileTestKotlin
05-Jul-2019 09:58:24 > Task :spring-orm:inspectClassesForKotlinIC
05-Jul-2019 09:58:24 > Task :spring-orm:jar
05-Jul-2019 09:58:25 > Task :spring-orm:compileTestJava
05-Jul-2019 09:58:25 > Task :spring-orm:processTestResources
05-Jul-2019 09:58:25 > Task :spring-orm:testClasses
05-Jul-2019 09:58:25 > Task :spring-context-support:compileKotlin
05-Jul-2019 09:58:25 > Task :spring-context-support:compileJava
05-Jul-2019 09:58:25 > Task :spring-context-support:processResources
05-Jul-2019 09:58:25 > Task :spring-context-support:classes
05-Jul-2019 09:58:26 > Task :spring-context-support:compileTestKotlin
05-Jul-2019 09:58:26 > Task :spring-context-support:inspectClassesForKotlinIC
05-Jul-2019 09:58:26 > Task :spring-context-support:jar
05-Jul-2019 09:58:26 > Task :spring-context-support:compileTestJava
05-Jul-2019 09:58:26 > Task :spring-context-support:processTestResources
05-Jul-2019 09:58:26 > Task :spring-context-support:testClasses
05-Jul-2019 09:58:28 > Task :spring-webflux:compileKotlin
05-Jul-2019 09:58:29 > Task :spring-webflux:compileJava
05-Jul-2019 09:58:29 > Task :spring-webflux:processResources
05-Jul-2019 09:58:29 > Task :spring-webflux:classes
05-Jul-2019 09:58:29 > Task :spring-webflux:inspectClassesForKotlinIC
05-Jul-2019 09:58:29 > Task :spring-webflux:jar
05-Jul-2019 09:58:30 > Task :spring-webmvc:compileKotlin
05-Jul-2019 09:58:31 > Task :spring-webmvc:compileJava
05-Jul-2019 09:58:31 > Task :spring-webmvc:processResources
05-Jul-2019 09:58:31 > Task :spring-webmvc:classes
05-Jul-2019 09:58:31 > Task :spring-webmvc:inspectClassesForKotlinIC
05-Jul-2019 09:58:32 > Task :spring-webmvc:jar
05-Jul-2019 09:58:32 > Task :spring-messaging:compileKotlin
05-Jul-2019 09:58:33 > Task :spring-messaging:compileJava
05-Jul-2019 09:58:33 > Task :spring-messaging:processResources NO-SOURCE
05-Jul-2019 09:58:33 > Task :spring-messaging:classes
05-Jul-2019 09:58:33 > Task :spring-messaging:inspectClassesForKotlinIC
05-Jul-2019 09:58:33 > Task :spring-messaging:jar
05-Jul-2019 09:58:34 > Task :spring-websocket:compileKotlin
05-Jul-2019 09:58:34 > Task :spring-websocket:compileJava
05-Jul-2019 09:58:34 > Task :spring-websocket:processResources
05-Jul-2019 09:58:34 > Task :spring-websocket:classes
05-Jul-2019 09:58:34 > Task :spring-websocket:inspectClassesForKotlinIC
05-Jul-2019 09:58:34 > Task :spring-websocket:jar
05-Jul-2019 09:58:36 > Task :spring-test:compileKotlin
05-Jul-2019 09:58:37 > Task :spring-test:compileJava
05-Jul-2019 09:58:37 > Task :spring-test:processResources
05-Jul-2019 09:58:37 > Task :spring-test:classes
05-Jul-2019 09:58:40 > Task :spring-webflux:compileTestKotlin
05-Jul-2019 09:58:42 > Task :spring-webflux:compileTestJava
05-Jul-2019 09:58:42 > Task :spring-webflux:processTestResources
05-Jul-2019 09:58:42 > Task :spring-webflux:testClasses
05-Jul-2019 09:58:43 > Task :spring-webmvc:compileTestKotlin
05-Jul-2019 09:58:47 > Task :spring-webmvc:compileTestJava
05-Jul-2019 09:58:47 > Task :spring-webmvc:processTestResources
05-Jul-2019 09:58:47 > Task :spring-webmvc:testClasses
05-Jul-2019 09:58:48
05-Jul-2019 09:58:48 > Task :spring-messaging:compileTestKotlin
05-Jul-2019 09:58:48 w: /opt/bamboo-home/xml-data/build-dir/SPR-PUB-JOB1/spring-messaging/src/test/kotlin/org/springframework/messaging/rsocket/RSocketClientToServerCoroutinesIntegrationTests.kt: (202, 7): 'addServerPlugin(RSocketInterceptor!): RSocketFactory.ServerRSocketFactory!' is deprecated. Deprecated in Java
05-Jul-2019 09:58:49
05-Jul-2019 09:58:49 > Task :spring-messaging:compileTestJava
05-Jul-2019 09:58:49 > Task :spring-messaging:processTestResources
05-Jul-2019 09:58:49 > Task :spring-messaging:testClasses
05-Jul-2019 09:58:49 > Task :spring-websocket:compileTestKotlin
05-Jul-2019 09:58:51 > Task :spring-websocket:compileTestJava
05-Jul-2019 09:58:51 > Task :spring-websocket:processTestResources
05-Jul-2019 09:58:51 > Task :spring-websocket:testClasses
05-Jul-2019 09:58:52 > Task :spring-test:compileTestKotlin
05-Jul-2019 09:58:52 > Task :spring-test:inspectClassesForKotlinIC
05-Jul-2019 09:58:52 > Task :spring-test:jar
05-Jul-2019 09:58:55 > Task :spring-test:compileTestJava
05-Jul-2019 09:58:55 > Task :spring-test:processTestResources
05-Jul-2019 09:58:55 > Task :spring-test:testClasses
05-Jul-2019 09:58:55 > Task :compileTestKotlin
05-Jul-2019 09:58:56 > Task :compileTestJava
05-Jul-2019 09:58:56 > Task :compileTestGroovy NO-SOURCE
05-Jul-2019 09:58:56 > Task :processTestResources
05-Jul-2019 09:58:56 > Task :testClasses
05-Jul-2019 09:58:58 > Task :checkstyleTest
05-Jul-2019 09:59:01 > Task :test
05-Jul-2019 09:59:01 > Task :check
05-Jul-2019 09:59:05 > Task :spring-aop:checkstyleMain
05-Jul-2019 09:59:05 > Task :spring-aop:checkstyleTest
05-Jul-2019 09:59:08 > Task :spring-aop:test
05-Jul-2019 09:59:08 > Task :spring-aop:check
05-Jul-2019 09:59:08 > Task :spring-aspects:compileKotlin
05-Jul-2019 09:59:10 > Task :spring-aspects:compileJava
05-Jul-2019 09:59:10 > Task :spring-aspects:processResources
05-Jul-2019 09:59:10 > Task :spring-aspects:classes
05-Jul-2019 09:59:10 > Task :spring-aspects:checkstyleMain
05-Jul-2019 09:59:10 > Task :spring-aspects:compileTestKotlin
05-Jul-2019 09:59:10 > Task :spring-aspects:inspectClassesForKotlinIC
05-Jul-2019 09:59:10 > Task :spring-aspects:jar
05-Jul-2019 09:59:12 > Task :spring-aspects:compileTestJava
05-Jul-2019 09:59:12 > Task :spring-aspects:processTestResources
05-Jul-2019 09:59:12 > Task :spring-aspects:testClasses
05-Jul-2019 09:59:12 > Task :spring-aspects:checkstyleTest
05-Jul-2019 09:59:17 > Task :spring-aspects:test
05-Jul-2019 09:59:17 > Task :spring-aspects:check
05-Jul-2019 09:59:20 > Task :spring-beans:checkstyleMain
05-Jul-2019 09:59:21 > Task :spring-beans:checkstyleTest
05-Jul-2019 09:59:30 > Task :spring-beans:test
05-Jul-2019 09:59:30 > Task :spring-beans:check
05-Jul-2019 09:59:30 > Task :spring-build-src:compileKotlin NO-SOURCE
05-Jul-2019 09:59:30 > Task :spring-build-src:compileJava NO-SOURCE
05-Jul-2019 09:59:30 > Task :spring-build-src:compileGroovy
05-Jul-2019 09:59:30 > Task :spring-build-src:processResources
05-Jul-2019 09:59:30 > Task :spring-build-src:classes
05-Jul-2019 09:59:30 > Task :spring-build-src:checkstyleMain NO-SOURCE
05-Jul-2019 09:59:30 > Task :spring-build-src:compileTestKotlin NO-SOURCE
05-Jul-2019 09:59:30 > Task :spring-build-src:compileTestJava NO-SOURCE
05-Jul-2019 09:59:30 > Task :spring-build-src:compileTestGroovy NO-SOURCE
05-Jul-2019 09:59:30 > Task :spring-build-src:processTestResources NO-SOURCE
05-Jul-2019 09:59:30 > Task :spring-build-src:testClasses UP-TO-DATE
05-Jul-2019 09:59:30 > Task :spring-build-src:checkstyleTest NO-SOURCE
05-Jul-2019 09:59:30 > Task :spring-build-src:test NO-SOURCE
05-Jul-2019 09:59:30 > Task :spring-build-src:check UP-TO-DATE
05-Jul-2019 09:59:34 > Task :spring-context:checkstyleMain
05-Jul-2019 09:59:37 > Task :spring-context:checkstyleTest
05-Jul-2019 10:00:07 > Task :spring-context:test
05-Jul-2019 10:00:11 > Task :spring-context:check
05-Jul-2019 10:00:11 > Task :spring-context-indexer:compileKotlin
05-Jul-2019 10:00:11 > Task :spring-context-indexer:compileJava
05-Jul-2019 10:00:11 > Task :spring-context-indexer:processResources
05-Jul-2019 10:00:11 > Task :spring-context-indexer:classes
05-Jul-2019 10:00:11 > Task :spring-context-indexer:checkstyleMain
05-Jul-2019 10:00:11 > Task :spring-context-indexer:compileTestKotlin
05-Jul-2019 10:00:11 > Task :spring-context-indexer:compileTestJava
05-Jul-2019 10:00:11 > Task :spring-context-indexer:processTestResources NO-SOURCE
05-Jul-2019 10:00:11 > Task :spring-context-indexer:testClasses
05-Jul-2019 10:00:11 > Task :spring-context-indexer:checkstyleTest
05-Jul-2019 10:00:13 > Task :spring-context-indexer:test
05-Jul-2019 10:00:13 > Task :spring-context-indexer:check
05-Jul-2019 10:00:14 > Task :spring-context-support:checkstyleMain
05-Jul-2019 10:00:14 > Task :spring-context-support:checkstyleTest
05-Jul-2019 10:00:24 > Task :spring-context-support:test
05-Jul-2019 10:00:24 > Task :spring-context-support:check
05-Jul-2019 10:00:29 > Task :spring-core:checkstyleMain
05-Jul-2019 10:00:31 > Task :spring-core:checkstyleTest
05-Jul-2019 10:00:43 > Task :spring-core:test
05-Jul-2019 10:00:43 > Task :spring-core:check
05-Jul-2019 10:00:43 > Task :spring-core-coroutines:checkstyleMain NO-SOURCE
05-Jul-2019 10:00:43 > Task :spring-core-coroutines:checkstyleTest NO-SOURCE
05-Jul-2019 10:00:43 > Task :spring-core-coroutines:test NO-SOURCE
05-Jul-2019 10:00:43 > Task :spring-core-coroutines:check UP-TO-DATE
05-Jul-2019 10:00:44 > Task :spring-expression:checkstyleMain
05-Jul-2019 10:00:45 > Task :spring-expression:checkstyleTest
05-Jul-2019 10:00:47 > Task :spring-expression:test
05-Jul-2019 10:00:47 > Task :spring-expression:check
05-Jul-2019 10:00:47 > Task :spring-framework-bom:compileKotlin NO-SOURCE
05-Jul-2019 10:00:47 > Task :spring-framework-bom:compileJava NO-SOURCE
05-Jul-2019 10:00:47 > Task :spring-framework-bom:processResources NO-SOURCE
05-Jul-2019 10:00:47 > Task :spring-framework-bom:classes UP-TO-DATE
05-Jul-2019 10:00:47 > Task :spring-framework-bom:checkstyleMain NO-SOURCE
05-Jul-2019 10:00:47 > Task :spring-framework-bom:compileTestKotlin NO-SOURCE
05-Jul-2019 10:00:47 > Task :spring-framework-bom:compileTestJava NO-SOURCE
05-Jul-2019 10:00:47 > Task :spring-framework-bom:processTestResources NO-SOURCE
05-Jul-2019 10:00:47 > Task :spring-framework-bom:testClasses UP-TO-DATE
05-Jul-2019 10:00:47 > Task :spring-framework-bom:checkstyleTest NO-SOURCE
05-Jul-2019 10:00:47 > Task :spring-framework-bom:test NO-SOURCE
05-Jul-2019 10:00:47 > Task :spring-framework-bom:check UP-TO-DATE
05-Jul-2019 10:00:47 > Task :spring-instrument:checkstyleMain
05-Jul-2019 10:00:47 > Task :spring-instrument:checkstyleTest NO-SOURCE
05-Jul-2019 10:00:47 > Task :spring-instrument:test NO-SOURCE
05-Jul-2019 10:00:47 > Task :spring-instrument:check
05-Jul-2019 10:00:47 > Task :spring-jcl:checkstyleMain
05-Jul-2019 10:00:47 > Task :spring-jcl:checkstyleTest NO-SOURCE
05-Jul-2019 10:00:47 > Task :spring-jcl:test NO-SOURCE
05-Jul-2019 10:00:47 > Task :spring-jcl:check
05-Jul-2019 10:00:49 > Task :spring-jdbc:checkstyleMain
05-Jul-2019 10:00:50 > Task :spring-jdbc:checkstyleTest
05-Jul-2019 10:00:59 > Task :spring-jdbc:test
05-Jul-2019 10:00:59 > Task :spring-jdbc:check
05-Jul-2019 10:00:59 > Task :spring-jms:compileKotlin
05-Jul-2019 10:00:59 > Task :spring-jms:compileJava
05-Jul-2019 10:00:59 > Task :spring-jms:processResources
05-Jul-2019 10:00:59 > Task :spring-jms:classes
05-Jul-2019 10:01:00 > Task :spring-jms:checkstyleMain
05-Jul-2019 10:01:00 > Task :spring-jms:compileTestKotlin
05-Jul-2019 10:01:01 > Task :spring-jms:compileTestJava
05-Jul-2019 10:01:01 > Task :spring-jms:processTestResources
05-Jul-2019 10:01:01 > Task :spring-jms:testClasses
05-Jul-2019 10:01:01 > Task :spring-jms:checkstyleTest
05-Jul-2019 10:01:05 > Task :spring-jms:test
05-Jul-2019 10:01:05 > Task :spring-jms:check
05-Jul-2019 10:01:07 > Task :spring-messaging:checkstyleMain
05-Jul-2019 10:01:08 > Task :spring-messaging:checkstyleTest
05-Jul-2019 10:01:38 > Task :spring-messaging:test
05-Jul-2019 10:01:53 > Task :spring-messaging:check
05-Jul-2019 10:01:54 > Task :spring-orm:checkstyleMain
05-Jul-2019 10:01:54 > Task :spring-orm:checkstyleTest
05-Jul-2019 10:02:01 > Task :spring-orm:test
05-Jul-2019 10:02:01 > Task :spring-orm:check
05-Jul-2019 10:02:01 > Task :spring-oxm:checkstyleMain
05-Jul-2019 10:02:01 > Task :spring-oxm:checkstyleTest
05-Jul-2019 10:02:04 > Task :spring-oxm:test
05-Jul-2019 10:02:04 > Task :spring-oxm:check
05-Jul-2019 10:02:14 > Task :spring-test:testJUnitJupiter
05-Jul-2019 10:02:20 > Task :spring-test:testNG
05-Jul-2019 10:02:50 > Task :spring-test:test
05-Jul-2019 10:02:55 > Task :spring-test:aggregateTestReports
05-Jul-2019 10:02:58 > Task :spring-test:checkstyleMain
05-Jul-2019 10:03:00 > Task :spring-test:checkstyleTest
05-Jul-2019 10:03:00 > Task :spring-test:check
05-Jul-2019 10:03:01 > Task :spring-tx:checkstyleMain
05-Jul-2019 10:03:02 > Task :spring-tx:checkstyleTest
05-Jul-2019 10:03:06 > Task :spring-tx:test
05-Jul-2019 10:03:06 > Task :spring-tx:check
05-Jul-2019 10:03:10 > Task :spring-web:checkstyleMain
05-Jul-2019 10:03:13 > Task :spring-web:checkstyleTest
05-Jul-2019 10:03:34 > Task :spring-web:test
05-Jul-2019 10:03:34 > Task :spring-web:check
05-Jul-2019 10:03:36 > Task :spring-webflux:checkstyleMain
05-Jul-2019 10:03:37 > Task :spring-webflux:checkstyleTest
05-Jul-2019 10:04:00
05-Jul-2019 10:04:00 > Task :spring-webflux:test
05-Jul-2019 10:04:00
05-Jul-2019 10:04:00 org.springframework.web.reactive.result.method.annotation.MultipartIntegrationTests > transferTo[server [org.springframework.http.server.reactive.bootstrap.UndertowHttpServer@3996a594]] FAILED
05-Jul-2019 10:04:00     org.junit.ComparisonFailure at MultipartIntegrationTests.java:173
05-Jul-2019 10:05:13
05-Jul-2019 10:05:13 1765 tests completed, 1 failed, 18 skipped
05-Jul-2019 10:05:13
05-Jul-2019 10:05:13 > Task :spring-webflux:test FAILED
05-Jul-2019 10:05:13
05-Jul-2019 10:05:13 Deprecated Gradle features were used in this build, making it incompatible with Gradle 6.0.
05-Jul-2019 10:05:13 Use '--warning-mode all' to show the individual deprecation warnings.
05-Jul-2019 10:05:13 See https://docs.gradle.org/5.5/userguide/command_line_interface.html#sec:command_line_warnings
05-Jul-2019 10:05:13 249 actionable tasks: 225 executed, 24 up-to-date
05-Jul-2019 10:05:13
05-Jul-2019 10:05:13 FAILURE: Build failed with an exception.
05-Jul-2019 10:05:13
05-Jul-2019 10:05:13 * What went wrong:
05-Jul-2019 10:05:13 Execution failed for task ':spring-webflux:test'.
05-Jul-2019 10:05:13 > There were failing tests. See the report at: file:///opt/bamboo-home/xml-data/build-dir/SPR-PUB-JOB1/spring-webflux/build/reports/tests/test/index.html
05-Jul-2019 10:05:13
05-Jul-2019 10:05:13 * Try:
05-Jul-2019 10:05:13 Run with --info or --debug option to get more log output. Run with --scan to get full insights.
05-Jul-2019 10:05:13
05-Jul-2019 10:05:13 * Exception is:
05-Jul-2019 10:05:13 org.gradle.api.tasks.TaskExecutionException: Execution failed for task ':spring-webflux:test'.
05-Jul-2019 10:05:13         at org.gradle.api.internal.tasks.execution.ExecuteActionsTaskExecuter$3.accept(ExecuteActionsTaskExecuter.java:148)
05-Jul-2019 10:05:13         at org.gradle.api.internal.tasks.execution.ExecuteActionsTaskExecuter$3.accept(ExecuteActionsTaskExecuter.java:145)
05-Jul-2019 10:05:13         at org.gradle.internal.Try$Failure.ifSuccessfulOrElse(Try.java:191)
05-Jul-2019 10:05:13         at org.gradle.api.internal.tasks.execution.ExecuteActionsTaskExecuter.execute(ExecuteActionsTaskExecuter.java:138)
05-Jul-2019 10:05:13         at org.gradle.api.internal.tasks.execution.ResolveBeforeExecutionStateTaskExecuter.execute(ResolveBeforeExecutionStateTaskExecuter.java:75)
05-Jul-2019 10:05:13         at org.gradle.api.internal.tasks.execution.ValidatingTaskExecuter.execute(ValidatingTaskExecuter.java:62)
05-Jul-2019 10:05:13         at org.gradle.api.internal.tasks.execution.SkipEmptySourceFilesTaskExecuter.execute(SkipEmptySourceFilesTaskExecuter.java:108)
05-Jul-2019 10:05:13         at org.gradle.api.internal.tasks.execution.ResolveBeforeExecutionOutputsTaskExecuter.execute(ResolveBeforeExecutionOutputsTaskExecuter.java:67)
05-Jul-2019 10:05:13         at org.gradle.api.internal.tasks.execution.ResolveAfterPreviousExecutionStateTaskExecuter.execute(ResolveAfterPreviousExecutionStateTaskExecuter.java:46)
05-Jul-2019 10:05:13         at org.gradle.api.internal.tasks.execution.CleanupStaleOutputsExecuter.execute(CleanupStaleOutputsExecuter.java:94)
05-Jul-2019 10:05:13         at org.gradle.api.internal.tasks.execution.FinalizePropertiesTaskExecuter.execute(FinalizePropertiesTaskExecuter.java:46)
05-Jul-2019 10:05:13         at org.gradle.api.internal.tasks.execution.ResolveTaskExecutionModeExecuter.execute(ResolveTaskExecutionModeExecuter.java:95)
05-Jul-2019 10:05:13         at org.gradle.api.internal.tasks.execution.SkipTaskWithNoActionsExecuter.execute(SkipTaskWithNoActionsExecuter.java:57)
05-Jul-2019 10:05:13         at org.gradle.api.internal.tasks.execution.SkipOnlyIfTaskExecuter.execute(SkipOnlyIfTaskExecuter.java:56)
05-Jul-2019 10:05:13         at org.gradle.api.internal.tasks.execution.CatchExceptionTaskExecuter.execute(CatchExceptionTaskExecuter.java:36)
05-Jul-2019 10:05:13         at org.gradle.api.internal.tasks.execution.EventFiringTaskExecuter$1.executeTask(EventFiringTaskExecuter.java:73)
05-Jul-2019 10:05:13         at org.gradle.api.internal.tasks.execution.EventFiringTaskExecuter$1.call(EventFiringTaskExecuter.java:52)
05-Jul-2019 10:05:13         at org.gradle.api.internal.tasks.execution.EventFiringTaskExecuter$1.call(EventFiringTaskExecuter.java:49)
05-Jul-2019 10:05:13         at org.gradle.internal.operations.DefaultBuildOperationExecutor$CallableBuildOperationWorker.execute(DefaultBuildOperationExecutor.java:416)
05-Jul-2019 10:05:13         at org.gradle.internal.operations.DefaultBuildOperationExecutor$CallableBuildOperationWorker.execute(DefaultBuildOperationExecutor.java:406)
05-Jul-2019 10:05:13         at org.gradle.internal.operations.DefaultBuildOperationExecutor$1.execute(DefaultBuildOperationExecutor.java:165)
05-Jul-2019 10:05:13         at org.gradle.internal.operations.DefaultBuildOperationExecutor.execute(DefaultBuildOperationExecutor.java:250)
05-Jul-2019 10:05:13         at org.gradle.internal.operations.DefaultBuildOperationExecutor.execute(DefaultBuildOperationExecutor.java:158)
05-Jul-2019 10:05:13         at org.gradle.internal.operations.DefaultBuildOperationExecutor.call(DefaultBuildOperationExecutor.java:102)
05-Jul-2019 10:05:13         at org.gradle.internal.operations.DelegatingBuildOperationExecutor.call(DelegatingBuildOperationExecutor.java:36)
05-Jul-2019 10:05:13         at org.gradle.api.internal.tasks.execution.EventFiringTaskExecuter.execute(EventFiringTaskExecuter.java:49)
05-Jul-2019 10:05:13         at org.gradle.execution.plan.LocalTaskNodeExecutor.execute(LocalTaskNodeExecutor.java:43)
05-Jul-2019 10:05:13         at org.gradle.execution.taskgraph.DefaultTaskExecutionGraph$InvokeNodeExecutorsAction.execute(DefaultTaskExecutionGraph.java:355)
05-Jul-2019 10:05:13         at org.gradle.execution.taskgraph.DefaultTaskExecutionGraph$InvokeNodeExecutorsAction.execute(DefaultTaskExecutionGraph.java:343)
05-Jul-2019 10:05:13         at org.gradle.execution.taskgraph.DefaultTaskExecutionGraph$BuildOperationAwareExecutionAction.execute(DefaultTaskExecutionGraph.java:336)
05-Jul-2019 10:05:13         at org.gradle.execution.taskgraph.DefaultTaskExecutionGraph$BuildOperationAwareExecutionAction.execute(DefaultTaskExecutionGraph.java:322)
05-Jul-2019 10:05:13         at org.gradle.execution.plan.DefaultPlanExecutor$ExecutorWorker$1.execute(DefaultPlanExecutor.java:134)
05-Jul-2019 10:05:13         at org.gradle.execution.plan.DefaultPlanExecutor$ExecutorWorker$1.execute(DefaultPlanExecutor.java:129)
05-Jul-2019 10:05:13         at org.gradle.execution.plan.DefaultPlanExecutor$ExecutorWorker.execute(DefaultPlanExecutor.java:202)
05-Jul-2019 10:05:13         at org.gradle.execution.plan.DefaultPlanExecutor$ExecutorWorker.executeNextNode(DefaultPlanExecutor.java:193)
05-Jul-2019 10:05:13         at org.gradle.execution.plan.DefaultPlanExecutor$ExecutorWorker.run(DefaultPlanExecutor.java:129)
05-Jul-2019 10:05:13         at org.gradle.internal.concurrent.ExecutorPolicy$CatchAndRecordFailures.onExecute(ExecutorPolicy.java:63)
05-Jul-2019 10:05:13         at org.gradle.internal.concurrent.ManagedExecutorImpl$1.run(ManagedExecutorImpl.java:46)
05-Jul-2019 10:05:13         at org.gradle.internal.concurrent.ThreadFactoryImpl$ManagedThreadRunnable.run(ThreadFactoryImpl.java:55)
05-Jul-2019 10:05:13 Caused by: org.gradle.api.GradleException: There were failing tests. See the report at: file:///opt/bamboo-home/xml-data/build-dir/SPR-PUB-JOB1/spring-webflux/build/reports/tests/test/index.html
05-Jul-2019 10:05:13         at org.gradle.api.tasks.testing.AbstractTestTask.handleTestFailures(AbstractTestTask.java:626)
05-Jul-2019 10:05:13         at org.gradle.api.tasks.testing.AbstractTestTask.executeTests(AbstractTestTask.java:498)
05-Jul-2019 10:05:13         at org.gradle.api.tasks.testing.Test.executeTests(Test.java:594)
05-Jul-2019 10:05:13         at org.gradle.internal.reflect.JavaMethod.invoke(JavaMethod.java:103)
05-Jul-2019 10:05:13         at org.gradle.api.internal.project.taskfactory.StandardTaskAction.doExecute(StandardTaskAction.java:48)
05-Jul-2019 10:05:13         at org.gradle.api.internal.project.taskfactory.StandardTaskAction.execute(StandardTaskAction.java:41)
05-Jul-2019 10:05:13         at org.gradle.api.internal.project.taskfactory.StandardTaskAction.execute(StandardTaskAction.java:28)
05-Jul-2019 10:05:13         at org.gradle.api.internal.AbstractTask$TaskActionWrapper.execute(AbstractTask.java:702)
05-Jul-2019 10:05:13         at org.gradle.api.internal.AbstractTask$TaskActionWrapper.execute(AbstractTask.java:669)
05-Jul-2019 10:05:13         at org.gradle.api.internal.tasks.execution.ExecuteActionsTaskExecuter$5.run(ExecuteActionsTaskExecuter.java:401)
05-Jul-2019 10:05:13         at org.gradle.internal.operations.DefaultBuildOperationExecutor$RunnableBuildOperationWorker.execute(DefaultBuildOperationExecutor.java:402)
05-Jul-2019 10:05:13         at org.gradle.internal.operations.DefaultBuildOperationExecutor$RunnableBuildOperationWorker.execute(DefaultBuildOperationExecutor.java:394)
05-Jul-2019 10:05:13         at org.gradle.internal.operations.DefaultBuildOperationExecutor$1.execute(DefaultBuildOperationExecutor.java:165)
05-Jul-2019 10:05:13         at org.gradle.internal.operations.DefaultBuildOperationExecutor.execute(DefaultBuildOperationExecutor.java:250)
05-Jul-2019 10:05:13         at org.gradle.internal.operations.DefaultBuildOperationExecutor.execute(DefaultBuildOperationExecutor.java:158)
05-Jul-2019 10:05:13         at org.gradle.internal.operations.DefaultBuildOperationExecutor.run(DefaultBuildOperationExecutor.java:92)
05-Jul-2019 10:05:13         at org.gradle.internal.operations.DelegatingBuildOperationExecutor.run(DelegatingBuildOperationExecutor.java:31)
05-Jul-2019 10:05:13         at org.gradle.api.internal.tasks.execution.ExecuteActionsTaskExecuter.executeAction(ExecuteActionsTaskExecuter.java:390)
05-Jul-2019 10:05:13         at org.gradle.api.internal.tasks.execution.ExecuteActionsTaskExecuter.executeActions(ExecuteActionsTaskExecuter.java:373)
05-Jul-2019 10:05:13         at org.gradle.api.internal.tasks.execution.ExecuteActionsTaskExecuter.access$200(ExecuteActionsTaskExecuter.java:79)
05-Jul-2019 10:05:13         at org.gradle.api.internal.tasks.execution.ExecuteActionsTaskExecuter$TaskExecution.execute(ExecuteActionsTaskExecuter.java:210)
05-Jul-2019 10:05:13         at org.gradle.internal.execution.steps.ExecuteStep.lambda$execute$1(ExecuteStep.java:33)
05-Jul-2019 10:05:13         at org.gradle.internal.execution.steps.ExecuteStep.execute(ExecuteStep.java:33)
05-Jul-2019 10:05:13         at org.gradle.internal.execution.steps.ExecuteStep.execute(ExecuteStep.java:26)
05-Jul-2019 10:05:13         at org.gradle.internal.execution.steps.CleanupOutputsStep.execute(CleanupOutputsStep.java:58)
05-Jul-2019 10:05:13         at org.gradle.internal.execution.steps.CleanupOutputsStep.execute(CleanupOutputsStep.java:35)
05-Jul-2019 10:05:13         at org.gradle.internal.execution.steps.ResolveInputChangesStep.execute(ResolveInputChangesStep.java:48)
05-Jul-2019 10:05:13         at org.gradle.internal.execution.steps.ResolveInputChangesStep.execute(ResolveInputChangesStep.java:33)
05-Jul-2019 10:05:13         at org.gradle.internal.execution.steps.CancelExecutionStep.execute(CancelExecutionStep.java:39)
05-Jul-2019 10:05:13         at org.gradle.internal.execution.steps.TimeoutStep.executeWithoutTimeout(TimeoutStep.java:73)
05-Jul-2019 10:05:13         at org.gradle.internal.execution.steps.TimeoutStep.execute(TimeoutStep.java:54)
05-Jul-2019 10:05:13         at org.gradle.internal.execution.steps.CatchExceptionStep.execute(CatchExceptionStep.java:35)
05-Jul-2019 10:05:13         at org.gradle.internal.execution.steps.CreateOutputsStep.execute(CreateOutputsStep.java:51)
05-Jul-2019 10:05:13         at org.gradle.internal.execution.steps.SnapshotOutputsStep.execute(SnapshotOutputsStep.java:45)
05-Jul-2019 10:05:13         at org.gradle.internal.execution.steps.SnapshotOutputsStep.execute(SnapshotOutputsStep.java:31)
05-Jul-2019 10:05:13         at org.gradle.internal.execution.steps.CacheStep.executeWithoutCache(CacheStep.java:201)
05-Jul-2019 10:05:13         at org.gradle.internal.execution.steps.CacheStep.execute(CacheStep.java:70)
05-Jul-2019 10:05:13         at org.gradle.internal.execution.steps.CacheStep.execute(CacheStep.java:45)
05-Jul-2019 10:05:13         at org.gradle.internal.execution.steps.BroadcastChangingOutputsStep.execute(BroadcastChangingOutputsStep.java:49)
05-Jul-2019 10:05:13         at org.gradle.internal.execution.steps.StoreSnapshotsStep.execute(StoreSnapshotsStep.java:43)
05-Jul-2019 10:05:13         at org.gradle.internal.execution.steps.StoreSnapshotsStep.execute(StoreSnapshotsStep.java:32)
05-Jul-2019 10:05:13         at org.gradle.internal.execution.steps.RecordOutputsStep.execute(RecordOutputsStep.java:38)
05-Jul-2019 10:05:13         at org.gradle.internal.execution.steps.RecordOutputsStep.execute(RecordOutputsStep.java:24)
05-Jul-2019 10:05:13         at org.gradle.internal.execution.steps.SkipUpToDateStep.executeBecause(SkipUpToDateStep.java:96)
05-Jul-2019 10:05:13         at org.gradle.internal.execution.steps.SkipUpToDateStep.lambda$execute$0(SkipUpToDateStep.java:89)
05-Jul-2019 10:05:13         at org.gradle.internal.execution.steps.SkipUpToDateStep.execute(SkipUpToDateStep.java:54)
05-Jul-2019 10:05:13         at org.gradle.internal.execution.steps.SkipUpToDateStep.execute(SkipUpToDateStep.java:38)
05-Jul-2019 10:05:13         at org.gradle.internal.execution.steps.ResolveChangesStep.execute(ResolveChangesStep.java:77)
05-Jul-2019 10:05:13         at org.gradle.internal.execution.steps.ResolveChangesStep.execute(ResolveChangesStep.java:37)
05-Jul-2019 10:05:13         at org.gradle.internal.execution.steps.legacy.MarkSnapshottingInputsFinishedStep.execute(MarkSnapshottingInputsFinishedStep.java:36)
05-Jul-2019 10:05:13         at org.gradle.internal.execution.steps.legacy.MarkSnapshottingInputsFinishedStep.execute(MarkSnapshottingInputsFinishedStep.java:26)
05-Jul-2019 10:05:13         at org.gradle.internal.execution.steps.ResolveCachingStateStep.execute(ResolveCachingStateStep.java:90)
05-Jul-2019 10:05:13         at org.gradle.internal.execution.steps.ResolveCachingStateStep.execute(ResolveCachingStateStep.java:48)
05-Jul-2019 10:05:13         at org.gradle.internal.execution.impl.DefaultWorkExecutor.execute(DefaultWorkExecutor.java:33)
05-Jul-2019 10:05:13         at org.gradle.api.internal.tasks.execution.ExecuteActionsTaskExecuter.execute(ExecuteActionsTaskExecuter.java:117)
05-Jul-2019 10:05:13         ... 35 more
05-Jul-2019 10:05:13
05-Jul-2019 10:05:13
05-Jul-2019 10:05:13 * Get more help at https://help.gradle.org
05-Jul-2019 10:05:13
05-Jul-2019 10:05:13 BUILD FAILED in 8m 26s
05-Jul-2019 10:05:14
05-Jul-2019 10:05:14 Failing task since return code of [./gradlew --refresh-dependencies --no-daemon -PtestGroups=ci -P BRANCH_NAME=master --stacktrace clean check build -I /tmp/artifactory.init.script3043945794577963886gradle -DbuildInfoConfig.propertiesFile=/tmp/buildinfo2981556400385977756properties artifactoryPublish -Dartifactory.resolve.password=******** -Dartifactory.publish.password=********] was 1 while expected 0
05-Jul-2019 10:05:14 Parsing test results under /opt/bamboo-home/xml-data/build-dir/SPR-PUB-JOB1...
05-Jul-2019 10:05:15 Finished task 'Artifactory Gradle' with result: Failed
05-Jul-2019 10:05:15 Running post build plugin 'Docker Container Cleanup'
05-Jul-2019 10:05:15 Running post build plugin 'NCover Results Collector'
05-Jul-2019 10:05:15 Running post build plugin 'Artifactory Release Management Staging'
05-Jul-2019 10:05:15 Running post build plugin 'Artifactory Build Info Copier'
05-Jul-2019 10:05:15 Running post build plugin 'Artifactory Gradle Properties Info Copier'
05-Jul-2019 10:05:15 Running post build plugin 'Clover Results Collector'
05-Jul-2019 10:05:15 Running post build plugin 'npm Cache Cleanup'
05-Jul-2019 10:05:15 Running post build plugin 'Artifact Copier'
05-Jul-2019 10:05:16 Successfully removed working directory at '/opt/bamboo-home/xml-data/build-dir/SPR-PUB-JOB1'
05-Jul-2019 10:05:16 Finalising the build...
05-Jul-2019 10:05:16 Stopping timer.
05-Jul-2019 10:05:16 Build SPR-PUB-JOB1-7554 completed.
05-Jul-2019 10:05:17 Running on server: post build plugin 'NCover Results Collector'
05-Jul-2019 10:05:17 Running on server: post build plugin 'Build Hanging Detection Configuration'
05-Jul-2019 10:05:17 Running on server: post build plugin 'Clover Delta Calculator'
05-Jul-2019 10:05:17 Running on server: post build plugin 'Maven Dependencies Postprocessor'
05-Jul-2019 10:05:17 All post build plugins have finished
05-Jul-2019 10:05:17 Generating build results summary...
05-Jul-2019 10:05:39 Saving build results to disk...
05-Jul-2019 10:05:39 Logging substituted variables...
05-Jul-2019 10:05:40 Indexing build results...
05-Jul-2019 10:05:40 Finished building SPR-PUB-JOB1-7554.