Build #7,570

Build: #7570 failed

Job: Default Job failed

Stages & jobs

  1. Default Stage

Build log

The build generated 567 lines of output. Download or view full build log

08-Jul-2019 18:40:21 Build Spring Framework - Publication - Default Job #7570 (SPR-PUB-JOB1-7570) started building on agent bamboo-24.af.pivotal.io
08-Jul-2019 18:40:21 Remote agent on host bamboo-24.af.pivotal.io
08-Jul-2019 18:40:21 Build working directory is /opt/bamboo-home/xml-data/build-dir/SPR-PUB-JOB1
08-Jul-2019 18:40:21 Executing build Spring Framework - Publication - Default Job #7570 (SPR-PUB-JOB1-7570)
08-Jul-2019 18:40:21 Starting task 'Checkout Default Repository' of type 'com.atlassian.bamboo.plugins.vcs:task.vcs.checkout'
08-Jul-2019 18:40:21 Build always requires a clean checkout
08-Jul-2019 18:40:21 Cleaning build directory '/opt/bamboo-home/xml-data/build-dir/SPR-PUB-JOB1'
08-Jul-2019 18:40:21 Checking out into /opt/bamboo-home/xml-data/build-dir/SPR-PUB-JOB1
08-Jul-2019 18:40:21 Updating source code to revision: 7b1a6eb50a3ed32dd7158a8553c60ebc115cc296
08-Jul-2019 18:40:21 Creating local git repository in '/opt/bamboo-home/xml-data/build-dir/SPR-PUB-JOB1/.git'.
08-Jul-2019 18:40:21 Initialized empty Git repository in /opt/bamboo-home/xml-data/build-dir/SPR-PUB-JOB1/.git/
08-Jul-2019 18:40:22 Fetching 'refs/heads/master' from 'https://github.com/spring-projects/spring-framework.git'.
08-Jul-2019 18:40:40 From https://github.com/spring-projects/spring-framework
08-Jul-2019 18:40:40 * [new branch]      master     -> master
08-Jul-2019 18:40:40 * [new tag]               v3.1.0.RELEASE -> v3.1.0.RELEASE
08-Jul-2019 18:40:40 * [new tag]               v3.2.0.M1      -> v3.2.0.M1
08-Jul-2019 18:40:40 * [new tag]               v3.2.0.M2      -> v3.2.0.M2
08-Jul-2019 18:40:40 * [new tag]               v3.2.0.RC1     -> v3.2.0.RC1
08-Jul-2019 18:40:40 * [new tag]               v3.2.0.RC2-A   -> v3.2.0.RC2-A
08-Jul-2019 18:40:40 * [new tag]               v3.2.0.RELEASE -> v3.2.0.RELEASE
08-Jul-2019 18:40:40 * [new tag]               v3.2.1.RELEASE -> v3.2.1.RELEASE
08-Jul-2019 18:40:40 * [new tag]               v3.2.2.RELEASE -> v3.2.2.RELEASE
08-Jul-2019 18:40:40 * [new tag]               v4.0.0.M1      -> v4.0.0.M1
08-Jul-2019 18:40:40 * [new tag]               v4.0.0.M2      -> v4.0.0.M2
08-Jul-2019 18:40:40 * [new tag]               v4.0.0.M3      -> v4.0.0.M3
08-Jul-2019 18:40:40 * [new tag]               v4.0.0.RC1     -> v4.0.0.RC1
08-Jul-2019 18:40:40 * [new tag]               v4.0.0.RC2     -> v4.0.0.RC2
08-Jul-2019 18:40:40 Checking out revision 7b1a6eb50a3ed32dd7158a8553c60ebc115cc296.
08-Jul-2019 18:40:41 Already on 'master'
08-Jul-2019 18:40:41 Updated source code to revision: 7b1a6eb50a3ed32dd7158a8553c60ebc115cc296
08-Jul-2019 18:40:41 Finished task 'Checkout Default Repository' with result: Success
08-Jul-2019 18:40:41 Running pre-build action: Artifactory Release Staging
08-Jul-2019 18:40:41 Running pre-build action: VCS Version Collector
08-Jul-2019 18:40:41
Substituting variable: ${bamboo.spr.jdk.home} with /opt/jdk-8
08-Jul-2019 18:40:41
Substituting variable: ${bamboo.repository.branch.name} with master
08-Jul-2019 18:40:41 Starting task 'Artifactory Gradle' of type 'org.jfrog.bamboo.bamboo-artifactory-plugin:artifactoryGradleTask'
08-Jul-2019 18:40:41 Bamboo Artifactory Plugin version: 2.6.3
08-Jul-2019 18:40:41
Beginning to execute external process for build 'Spring Framework - Publication - Default Job #7570 (SPR-PUB-JOB1-7570)'
... running command line:
./gradlew --refresh-dependencies --no-daemon -PtestGroups=ci -P BRANCH_NAME=master --stacktrace clean check build -I /tmp/artifactory.init.script9210322588455058576gradle -DbuildInfoConfig.propertiesFile=/tmp/buildinfo1863108739347181191properties artifactoryPublish -Dartifactory.resolve.password=******** -Dartifactory.publish.password=********
... in: /opt/bamboo-home/xml-data/build-dir/SPR-PUB-JOB1
... using extra environment variables:
bamboo_planRepository_1_branch=master
bamboo_********_username_password=********
bamboo_signing_store_password=********
bamboo_planRepository_2_branch=master
bamboo_capability_system_builder_ant_Ant_1_9=/opt/ant-1.9
bamboo_repository_137199621_git_repositoryUrl=https://github.com/spring-projects/spring-framework.git
bamboo_capability_system_builder_ant_Ant_1_8=/opt/ant-1.8
bamboo_planRepository_1_branchDisplayName=master
bamboo_artifactory_override_resolve_repo=libs-milestone
bamboo_capability_system_builder_node_Node_js_10_16=/opt/node-10.16/bin/node
bamboo_repository_revision_number=7b1a6eb50a3ed32dd7158a8553c60ebc115cc296
bamboo_repository_262406229_git_repositoryUrl=https://github.com/spring-projects/spring-framework.git
bamboo_artifactory_task_override_jdk=true
bamboo_RIAK_BIN=/usr/sbin/riak
WRAPPER_BITS=32
bamboo_buildKey=SPR-PUB-JOB1
bamboo_repository_137199621_name=Plan Repository
bamboo_spr_jdk_home=/opt/jdk-8
bamboo_bintray_password=********
bamboo_sonar_token_password=********
PWD=/opt/bamboo-home/bin
bamboo_planRepository_2_branchDisplayName=master
bamboo_shortJobName=Default Job
bamboo_artifactory_override_resolver_password=********
bamboo_sonatype_token=RSJChaox
bamboo_capability_system_builder_gradle___gradlew=./gradlew
bamboo_buildResultsUrl=https://build.spring.io/browse/SPR-PUB-JOB1-7570
bamboo_capability_system_builder_mvn3_Maven_3_3=/opt/maven-3.3
bamboo_capability_system_builder_mvn3_Maven_3_2=/opt/maven-3.2
bamboo_capability_system_builder_mvn3_Maven_3_1=/opt/maven-3.1
bamboo_planRepository_repositoryUrl=https://github.com/spring-projects/spring-framework.git
bamboo_capability_system_builder_mvn3_Maven_3_6=/opt/maven-3.6
bamboo_agentId=284196868
bamboo_capability_system_builder_mvn3_Maven_3_5=/opt/maven-3.5
bamboo_capability_system_builder_mvn3_Maven_3_0=/opt/maven-3.0
bamboo_planRepository_revision=7b1a6eb50a3ed32dd7158a8553c60ebc115cc296
bamboo_planRepository_previousRevision=2f77541f9c42a10a523ef50d46844dced4bde2a5
bamboo_repository_137199621_revision_number=7b1a6eb50a3ed32dd7158a8553c60ebc115cc296
bamboo_capability_remote_build=true
bamboo_repository_branch_name=master
bamboo_sonatype_token_password=********
bamboo_sonatype_user=springsource
SHLVL=1
bamboo_org_jfrog_bamboo_buildInfo_serverUrl=https://repo.spring.io
bamboo_scdf_acceptance_tests_password=********
bamboo_repository_262406229_branch_name=master
WRAPPER_OS=linux
JAVA_HOME=/opt/jdk-8/
TERM=linux
XDG_SESSION_ID=c1
bamboo_planRepository_branch=master
bamboo_org_jfrog_bamboo_release_activated=false
bamboo_planRepository_1_type=gitv2
bamboo_planRepository_branchName=master
bamboo_repository_137199621_git_username=spring-buildmaster
bamboo_capability_system_jdk_JDK_12=/opt/jdk-12
WRAPPER_FILE_SEPARATOR=/
_=/opt/bamboo-home/bin/bamboo-agent.sh
bamboo_repository_262406229_revision_number=7b1a6eb50a3ed32dd7158a8553c60ebc115cc296
bamboo_capability_system_builder_ant_Ant_1_10=/opt/ant-1.10
WRAPPER_PATH_SEPARATOR=:
bamboo_sonar_password=********
bamboo_hg_cache_directory=/opt/bamboo-home/xml-data/build-dir/_hg-repositories-cache
bamboo_planRepository_1_username=spring-buildmaster
bamboo_planRepository_type=gitv2
bamboo_repository_262406229_git_branch=master
bamboo_git_cache_directory=/opt/bamboo-home/xml-data/build-dir/_git-repositories-cache
bamboo_planRepository_2_branchName=master
bamboo_artifactory_username=buildmaster
bamboo_tmp_directory=/opt/bamboo-home/temp
bamboo_planKey=SPR-PUB
bamboo_planRepository_username=spring-buildmaster
bamboo_JDK8_HOME=/opt/jdk-8
bamboo_snifftask=sniff
bamboo_planRepository_1_branchName=master
bamboo_sonar_version=5.6.3
bamboo_sonar_jdbc_password=********
bamboo_bintray_api_key_password=********
GRADLE_OPTS=-Xms128m
bamboo_repository_262406229_git_username=spring-buildmaster
XDG_DATA_DIRS=/usr/local/share:/usr/share:/var/lib/snapd/desktop
bamboo_capability_system_jdk_JDK_1_11=/opt/jdk-11
bamboo_resultsUrl=https://build.spring.io/browse/SPR-PUB-JOB1-7570
bamboo_capability_system_jdk_JDK_1_10=/opt/jdk-10
bamboo_build_working_directory=/opt/bamboo-home/xml-data/build-dir/SPR-PUB-JOB1
bamboo_planRepository_1_name=Spring Framework
bamboo_capability_system_os=ubuntu1804
bamboo_nexusPush_stagingProfile=buildmaster
bamboo_shortPlanName=Publication
MAIL=/var/mail/bamboo
bamboo_planRepository_2_username=spring-buildmaster
bamboo_repository_137199621_branch_name=master
bamboo_planRepository_name=Spring Framework
LOGNAME=bamboo
bamboo_buildNumber=7570
bamboo_repository_137199621_git_branch=master
SHELL=/bin/bash
bamboo_planName=Spring Framework - Publication
bamboo_JDK7_HOME=/opt/jdk-7
bamboo_repository_137199621_previous_revision_number=2f77541f9c42a10a523ef50d46844dced4bde2a5
bamboo_shortPlanKey=PUB
OLDPWD=/opt/users/bamboo
bamboo_shortJobKey=JOB1
bamboo_artifactory_password=********
bamboo_repository_262406229_name=Spring Framework
bamboo_planRepository_2_name=Plan Repository
bamboo_repository_262406229_previous_revision_number=2f77541f9c42a10a523ef50d46844dced4bde2a5
bamboo_buildTimeStamp=2019-07-08T18:40:20.259Z
bamboo_repository_previous_revision_number=2f77541f9c42a10a523ef50d46844dced4bde2a5
bamboo_sonar_username=buildmaster
bamboo_********_password=********
bamboo_repository_git_branch=master
bamboo_buildResultKey=SPR-PUB-JOB1-7570
bamboo_nexusPush_close=true
bamboo_artifactory_override_resolver_username=buildmaster
bamboo_buildPlanName=Spring Framework - Publication - Default Job
bamboo_planRepository_1_revision=7b1a6eb50a3ed32dd7158a8553c60ebc115cc296
bamboo_repository_name=Plan Repository
bamboo_signing_key_password=********
bamboo_planRepository_2_previousRevision=2f77541f9c42a10a523ef50d46844dced4bde2a5
bamboo_capability_system_builder_groovy_Groovy_2_5=/opt/groovy-2.5
LANG=en_US.UTF-8
bamboo_buildFailed=false
bamboo_capability_system_docker_executable=/usr/bin/docker
DISPLAY=localhost:1.0
bamboo_capability_system_jdk_OpenJDK_7=/opt/jdk-7
bamboo_capability_system_builder_groovy_Groovy_2_4=/opt/groovy-2.4
bamboo_artifactory_override_deployer_username=buildmaster
bamboo_artifactory_password_mask_b=********
bamboo_capability_system_builder_command_Bash=/bin/bash
bamboo_artifactory_password_mask_a=********
bamboo_agentWorkingDirectory=/opt/bamboo-home/xml-data/build-dir
bamboo_planRepository_2_revision=7b1a6eb50a3ed32dd7158a8553c60ebc115cc296
bamboo_capability_system_git_executable=/usr/bin/git
bamboo_repository_git_username=spring-buildmaster
bamboo_planRepository_1_previousRevision=2f77541f9c42a10a523ef50d46844dced4bde2a5
bamboo_capability_os_family=unix
bamboo_planRepository_branchDisplayName=master
bamboo_capability_system_builder_maven_Artifactory_Maven_3_6=/opt/maven-3.6
bamboo_capability_system_builder_maven_Artifactory_Maven_3_5=/opt/maven-3.5
GIT_SSL_NO_VERIFY=true
bamboo_capability_system_builder_maven_Artifactory_Maven_3_3=/opt/maven-3.3
bamboo_planRepository_2_type=gitv2
bamboo_capability_system_builder_maven_Artifactory_Maven_3_2=/opt/maven-3.2
bamboo_s3_properties=/home/bamboo/tools/s3.properties
bamboo_capability_system_builder_maven_Artifactory_Maven_3_1=/opt/maven-3.1
bamboo_artifactory_override_deploy_repo=libs-snapshot-local
bamboo_capability_system_builder_maven_Artifactory_Maven_3_0=/opt/maven-3.0
bamboo_plan_storageTag=SPR-PUB
bamboo_bintray_username_password=********
bamboo_planRepository_2_repositoryUrl=https://github.com/spring-projects/spring-framework.git
USER=bamboo
bamboo_repository_git_repositoryUrl=https://github.com/spring-projects/spring-framework.git
bamboo_working_directory=/opt/bamboo-home/xml-data/build-dir/SPR-PUB-JOB1
bamboo_org_jfrog_bamboo_buildInfo_activated=true
bamboo_planRepository_1_repositoryUrl=https://github.com/spring-projects/spring-framework.git
bamboo_capability_system_jdk_JDK_1_8=/opt/jdk-8
bamboo_artifactory_override_deployer_password=********
bamboo_capability_system_jdk_JDK_1_9=/opt/jdk-9
WRAPPER_ARCH=x86
bamboo_capability_system_jdk_JDK_1_6=/opt/jdk-6
bamboo_sonatype_password=********
bamboo_capability_system_jdk_JDK_1_7=/opt/jdk-7
bamboo_sonar_ip=10.194.6.9
XDG_RUNTIME_DIR=/run/user/1002
HOME=/home/bamboo
PATH=/bin:/home/bamboo/bin:/usr/local/sbin:/usr/local/bin:/usr/sbin:/usr/bin:/sbin:/bin:/usr/games:/usr/local/games:/snap/bin:/home/bamboo/bin:/usr/local/bin:/bin:/home/bamboo/bin:/usr/local/sbin:/usr/local/bin:/usr/sbin:/usr/bin:/sbin:/bin:/usr/games:/usr/local/games:/snap/bin:/home/bamboo/bin:/usr/local/bin
08-Jul-2019 18:40:43 > Task :buildSrc:compileJava NO-SOURCE
08-Jul-2019 18:40:45 > Task :buildSrc:compileGroovy
08-Jul-2019 18:40:45 > Task :buildSrc:processResources
08-Jul-2019 18:40:45 > Task :buildSrc:classes
08-Jul-2019 18:40:45 > Task :buildSrc:jar
08-Jul-2019 18:40:45 > Task :buildSrc:assemble
08-Jul-2019 18:40:45 > Task :buildSrc:compileTestJava NO-SOURCE
08-Jul-2019 18:40:45 > Task :buildSrc:compileTestGroovy NO-SOURCE
08-Jul-2019 18:40:45 > Task :buildSrc:processTestResources NO-SOURCE
08-Jul-2019 18:40:45 > Task :buildSrc:testClasses UP-TO-DATE
08-Jul-2019 18:40:45 > Task :buildSrc:test NO-SOURCE
08-Jul-2019 18:40:45 > Task :buildSrc:check UP-TO-DATE
08-Jul-2019 18:40:45 > Task :buildSrc:build
08-Jul-2019 18:40:55 Cannot publish pom for project ':spring-core-coroutines' since it does not contain the Maven plugin install task and task ':spring-core-coroutines:artifactoryPublish' does not specify a custom pom path.
08-Jul-2019 18:40:55 Cannot publish pom for project ':spring-build-src' since it does not contain the Maven plugin install task and task ':spring-build-src:artifactoryPublish' does not specify a custom pom path.
08-Jul-2019 18:40:55 Cannot publish pom for project ':' since it does not contain the Maven plugin install task and task ':artifactoryPublish' does not specify a custom pom path.
08-Jul-2019 18:40:58 > Task :clean UP-TO-DATE
08-Jul-2019 18:40:58 > Task :spring-aop:clean UP-TO-DATE
08-Jul-2019 18:40:58 > Task :spring-aspects:clean UP-TO-DATE
08-Jul-2019 18:40:58 > Task :spring-beans:clean UP-TO-DATE
08-Jul-2019 18:40:58 > Task :spring-build-src:clean
08-Jul-2019 18:40:58 > Task :spring-context:clean UP-TO-DATE
08-Jul-2019 18:40:58 > Task :spring-context-indexer:clean UP-TO-DATE
08-Jul-2019 18:40:58 > Task :spring-context-support:clean UP-TO-DATE
08-Jul-2019 18:40:58 > Task :spring-core:clean UP-TO-DATE
08-Jul-2019 18:40:58 > Task :spring-core-coroutines:clean UP-TO-DATE
08-Jul-2019 18:40:58 > Task :spring-expression:clean UP-TO-DATE
08-Jul-2019 18:40:58 > Task :spring-framework-bom:clean UP-TO-DATE
08-Jul-2019 18:40:58 > Task :spring-instrument:clean UP-TO-DATE
08-Jul-2019 18:40:58 > Task :spring-jcl:clean UP-TO-DATE
08-Jul-2019 18:40:58 > Task :spring-jdbc:clean UP-TO-DATE
08-Jul-2019 18:40:58 > Task :spring-jms:clean UP-TO-DATE
08-Jul-2019 18:40:58 > Task :spring-messaging:clean UP-TO-DATE
08-Jul-2019 18:40:58 > Task :spring-orm:clean UP-TO-DATE
08-Jul-2019 18:40:58 > Task :spring-oxm:clean UP-TO-DATE
08-Jul-2019 18:40:58 > Task :spring-test:clean UP-TO-DATE
08-Jul-2019 18:40:58 > Task :spring-tx:clean UP-TO-DATE
08-Jul-2019 18:40:58 > Task :spring-web:clean UP-TO-DATE
08-Jul-2019 18:40:58 > Task :spring-webflux:clean UP-TO-DATE
08-Jul-2019 18:40:58 > Task :spring-webmvc:clean UP-TO-DATE
08-Jul-2019 18:40:58 > Task :spring-websocket:clean UP-TO-DATE
08-Jul-2019 18:40:58 > Task :compileKotlin NO-SOURCE
08-Jul-2019 18:40:58 > Task :compileJava NO-SOURCE
08-Jul-2019 18:40:58 > Task :compileGroovy NO-SOURCE
08-Jul-2019 18:40:58 > Task :processResources NO-SOURCE
08-Jul-2019 18:40:58 > Task :classes UP-TO-DATE
08-Jul-2019 18:40:58 > Task :checkstyleMain NO-SOURCE
08-Jul-2019 18:40:58 > Task :spring-core:cglibRepackJar
08-Jul-2019 18:40:59 > Task :spring-core:objenesisRepackJar
08-Jul-2019 18:41:03 > Task :spring-core-coroutines:compileKotlin
08-Jul-2019 18:41:03 > Task :spring-core-coroutines:compileJava NO-SOURCE
08-Jul-2019 18:41:03 > Task :spring-core-coroutines:processResources NO-SOURCE
08-Jul-2019 18:41:03 > Task :spring-core-coroutines:classes UP-TO-DATE
08-Jul-2019 18:41:03 > Task :spring-core-coroutines:inspectClassesForKotlinIC
08-Jul-2019 18:41:03 > Task :spring-core-coroutines:jar
08-Jul-2019 18:41:04 > Task :spring-jcl:compileKotlin
08-Jul-2019 18:41:05 > Task :spring-jcl:compileJava
08-Jul-2019 18:41:05 > Task :spring-jcl:processResources
08-Jul-2019 18:41:05 > Task :spring-jcl:classes
08-Jul-2019 18:41:05 > Task :spring-jcl:inspectClassesForKotlinIC
08-Jul-2019 18:41:05 > Task :spring-jcl:jar
08-Jul-2019 18:41:07 > Task :spring-core:compileKotlin
08-Jul-2019 18:41:10 > Task :spring-core:compileJava
08-Jul-2019 18:41:10 > Task :spring-core:processResources NO-SOURCE
08-Jul-2019 18:41:10 > Task :spring-core:classes
08-Jul-2019 18:41:10 > Task :spring-core:inspectClassesForKotlinIC
08-Jul-2019 18:41:10 > Task :spring-core:jar
08-Jul-2019 18:41:14 > Task :spring-beans:compileGroovy
08-Jul-2019 18:41:14 > Task :spring-beans:compileKotlin
08-Jul-2019 18:41:14 > Task :spring-beans:compileJava NO-SOURCE
08-Jul-2019 18:41:14 > Task :spring-beans:processResources
08-Jul-2019 18:41:14 > Task :spring-beans:classes
08-Jul-2019 18:41:14 > Task :spring-beans:inspectClassesForKotlinIC
08-Jul-2019 18:41:15 > Task :spring-beans:jar
08-Jul-2019 18:41:15 > Task :spring-aop:compileKotlin
08-Jul-2019 18:41:16 > Task :spring-aop:compileJava
08-Jul-2019 18:41:16 > Task :spring-aop:processResources
08-Jul-2019 18:41:16 > Task :spring-aop:classes
08-Jul-2019 18:41:16 > Task :spring-core-coroutines:compileTestKotlin NO-SOURCE
08-Jul-2019 18:41:16 > Task :spring-core-coroutines:compileTestJava NO-SOURCE
08-Jul-2019 18:41:16 > Task :spring-core-coroutines:processTestResources NO-SOURCE
08-Jul-2019 18:41:16 > Task :spring-core-coroutines:testClasses UP-TO-DATE
08-Jul-2019 18:41:16 > Task :spring-jcl:compileTestKotlin NO-SOURCE
08-Jul-2019 18:41:16 > Task :spring-jcl:compileTestJava NO-SOURCE
08-Jul-2019 18:41:16 > Task :spring-jcl:processTestResources NO-SOURCE
08-Jul-2019 18:41:16 > Task :spring-jcl:testClasses UP-TO-DATE
08-Jul-2019 18:41:18 > Task :spring-core:compileTestKotlin
08-Jul-2019 18:41:24 > Task :spring-core:compileTestJava
08-Jul-2019 18:41:24 > Task :spring-core:processTestResources
08-Jul-2019 18:41:24 > Task :spring-core:testClasses
08-Jul-2019 18:41:26 > Task :spring-beans:compileTestKotlin
08-Jul-2019 18:41:29
08-Jul-2019 18:41:29 > Task :spring-beans:compileTestJava
08-Jul-2019 18:41:29 Note: Some input files use unchecked or unsafe operations.
08-Jul-2019 18:41:29 Note: Recompile with -Xlint:unchecked for details.
08-Jul-2019 18:41:29
08-Jul-2019 18:41:29 > Task :spring-beans:compileTestGroovy NO-SOURCE
08-Jul-2019 18:41:29 > Task :spring-beans:processTestResources
08-Jul-2019 18:41:29 > Task :spring-beans:testClasses
08-Jul-2019 18:41:29 > Task :spring-aop:compileTestKotlin
08-Jul-2019 18:41:29 > Task :spring-aop:inspectClassesForKotlinIC
08-Jul-2019 18:41:29 > Task :spring-aop:jar
08-Jul-2019 18:41:30 > Task :spring-aop:compileTestJava
08-Jul-2019 18:41:30 > Task :spring-aop:processTestResources
08-Jul-2019 18:41:30 > Task :spring-aop:testClasses
08-Jul-2019 18:41:30 > Task :spring-expression:compileKotlin
08-Jul-2019 18:41:30 > Task :spring-expression:compileJava
08-Jul-2019 18:41:30 > Task :spring-expression:processResources
08-Jul-2019 18:41:30 > Task :spring-expression:classes
08-Jul-2019 18:41:30 > Task :spring-expression:inspectClassesForKotlinIC
08-Jul-2019 18:41:30 > Task :spring-expression:jar
08-Jul-2019 18:41:30 > Task :spring-instrument:compileKotlin
08-Jul-2019 18:41:30 > Task :spring-instrument:compileJava
08-Jul-2019 18:41:30 > Task :spring-instrument:processResources NO-SOURCE
08-Jul-2019 18:41:30 > Task :spring-instrument:classes
08-Jul-2019 18:41:30 > Task :spring-instrument:inspectClassesForKotlinIC
08-Jul-2019 18:41:30 > Task :spring-instrument:jar
08-Jul-2019 18:41:35 > Task :spring-context:compileKotlin
08-Jul-2019 18:41:36 > Task :spring-context:compileJava
08-Jul-2019 18:41:36 > Task :spring-context:compileGroovy NO-SOURCE
08-Jul-2019 18:41:36 > Task :spring-context:processResources
08-Jul-2019 18:41:36 > Task :spring-context:classes
08-Jul-2019 18:41:36 > Task :spring-expression:compileTestKotlin
08-Jul-2019 18:41:39 > Task :spring-expression:compileTestJava
08-Jul-2019 18:41:39 > Task :spring-expression:processTestResources
08-Jul-2019 18:41:39 > Task :spring-expression:testClasses
08-Jul-2019 18:41:39 > Task :spring-instrument:compileTestKotlin NO-SOURCE
08-Jul-2019 18:41:39 > Task :spring-instrument:compileTestJava NO-SOURCE
08-Jul-2019 18:41:39 > Task :spring-instrument:processTestResources
08-Jul-2019 18:41:39 > Task :spring-instrument:testClasses
08-Jul-2019 18:41:41 > Task :spring-context:compileTestKotlin
08-Jul-2019 18:41:41 > Task :spring-context:inspectClassesForKotlinIC
08-Jul-2019 18:41:41 > Task :spring-context:jar
08-Jul-2019 18:41:45
08-Jul-2019 18:41:45 > Task :spring-context:compileTestJava
08-Jul-2019 18:41:45 Note: Some input files use or override a deprecated API.
08-Jul-2019 18:41:45 Note: Recompile with -Xlint:deprecation for details.
08-Jul-2019 18:41:45 Note: Some input files use unchecked or unsafe operations.
08-Jul-2019 18:41:45 Note: Recompile with -Xlint:unchecked for details.
08-Jul-2019 18:41:46
08-Jul-2019 18:41:46 > Task :spring-context:compileTestGroovy
08-Jul-2019 18:41:47 > Task :spring-context:processTestResources
08-Jul-2019 18:41:47 > Task :spring-context:testClasses
08-Jul-2019 18:41:47 > Task :spring-tx:compileKotlin
08-Jul-2019 18:41:47 > Task :spring-tx:compileJava
08-Jul-2019 18:41:47 > Task :spring-tx:processResources
08-Jul-2019 18:41:47 > Task :spring-tx:classes
08-Jul-2019 18:41:47 > Task :spring-tx:inspectClassesForKotlinIC
08-Jul-2019 18:41:47 > Task :spring-tx:jar
08-Jul-2019 18:41:48 > Task :spring-jdbc:compileKotlin
08-Jul-2019 18:41:49 > Task :spring-jdbc:compileJava
08-Jul-2019 18:41:49 > Task :spring-jdbc:processResources
08-Jul-2019 18:41:49 > Task :spring-jdbc:classes
08-Jul-2019 18:41:49 > Task :spring-tx:compileTestKotlin
08-Jul-2019 18:42:07 > Task :spring-tx:compileTestJava
08-Jul-2019 18:42:07 > Task :spring-tx:processTestResources
08-Jul-2019 18:42:07 > Task :spring-tx:testClasses
08-Jul-2019 18:42:07 > Task :spring-jdbc:compileTestKotlin
08-Jul-2019 18:42:07 > Task :spring-jdbc:inspectClassesForKotlinIC
08-Jul-2019 18:42:08 > Task :spring-jdbc:jar
08-Jul-2019 18:42:09 > Task :spring-jdbc:compileTestJava
08-Jul-2019 18:42:09 > Task :spring-jdbc:processTestResources
08-Jul-2019 18:42:09 > Task :spring-jdbc:testClasses
08-Jul-2019 18:42:09 > Task :spring-oxm:compileKotlin
08-Jul-2019 18:42:09 > Task :spring-oxm:compileJava
08-Jul-2019 18:42:09 > Task :spring-oxm:processResources
08-Jul-2019 18:42:09 > Task :spring-oxm:classes
08-Jul-2019 18:42:09 > Task :spring-oxm:inspectClassesForKotlinIC
08-Jul-2019 18:42:09 > Task :spring-oxm:jar
08-Jul-2019 18:42:13 > Task :spring-web:compileKotlin
08-Jul-2019 18:42:15 > Task :spring-web:compileJava
08-Jul-2019 18:42:15 > Task :spring-web:processResources
08-Jul-2019 18:42:15 > Task :spring-web:classes
08-Jul-2019 18:42:15 > Task :spring-web:inspectClassesForKotlinIC
08-Jul-2019 18:42:15 > Task :spring-web:jar
08-Jul-2019 18:42:16 > Task :spring-orm:compileKotlin
08-Jul-2019 18:42:16 > Task :spring-orm:compileJava
08-Jul-2019 18:42:16 > Task :spring-orm:processResources NO-SOURCE
08-Jul-2019 18:42:16 > Task :spring-orm:classes
08-Jul-2019 18:42:17
08-Jul-2019 18:42:17 > Task :spring-oxm:genJaxb
08-Jul-2019 18:42:17 [ant:javac] : warning: 'includeantruntime' was not set, defaulting to build.sysclasspath=last; set to false for repeatable builds
08-Jul-2019 18:42:18
08-Jul-2019 18:42:18 > Task :spring-oxm:compileTestKotlin
08-Jul-2019 18:42:19 > Task :spring-oxm:compileTestJava
08-Jul-2019 18:42:19 > Task :spring-oxm:processTestResources
08-Jul-2019 18:42:19 > Task :spring-oxm:testClasses
08-Jul-2019 18:42:22 > Task :spring-web:compileTestKotlin
08-Jul-2019 18:42:26 > Task :spring-web:compileTestJava
08-Jul-2019 18:42:26 > Task :spring-web:processTestResources
08-Jul-2019 18:42:26 > Task :spring-web:testClasses
08-Jul-2019 18:42:26 > Task :spring-orm:compileTestKotlin
08-Jul-2019 18:42:26 > Task :spring-orm:inspectClassesForKotlinIC
08-Jul-2019 18:42:26 > Task :spring-orm:jar
08-Jul-2019 18:42:27 > Task :spring-orm:compileTestJava
08-Jul-2019 18:42:27 > Task :spring-orm:processTestResources
08-Jul-2019 18:42:27 > Task :spring-orm:testClasses
08-Jul-2019 18:42:27 > Task :spring-context-support:compileKotlin
08-Jul-2019 18:42:27 > Task :spring-context-support:compileJava
08-Jul-2019 18:42:27 > Task :spring-context-support:processResources
08-Jul-2019 18:42:27 > Task :spring-context-support:classes
08-Jul-2019 18:42:27 > Task :spring-context-support:compileTestKotlin
08-Jul-2019 18:42:27 > Task :spring-context-support:inspectClassesForKotlinIC
08-Jul-2019 18:42:28 > Task :spring-context-support:jar
08-Jul-2019 18:42:28 > Task :spring-context-support:compileTestJava
08-Jul-2019 18:42:28 > Task :spring-context-support:processTestResources
08-Jul-2019 18:42:28 > Task :spring-context-support:testClasses
08-Jul-2019 18:42:30 > Task :spring-webflux:compileKotlin
08-Jul-2019 18:42:31 > Task :spring-webflux:compileJava
08-Jul-2019 18:42:31 > Task :spring-webflux:processResources
08-Jul-2019 18:42:31 > Task :spring-webflux:classes
08-Jul-2019 18:42:31 > Task :spring-webflux:inspectClassesForKotlinIC
08-Jul-2019 18:42:31 > Task :spring-webflux:jar
08-Jul-2019 18:42:33 > Task :spring-webmvc:compileKotlin
08-Jul-2019 18:42:34 > Task :spring-webmvc:compileJava
08-Jul-2019 18:42:34 > Task :spring-webmvc:processResources
08-Jul-2019 18:42:34 > Task :spring-webmvc:classes
08-Jul-2019 18:42:34 > Task :spring-webmvc:inspectClassesForKotlinIC
08-Jul-2019 18:42:34 > Task :spring-webmvc:jar
08-Jul-2019 18:42:35 > Task :spring-messaging:compileKotlin
08-Jul-2019 18:42:36 > Task :spring-messaging:compileJava
08-Jul-2019 18:42:36 > Task :spring-messaging:processResources NO-SOURCE
08-Jul-2019 18:42:36 > Task :spring-messaging:classes
08-Jul-2019 18:42:36 > Task :spring-messaging:inspectClassesForKotlinIC
08-Jul-2019 18:42:36 > Task :spring-messaging:jar
08-Jul-2019 18:42:36 > Task :spring-websocket:compileKotlin
08-Jul-2019 18:42:37 > Task :spring-websocket:compileJava
08-Jul-2019 18:42:37 > Task :spring-websocket:processResources
08-Jul-2019 18:42:37 > Task :spring-websocket:classes
08-Jul-2019 18:42:37 > Task :spring-websocket:inspectClassesForKotlinIC
08-Jul-2019 18:42:37 > Task :spring-websocket:jar
08-Jul-2019 18:42:39 > Task :spring-test:compileKotlin
08-Jul-2019 18:42:40 > Task :spring-test:compileJava
08-Jul-2019 18:42:40 > Task :spring-test:processResources
08-Jul-2019 18:42:40 > Task :spring-test:classes
08-Jul-2019 18:42:42 > Task :spring-webflux:compileTestKotlin
08-Jul-2019 18:42:44 > Task :spring-webflux:compileTestJava
08-Jul-2019 18:42:44 > Task :spring-webflux:processTestResources
08-Jul-2019 18:42:44 > Task :spring-webflux:testClasses
08-Jul-2019 18:42:45 > Task :spring-webmvc:compileTestKotlin
08-Jul-2019 18:42:49 > Task :spring-webmvc:compileTestJava
08-Jul-2019 18:42:49 > Task :spring-webmvc:processTestResources
08-Jul-2019 18:42:49 > Task :spring-webmvc:testClasses
08-Jul-2019 18:42:50 > Task :spring-messaging:compileTestKotlin
08-Jul-2019 18:42:52 > Task :spring-messaging:compileTestJava
08-Jul-2019 18:42:52 > Task :spring-messaging:processTestResources
08-Jul-2019 18:42:52 > Task :spring-messaging:testClasses
08-Jul-2019 18:42:52 > Task :spring-websocket:compileTestKotlin
08-Jul-2019 18:42:53 > Task :spring-websocket:compileTestJava
08-Jul-2019 18:42:53 > Task :spring-websocket:processTestResources
08-Jul-2019 18:42:53 > Task :spring-websocket:testClasses
08-Jul-2019 18:42:54 > Task :spring-test:compileTestKotlin
08-Jul-2019 18:42:54 > Task :spring-test:inspectClassesForKotlinIC
08-Jul-2019 18:42:55 > Task :spring-test:jar
08-Jul-2019 18:42:57 > Task :spring-test:compileTestJava
08-Jul-2019 18:42:57 > Task :spring-test:processTestResources
08-Jul-2019 18:42:57 > Task :spring-test:testClasses
08-Jul-2019 18:42:57 > Task :compileTestKotlin
08-Jul-2019 18:42:58 > Task :compileTestJava
08-Jul-2019 18:42:58 > Task :compileTestGroovy NO-SOURCE
08-Jul-2019 18:42:58 > Task :processTestResources
08-Jul-2019 18:42:58 > Task :testClasses
08-Jul-2019 18:43:00 > Task :checkstyleTest
08-Jul-2019 18:43:04 > Task :test
08-Jul-2019 18:43:04 > Task :check
08-Jul-2019 18:43:06 > Task :spring-aop:checkstyleMain
08-Jul-2019 18:43:07 > Task :spring-aop:checkstyleTest
08-Jul-2019 18:43:10 > Task :spring-aop:test
08-Jul-2019 18:43:10 > Task :spring-aop:check
08-Jul-2019 18:43:10 > Task :spring-aspects:compileKotlin
08-Jul-2019 18:43:12 > Task :spring-aspects:compileJava
08-Jul-2019 18:43:12 > Task :spring-aspects:processResources
08-Jul-2019 18:43:12 > Task :spring-aspects:classes
08-Jul-2019 18:43:12 > Task :spring-aspects:checkstyleMain
08-Jul-2019 18:43:12 > Task :spring-aspects:compileTestKotlin
08-Jul-2019 18:43:12 > Task :spring-aspects:inspectClassesForKotlinIC
08-Jul-2019 18:43:12 > Task :spring-aspects:jar
08-Jul-2019 18:43:14 > Task :spring-aspects:compileTestJava
08-Jul-2019 18:43:14 > Task :spring-aspects:processTestResources
08-Jul-2019 18:43:14 > Task :spring-aspects:testClasses
08-Jul-2019 18:43:14 > Task :spring-aspects:checkstyleTest
08-Jul-2019 18:43:19 > Task :spring-aspects:test
08-Jul-2019 18:43:19 > Task :spring-aspects:check
08-Jul-2019 18:43:22 > Task :spring-beans:checkstyleMain
08-Jul-2019 18:43:23 > Task :spring-beans:checkstyleTest
08-Jul-2019 18:43:32 > Task :spring-beans:test
08-Jul-2019 18:43:32 > Task :spring-beans:check
08-Jul-2019 18:43:32 > Task :spring-build-src:compileKotlin NO-SOURCE
08-Jul-2019 18:43:32 > Task :spring-build-src:compileJava NO-SOURCE
08-Jul-2019 18:43:32 > Task :spring-build-src:compileGroovy
08-Jul-2019 18:43:32 > Task :spring-build-src:processResources
08-Jul-2019 18:43:32 > Task :spring-build-src:classes
08-Jul-2019 18:43:32 > Task :spring-build-src:checkstyleMain NO-SOURCE
08-Jul-2019 18:43:32 > Task :spring-build-src:compileTestKotlin NO-SOURCE
08-Jul-2019 18:43:32 > Task :spring-build-src:compileTestJava NO-SOURCE
08-Jul-2019 18:43:32 > Task :spring-build-src:compileTestGroovy NO-SOURCE
08-Jul-2019 18:43:32 > Task :spring-build-src:processTestResources NO-SOURCE
08-Jul-2019 18:43:32 > Task :spring-build-src:testClasses UP-TO-DATE
08-Jul-2019 18:43:32 > Task :spring-build-src:checkstyleTest NO-SOURCE
08-Jul-2019 18:43:32 > Task :spring-build-src:test NO-SOURCE
08-Jul-2019 18:43:32 > Task :spring-build-src:check UP-TO-DATE
08-Jul-2019 18:43:36 > Task :spring-context:checkstyleMain
08-Jul-2019 18:43:39 > Task :spring-context:checkstyleTest
08-Jul-2019 18:44:09 > Task :spring-context:test
08-Jul-2019 18:44:12 > Task :spring-context:check
08-Jul-2019 18:44:12 > Task :spring-context-indexer:compileKotlin
08-Jul-2019 18:44:12 > Task :spring-context-indexer:compileJava
08-Jul-2019 18:44:12 > Task :spring-context-indexer:processResources
08-Jul-2019 18:44:12 > Task :spring-context-indexer:classes
08-Jul-2019 18:44:13 > Task :spring-context-indexer:checkstyleMain
08-Jul-2019 18:44:13 > Task :spring-context-indexer:compileTestKotlin
08-Jul-2019 18:44:13 > Task :spring-context-indexer:compileTestJava
08-Jul-2019 18:44:13 > Task :spring-context-indexer:processTestResources NO-SOURCE
08-Jul-2019 18:44:13 > Task :spring-context-indexer:testClasses
08-Jul-2019 18:44:13 > Task :spring-context-indexer:checkstyleTest
08-Jul-2019 18:44:15 > Task :spring-context-indexer:test
08-Jul-2019 18:44:15 > Task :spring-context-indexer:check
08-Jul-2019 18:44:16 > Task :spring-context-support:checkstyleMain
08-Jul-2019 18:44:16 > Task :spring-context-support:checkstyleTest
08-Jul-2019 18:44:26 > Task :spring-context-support:test
08-Jul-2019 18:44:26 > Task :spring-context-support:check
08-Jul-2019 18:44:31 > Task :spring-core:checkstyleMain
08-Jul-2019 18:44:33 > Task :spring-core:checkstyleTest
08-Jul-2019 18:44:44 > Task :spring-core:test
08-Jul-2019 18:44:44 > Task :spring-core:check
08-Jul-2019 18:44:44 > Task :spring-core-coroutines:checkstyleMain NO-SOURCE
08-Jul-2019 18:44:44 > Task :spring-core-coroutines:checkstyleTest NO-SOURCE
08-Jul-2019 18:44:44 > Task :spring-core-coroutines:test NO-SOURCE
08-Jul-2019 18:44:44 > Task :spring-core-coroutines:check UP-TO-DATE
08-Jul-2019 18:44:45 > Task :spring-expression:checkstyleMain
08-Jul-2019 18:44:46 > Task :spring-expression:checkstyleTest
08-Jul-2019 18:44:48 > Task :spring-expression:test
08-Jul-2019 18:44:48 > Task :spring-expression:check
08-Jul-2019 18:44:48 > Task :spring-framework-bom:compileKotlin NO-SOURCE
08-Jul-2019 18:44:48 > Task :spring-framework-bom:compileJava NO-SOURCE
08-Jul-2019 18:44:48 > Task :spring-framework-bom:processResources NO-SOURCE
08-Jul-2019 18:44:48 > Task :spring-framework-bom:classes UP-TO-DATE
08-Jul-2019 18:44:48 > Task :spring-framework-bom:checkstyleMain NO-SOURCE
08-Jul-2019 18:44:48 > Task :spring-framework-bom:compileTestKotlin NO-SOURCE
08-Jul-2019 18:44:48 > Task :spring-framework-bom:compileTestJava NO-SOURCE
08-Jul-2019 18:44:48 > Task :spring-framework-bom:processTestResources NO-SOURCE
08-Jul-2019 18:44:48 > Task :spring-framework-bom:testClasses UP-TO-DATE
08-Jul-2019 18:44:48 > Task :spring-framework-bom:checkstyleTest NO-SOURCE
08-Jul-2019 18:44:48 > Task :spring-framework-bom:test NO-SOURCE
08-Jul-2019 18:44:48 > Task :spring-framework-bom:check UP-TO-DATE
08-Jul-2019 18:44:48 > Task :spring-instrument:checkstyleMain
08-Jul-2019 18:44:48 > Task :spring-instrument:checkstyleTest NO-SOURCE
08-Jul-2019 18:44:48 > Task :spring-instrument:test NO-SOURCE
08-Jul-2019 18:44:48 > Task :spring-instrument:check
08-Jul-2019 18:44:48 > Task :spring-jcl:checkstyleMain
08-Jul-2019 18:44:48 > Task :spring-jcl:checkstyleTest NO-SOURCE
08-Jul-2019 18:44:48 > Task :spring-jcl:test NO-SOURCE
08-Jul-2019 18:44:48 > Task :spring-jcl:check
08-Jul-2019 18:44:50 > Task :spring-jdbc:checkstyleMain
08-Jul-2019 18:44:51 > Task :spring-jdbc:checkstyleTest
08-Jul-2019 18:45:00 > Task :spring-jdbc:test
08-Jul-2019 18:45:00 > Task :spring-jdbc:check
08-Jul-2019 18:45:00 > Task :spring-jms:compileKotlin
08-Jul-2019 18:45:00 > Task :spring-jms:compileJava
08-Jul-2019 18:45:00 > Task :spring-jms:processResources
08-Jul-2019 18:45:00 > Task :spring-jms:classes
08-Jul-2019 18:45:01 > Task :spring-jms:checkstyleMain
08-Jul-2019 18:45:01 > Task :spring-jms:compileTestKotlin
08-Jul-2019 18:45:02 > Task :spring-jms:compileTestJava
08-Jul-2019 18:45:02 > Task :spring-jms:processTestResources
08-Jul-2019 18:45:02 > Task :spring-jms:testClasses
08-Jul-2019 18:45:02 > Task :spring-jms:checkstyleTest
08-Jul-2019 18:45:07 > Task :spring-jms:test
08-Jul-2019 18:45:07 > Task :spring-jms:check
08-Jul-2019 18:45:08
08-Jul-2019 18:45:08 > Task :spring-messaging:checkstyleMain FAILED
08-Jul-2019 18:45:08
08-Jul-2019 18:45:08 Deprecated Gradle features were used in this build, making it incompatible with Gradle 6.0.
08-Jul-2019 18:45:08 Use '--warning-mode all' to show the individual deprecation warnings.
08-Jul-2019 18:45:08 See https://docs.gradle.org/5.5/userguide/command_line_interface.html#sec:command_line_warnings
08-Jul-2019 18:45:08 226 actionable tasks: 202 executed, 24 up-to-date
08-Jul-2019 18:45:08 [ant:checkstyle] [ERROR] /opt/bamboo-home/xml-data/build-dir/SPR-PUB-JOB1/spring-messaging/src/main/java/org/springframework/messaging/handler/annotation/MessageMapping.java:61: Javadoc comment at column 30 has parse error. Missed HTML close tag 'T'. Sometimes it means that close tag missed for one of previous tags. [AtclauseOrder]
08-Jul-2019 18:45:08
08-Jul-2019 18:45:08 FAILURE: Build failed with an exception.
08-Jul-2019 18:45:08
08-Jul-2019 18:45:08 * What went wrong:
08-Jul-2019 18:45:08 Execution failed for task ':spring-messaging:checkstyleMain'.
08-Jul-2019 18:45:08 > Checkstyle rule violations were found. See the report at: file:///opt/bamboo-home/xml-data/build-dir/SPR-PUB-JOB1/spring-messaging/build/reports/checkstyle/main.html
08-Jul-2019 18:45:08   Checkstyle files with violations: 1
08-Jul-2019 18:45:08   Checkstyle violations by severity: [error:1]
08-Jul-2019 18:45:08
08-Jul-2019 18:45:08
08-Jul-2019 18:45:08 * Try:
08-Jul-2019 18:45:08 Run with --info or --debug option to get more log output. Run with --scan to get full insights.
08-Jul-2019 18:45:08
08-Jul-2019 18:45:08 * Exception is:
08-Jul-2019 18:45:08 org.gradle.api.tasks.TaskExecutionException: Execution failed for task ':spring-messaging:checkstyleMain'.
08-Jul-2019 18:45:08         at org.gradle.api.internal.tasks.execution.ExecuteActionsTaskExecuter$3.accept(ExecuteActionsTaskExecuter.java:148)
08-Jul-2019 18:45:08         at org.gradle.api.internal.tasks.execution.ExecuteActionsTaskExecuter$3.accept(ExecuteActionsTaskExecuter.java:145)
08-Jul-2019 18:45:08         at org.gradle.internal.Try$Failure.ifSuccessfulOrElse(Try.java:191)
08-Jul-2019 18:45:08         at org.gradle.api.internal.tasks.execution.ExecuteActionsTaskExecuter.execute(ExecuteActionsTaskExecuter.java:138)
08-Jul-2019 18:45:08         at org.gradle.api.internal.tasks.execution.ResolveBeforeExecutionStateTaskExecuter.execute(ResolveBeforeExecutionStateTaskExecuter.java:75)
08-Jul-2019 18:45:08         at org.gradle.api.internal.tasks.execution.ValidatingTaskExecuter.execute(ValidatingTaskExecuter.java:62)
08-Jul-2019 18:45:08         at org.gradle.api.internal.tasks.execution.SkipEmptySourceFilesTaskExecuter.execute(SkipEmptySourceFilesTaskExecuter.java:108)
08-Jul-2019 18:45:08         at org.gradle.api.internal.tasks.execution.ResolveBeforeExecutionOutputsTaskExecuter.execute(ResolveBeforeExecutionOutputsTaskExecuter.java:67)
08-Jul-2019 18:45:08         at org.gradle.api.internal.tasks.execution.ResolveAfterPreviousExecutionStateTaskExecuter.execute(ResolveAfterPreviousExecutionStateTaskExecuter.java:46)
08-Jul-2019 18:45:08         at org.gradle.api.internal.tasks.execution.CleanupStaleOutputsExecuter.execute(CleanupStaleOutputsExecuter.java:94)
08-Jul-2019 18:45:08         at org.gradle.api.internal.tasks.execution.FinalizePropertiesTaskExecuter.execute(FinalizePropertiesTaskExecuter.java:46)
08-Jul-2019 18:45:08         at org.gradle.api.internal.tasks.execution.ResolveTaskExecutionModeExecuter.execute(ResolveTaskExecutionModeExecuter.java:95)
08-Jul-2019 18:45:08         at org.gradle.api.internal.tasks.execution.SkipTaskWithNoActionsExecuter.execute(SkipTaskWithNoActionsExecuter.java:57)
08-Jul-2019 18:45:08         at org.gradle.api.internal.tasks.execution.SkipOnlyIfTaskExecuter.execute(SkipOnlyIfTaskExecuter.java:56)
08-Jul-2019 18:45:08         at org.gradle.api.internal.tasks.execution.CatchExceptionTaskExecuter.execute(CatchExceptionTaskExecuter.java:36)
08-Jul-2019 18:45:08         at org.gradle.api.internal.tasks.execution.EventFiringTaskExecuter$1.executeTask(EventFiringTaskExecuter.java:73)
08-Jul-2019 18:45:08         at org.gradle.api.internal.tasks.execution.EventFiringTaskExecuter$1.call(EventFiringTaskExecuter.java:52)
08-Jul-2019 18:45:08         at org.gradle.api.internal.tasks.execution.EventFiringTaskExecuter$1.call(EventFiringTaskExecuter.java:49)
08-Jul-2019 18:45:08         at org.gradle.internal.operations.DefaultBuildOperationExecutor$CallableBuildOperationWorker.execute(DefaultBuildOperationExecutor.java:416)
08-Jul-2019 18:45:08         at org.gradle.internal.operations.DefaultBuildOperationExecutor$CallableBuildOperationWorker.execute(DefaultBuildOperationExecutor.java:406)
08-Jul-2019 18:45:08         at org.gradle.internal.operations.DefaultBuildOperationExecutor$1.execute(DefaultBuildOperationExecutor.java:165)
08-Jul-2019 18:45:08         at org.gradle.internal.operations.DefaultBuildOperationExecutor.execute(DefaultBuildOperationExecutor.java:250)
08-Jul-2019 18:45:08         at org.gradle.internal.operations.DefaultBuildOperationExecutor.execute(DefaultBuildOperationExecutor.java:158)
08-Jul-2019 18:45:08         at org.gradle.internal.operations.DefaultBuildOperationExecutor.call(DefaultBuildOperationExecutor.java:102)
08-Jul-2019 18:45:08         at org.gradle.internal.operations.DelegatingBuildOperationExecutor.call(DelegatingBuildOperationExecutor.java:36)
08-Jul-2019 18:45:08         at org.gradle.api.internal.tasks.execution.EventFiringTaskExecuter.execute(EventFiringTaskExecuter.java:49)
08-Jul-2019 18:45:08         at org.gradle.execution.plan.LocalTaskNodeExecutor.execute(LocalTaskNodeExecutor.java:43)
08-Jul-2019 18:45:08         at org.gradle.execution.taskgraph.DefaultTaskExecutionGraph$InvokeNodeExecutorsAction.execute(DefaultTaskExecutionGraph.java:355)
08-Jul-2019 18:45:08         at org.gradle.execution.taskgraph.DefaultTaskExecutionGraph$InvokeNodeExecutorsAction.execute(DefaultTaskExecutionGraph.java:343)
08-Jul-2019 18:45:08         at org.gradle.execution.taskgraph.DefaultTaskExecutionGraph$BuildOperationAwareExecutionAction.execute(DefaultTaskExecutionGraph.java:336)
08-Jul-2019 18:45:08         at org.gradle.execution.taskgraph.DefaultTaskExecutionGraph$BuildOperationAwareExecutionAction.execute(DefaultTaskExecutionGraph.java:322)
08-Jul-2019 18:45:08         at org.gradle.execution.plan.DefaultPlanExecutor$ExecutorWorker$1.execute(DefaultPlanExecutor.java:134)
08-Jul-2019 18:45:08         at org.gradle.execution.plan.DefaultPlanExecutor$ExecutorWorker$1.execute(DefaultPlanExecutor.java:129)
08-Jul-2019 18:45:08         at org.gradle.execution.plan.DefaultPlanExecutor$ExecutorWorker.execute(DefaultPlanExecutor.java:202)
08-Jul-2019 18:45:08         at org.gradle.execution.plan.DefaultPlanExecutor$ExecutorWorker.executeNextNode(DefaultPlanExecutor.java:193)
08-Jul-2019 18:45:08         at org.gradle.execution.plan.DefaultPlanExecutor$ExecutorWorker.run(DefaultPlanExecutor.java:129)
08-Jul-2019 18:45:08         at org.gradle.internal.concurrent.ExecutorPolicy$CatchAndRecordFailures.onExecute(ExecutorPolicy.java:63)
08-Jul-2019 18:45:08         at org.gradle.internal.concurrent.ManagedExecutorImpl$1.run(ManagedExecutorImpl.java:46)
08-Jul-2019 18:45:08         at org.gradle.internal.concurrent.ThreadFactoryImpl$ManagedThreadRunnable.run(ThreadFactoryImpl.java:55)
08-Jul-2019 18:45:08 Caused by: org.gradle.api.GradleException: Checkstyle rule violations were found. See the report at: file:///opt/bamboo-home/xml-data/build-dir/SPR-PUB-JOB1/spring-messaging/build/reports/checkstyle/main.html
08-Jul-2019 18:45:08 Checkstyle files with violations: 1
08-Jul-2019 18:45:08 Checkstyle violations by severity: [error:1]
08-Jul-2019 18:45:08
08-Jul-2019 18:45:08         at org.gradle.api.plugins.quality.internal.CheckstyleInvoker$_invoke_closure1.doCall(CheckstyleInvoker.groovy:102)
08-Jul-2019 18:45:08         at org.gradle.util.ClosureBackedAction.execute(ClosureBackedAction.java:70)
08-Jul-2019 18:45:08         at org.gradle.util.ClosureBackedAction.execute(ClosureBackedAction.java:52)
08-Jul-2019 18:45:08         at org.gradle.api.internal.project.antbuilder.DefaultIsolatedAntBuilder$2.execute(DefaultIsolatedAntBuilder.java:152)
08-Jul-2019 18:45:08         at org.gradle.api.internal.project.antbuilder.DefaultIsolatedAntBuilder$2.execute(DefaultIsolatedAntBuilder.java:134)
08-Jul-2019 18:45:08         at org.gradle.api.internal.project.antbuilder.ClassPathToClassLoaderCache.withCachedClassLoader(ClassPathToClassLoaderCache.java:134)
08-Jul-2019 18:45:08         at org.gradle.api.internal.project.antbuilder.DefaultIsolatedAntBuilder.execute(DefaultIsolatedAntBuilder.java:128)
08-Jul-2019 18:45:08         at org.gradle.api.internal.project.IsolatedAntBuilder$execute$0.call(Unknown Source)
08-Jul-2019 18:45:08         at org.gradle.api.plugins.quality.internal.CheckstyleInvoker.invoke(CheckstyleInvoker.groovy:51)
08-Jul-2019 18:45:08         at org.gradle.api.plugins.quality.Checkstyle.run(Checkstyle.java:148)
08-Jul-2019 18:45:08         at org.gradle.internal.reflect.JavaMethod.invoke(JavaMethod.java:103)
08-Jul-2019 18:45:08         at org.gradle.api.internal.project.taskfactory.StandardTaskAction.doExecute(StandardTaskAction.java:48)
08-Jul-2019 18:45:08         at org.gradle.api.internal.project.taskfactory.StandardTaskAction.execute(StandardTaskAction.java:41)
08-Jul-2019 18:45:08         at org.gradle.api.internal.project.taskfactory.StandardTaskAction.execute(StandardTaskAction.java:28)
08-Jul-2019 18:45:08         at org.gradle.api.internal.AbstractTask$TaskActionWrapper.execute(AbstractTask.java:702)
08-Jul-2019 18:45:08         at org.gradle.api.internal.AbstractTask$TaskActionWrapper.execute(AbstractTask.java:669)
08-Jul-2019 18:45:08         at org.gradle.api.internal.tasks.execution.ExecuteActionsTaskExecuter$5.run(ExecuteActionsTaskExecuter.java:401)
08-Jul-2019 18:45:08         at org.gradle.internal.operations.DefaultBuildOperationExecutor$RunnableBuildOperationWorker.execute(DefaultBuildOperationExecutor.java:402)
08-Jul-2019 18:45:08         at org.gradle.internal.operations.DefaultBuildOperationExecutor$RunnableBuildOperationWorker.execute(DefaultBuildOperationExecutor.java:394)
08-Jul-2019 18:45:08         at org.gradle.internal.operations.DefaultBuildOperationExecutor$1.execute(DefaultBuildOperationExecutor.java:165)
08-Jul-2019 18:45:08         at org.gradle.internal.operations.DefaultBuildOperationExecutor.execute(DefaultBuildOperationExecutor.java:250)
08-Jul-2019 18:45:08         at org.gradle.internal.operations.DefaultBuildOperationExecutor.execute(DefaultBuildOperationExecutor.java:158)
08-Jul-2019 18:45:08         at org.gradle.internal.operations.DefaultBuildOperationExecutor.run(DefaultBuildOperationExecutor.java:92)
08-Jul-2019 18:45:08         at org.gradle.internal.operations.DelegatingBuildOperationExecutor.run(DelegatingBuildOperationExecutor.java:31)
08-Jul-2019 18:45:08         at org.gradle.api.internal.tasks.execution.ExecuteActionsTaskExecuter.executeAction(ExecuteActionsTaskExecuter.java:390)
08-Jul-2019 18:45:08         at org.gradle.api.internal.tasks.execution.ExecuteActionsTaskExecuter.executeActions(ExecuteActionsTaskExecuter.java:373)
08-Jul-2019 18:45:08         at org.gradle.api.internal.tasks.execution.ExecuteActionsTaskExecuter.access$200(ExecuteActionsTaskExecuter.java:79)
08-Jul-2019 18:45:08         at org.gradle.api.internal.tasks.execution.ExecuteActionsTaskExecuter$TaskExecution.execute(ExecuteActionsTaskExecuter.java:210)
08-Jul-2019 18:45:08         at org.gradle.internal.execution.steps.ExecuteStep.lambda$execute$1(ExecuteStep.java:33)
08-Jul-2019 18:45:08         at org.gradle.internal.execution.steps.ExecuteStep.execute(ExecuteStep.java:33)
08-Jul-2019 18:45:08         at org.gradle.internal.execution.steps.ExecuteStep.execute(ExecuteStep.java:26)
08-Jul-2019 18:45:08         at org.gradle.internal.execution.steps.CleanupOutputsStep.execute(CleanupOutputsStep.java:58)
08-Jul-2019 18:45:08         at org.gradle.internal.execution.steps.CleanupOutputsStep.execute(CleanupOutputsStep.java:35)
08-Jul-2019 18:45:08         at org.gradle.internal.execution.steps.ResolveInputChangesStep.execute(ResolveInputChangesStep.java:48)
08-Jul-2019 18:45:08         at org.gradle.internal.execution.steps.ResolveInputChangesStep.execute(ResolveInputChangesStep.java:33)
08-Jul-2019 18:45:08         at org.gradle.internal.execution.steps.CancelExecutionStep.execute(CancelExecutionStep.java:39)
08-Jul-2019 18:45:08         at org.gradle.internal.execution.steps.TimeoutStep.executeWithoutTimeout(TimeoutStep.java:73)
08-Jul-2019 18:45:08         at org.gradle.internal.execution.steps.TimeoutStep.execute(TimeoutStep.java:54)
08-Jul-2019 18:45:08         at org.gradle.internal.execution.steps.CatchExceptionStep.execute(CatchExceptionStep.java:35)
08-Jul-2019 18:45:08         at org.gradle.internal.execution.steps.CreateOutputsStep.execute(CreateOutputsStep.java:51)
08-Jul-2019 18:45:08         at org.gradle.internal.execution.steps.SnapshotOutputsStep.execute(SnapshotOutputsStep.java:45)
08-Jul-2019 18:45:08         at org.gradle.internal.execution.steps.SnapshotOutputsStep.execute(SnapshotOutputsStep.java:31)
08-Jul-2019 18:45:08         at org.gradle.internal.execution.steps.CacheStep.executeWithoutCache(CacheStep.java:201)
08-Jul-2019 18:45:08         at org.gradle.internal.execution.steps.CacheStep.execute(CacheStep.java:70)
08-Jul-2019 18:45:08         at org.gradle.internal.execution.steps.CacheStep.execute(CacheStep.java:45)
08-Jul-2019 18:45:08         at org.gradle.internal.execution.steps.BroadcastChangingOutputsStep.execute(BroadcastChangingOutputsStep.java:49)
08-Jul-2019 18:45:08         at org.gradle.internal.execution.steps.StoreSnapshotsStep.execute(StoreSnapshotsStep.java:43)
08-Jul-2019 18:45:08         at org.gradle.internal.execution.steps.StoreSnapshotsStep.execute(StoreSnapshotsStep.java:32)
08-Jul-2019 18:45:08         at org.gradle.internal.execution.steps.RecordOutputsStep.execute(RecordOutputsStep.java:38)
08-Jul-2019 18:45:08         at org.gradle.internal.execution.steps.RecordOutputsStep.execute(RecordOutputsStep.java:24)
08-Jul-2019 18:45:08         at org.gradle.internal.execution.steps.SkipUpToDateStep.executeBecause(SkipUpToDateStep.java:96)
08-Jul-2019 18:45:08         at org.gradle.internal.execution.steps.SkipUpToDateStep.lambda$execute$0(SkipUpToDateStep.java:89)
08-Jul-2019 18:45:08         at org.gradle.internal.execution.steps.SkipUpToDateStep.execute(SkipUpToDateStep.java:54)
08-Jul-2019 18:45:08         at org.gradle.internal.execution.steps.SkipUpToDateStep.execute(SkipUpToDateStep.java:38)
08-Jul-2019 18:45:08         at org.gradle.internal.execution.steps.ResolveChangesStep.execute(ResolveChangesStep.java:77)
08-Jul-2019 18:45:08         at org.gradle.internal.execution.steps.ResolveChangesStep.execute(ResolveChangesStep.java:37)
08-Jul-2019 18:45:08         at org.gradle.internal.execution.steps.legacy.MarkSnapshottingInputsFinishedStep.execute(MarkSnapshottingInputsFinishedStep.java:36)
08-Jul-2019 18:45:08         at org.gradle.internal.execution.steps.legacy.MarkSnapshottingInputsFinishedStep.execute(MarkSnapshottingInputsFinishedStep.java:26)
08-Jul-2019 18:45:08         at org.gradle.internal.execution.steps.ResolveCachingStateStep.execute(ResolveCachingStateStep.java:90)
08-Jul-2019 18:45:08         at org.gradle.internal.execution.steps.ResolveCachingStateStep.execute(ResolveCachingStateStep.java:48)
08-Jul-2019 18:45:08         at org.gradle.internal.execution.impl.DefaultWorkExecutor.execute(DefaultWorkExecutor.java:33)
08-Jul-2019 18:45:08         at org.gradle.api.internal.tasks.execution.ExecuteActionsTaskExecuter.execute(ExecuteActionsTaskExecuter.java:117)
08-Jul-2019 18:45:08         ... 35 more
08-Jul-2019 18:45:08
08-Jul-2019 18:45:08
08-Jul-2019 18:45:08 * Get more help at https://help.gradle.org
08-Jul-2019 18:45:08
08-Jul-2019 18:45:08 BUILD FAILED in 4m 27s
08-Jul-2019 18:45:09
08-Jul-2019 18:45:09 Failing task since return code of [./gradlew --refresh-dependencies --no-daemon -PtestGroups=ci -P BRANCH_NAME=master --stacktrace clean check build -I /tmp/artifactory.init.script9210322588455058576gradle -DbuildInfoConfig.propertiesFile=/tmp/buildinfo1863108739347181191properties artifactoryPublish -Dartifactory.resolve.password=******** -Dartifactory.publish.password=********] was 1 while expected 0
08-Jul-2019 18:45:09 Parsing test results under /opt/bamboo-home/xml-data/build-dir/SPR-PUB-JOB1...
08-Jul-2019 18:45:10 Finished task 'Artifactory Gradle' with result: Failed
08-Jul-2019 18:45:10 Running post build plugin 'Docker Container Cleanup'
08-Jul-2019 18:45:10 Running post build plugin 'NCover Results Collector'
08-Jul-2019 18:45:10 Running post build plugin 'Artifactory Release Management Staging'
08-Jul-2019 18:45:10 Running post build plugin 'Artifactory Build Info Copier'
08-Jul-2019 18:45:10 Running post build plugin 'Artifactory Gradle Properties Info Copier'
08-Jul-2019 18:45:10 Running post build plugin 'Clover Results Collector'
08-Jul-2019 18:45:10 Running post build plugin 'npm Cache Cleanup'
08-Jul-2019 18:45:10 Running post build plugin 'Artifact Copier'
08-Jul-2019 18:45:10 Successfully removed working directory at '/opt/bamboo-home/xml-data/build-dir/SPR-PUB-JOB1'
08-Jul-2019 18:45:10 Finalising the build...
08-Jul-2019 18:45:10 Stopping timer.
08-Jul-2019 18:45:10 Build SPR-PUB-JOB1-7570 completed.
08-Jul-2019 18:45:10 Running on server: post build plugin 'NCover Results Collector'
08-Jul-2019 18:45:10 Running on server: post build plugin 'Build Hanging Detection Configuration'
08-Jul-2019 18:45:10 Running on server: post build plugin 'Clover Delta Calculator'
08-Jul-2019 18:45:10 Running on server: post build plugin 'Maven Dependencies Postprocessor'
08-Jul-2019 18:45:10 All post build plugins have finished
08-Jul-2019 18:45:10 Generating build results summary...
08-Jul-2019 18:45:21 Saving build results to disk...
08-Jul-2019 18:45:22 Logging substituted variables...
08-Jul-2019 18:45:23 Indexing build results...
08-Jul-2019 18:45:23 Finished building SPR-PUB-JOB1-7570.