Build #7,578

Build: #7578 failed

Job: Default Job failed

Stages & jobs

  1. Default Stage

Build log

The build generated 497 lines of output. Download or view full build log

10-Jul-2019 14:08:07 Build Spring Framework - Publication - Default Job #7578 (SPR-PUB-JOB1-7578) started building on agent bamboo-21.af.pivotal.io
10-Jul-2019 14:08:07 Remote agent on host bamboo-21.af.pivotal.io
10-Jul-2019 14:08:07 Build working directory is /opt/bamboo-home/xml-data/build-dir/SPR-PUB-JOB1
10-Jul-2019 14:08:07 Executing build Spring Framework - Publication - Default Job #7578 (SPR-PUB-JOB1-7578)
10-Jul-2019 14:08:07 Starting task 'Checkout Default Repository' of type 'com.atlassian.bamboo.plugins.vcs:task.vcs.checkout'
10-Jul-2019 14:08:07 Build always requires a clean checkout
10-Jul-2019 14:08:07 Cleaning build directory '/opt/bamboo-home/xml-data/build-dir/SPR-PUB-JOB1'
10-Jul-2019 14:08:07 Checking out into /opt/bamboo-home/xml-data/build-dir/SPR-PUB-JOB1
10-Jul-2019 14:08:07 Updating source code to revision: 09572e7b60e743d4b040f78924786bc09a65ed5f
10-Jul-2019 14:08:07 Creating local git repository in '/opt/bamboo-home/xml-data/build-dir/SPR-PUB-JOB1/.git'.
10-Jul-2019 14:08:07 Initialized empty Git repository in /opt/bamboo-home/xml-data/build-dir/SPR-PUB-JOB1/.git/
10-Jul-2019 14:08:09 Fetching 'refs/heads/master' from 'https://github.com/spring-projects/spring-framework.git'.
10-Jul-2019 14:08:28 From https://github.com/spring-projects/spring-framework
10-Jul-2019 14:08:28 * [new branch]      master     -> master
10-Jul-2019 14:08:28 * [new tag]               v3.1.0.RELEASE -> v3.1.0.RELEASE
10-Jul-2019 14:08:28 * [new tag]               v3.2.0.M1      -> v3.2.0.M1
10-Jul-2019 14:08:28 * [new tag]               v3.2.0.M2      -> v3.2.0.M2
10-Jul-2019 14:08:28 * [new tag]               v3.2.0.RC1     -> v3.2.0.RC1
10-Jul-2019 14:08:28 * [new tag]               v3.2.0.RC2-A   -> v3.2.0.RC2-A
10-Jul-2019 14:08:28 * [new tag]               v3.2.0.RELEASE -> v3.2.0.RELEASE
10-Jul-2019 14:08:28 * [new tag]               v3.2.1.RELEASE -> v3.2.1.RELEASE
10-Jul-2019 14:08:28 * [new tag]               v3.2.2.RELEASE -> v3.2.2.RELEASE
10-Jul-2019 14:08:28 * [new tag]               v4.0.0.M1      -> v4.0.0.M1
10-Jul-2019 14:08:28 * [new tag]               v4.0.0.M2      -> v4.0.0.M2
10-Jul-2019 14:08:28 * [new tag]               v4.0.0.M3      -> v4.0.0.M3
10-Jul-2019 14:08:28 * [new tag]               v4.0.0.RC1     -> v4.0.0.RC1
10-Jul-2019 14:08:28 * [new tag]               v4.0.0.RC2     -> v4.0.0.RC2
10-Jul-2019 14:08:28 Checking out revision 09572e7b60e743d4b040f78924786bc09a65ed5f.
10-Jul-2019 14:08:29 Already on 'master'
10-Jul-2019 14:08:29 Updated source code to revision: 09572e7b60e743d4b040f78924786bc09a65ed5f
10-Jul-2019 14:08:29 Finished task 'Checkout Default Repository' with result: Success
10-Jul-2019 14:08:29 Running pre-build action: Artifactory Release Staging
10-Jul-2019 14:08:29 Running pre-build action: VCS Version Collector
10-Jul-2019 14:08:29
Substituting variable: ${bamboo.spr.jdk.home} with /opt/jdk-8
10-Jul-2019 14:08:29
Substituting variable: ${bamboo.repository.branch.name} with master
10-Jul-2019 14:08:29 Starting task 'Artifactory Gradle' of type 'org.jfrog.bamboo.bamboo-artifactory-plugin:artifactoryGradleTask'
10-Jul-2019 14:08:29 Bamboo Artifactory Plugin version: 2.6.3
10-Jul-2019 14:08:29
Beginning to execute external process for build 'Spring Framework - Publication - Default Job #7578 (SPR-PUB-JOB1-7578)'
... running command line:
./gradlew --refresh-dependencies --no-daemon -PtestGroups=ci -P BRANCH_NAME=master --stacktrace clean check build -I /tmp/artifactory.init.script4891382225472074595gradle -DbuildInfoConfig.propertiesFile=/tmp/buildinfo5053846951560817950properties artifactoryPublish -Dartifactory.resolve.password=******** -Dartifactory.publish.password=********
... in: /opt/bamboo-home/xml-data/build-dir/SPR-PUB-JOB1
... using extra environment variables:
bamboo_planRepository_1_branch=master
bamboo_********_username_password=********
bamboo_signing_store_password=********
bamboo_planRepository_2_branch=master
bamboo_capability_system_builder_ant_Ant_1_9=/opt/ant-1.9
bamboo_repository_137199621_git_repositoryUrl=https://github.com/spring-projects/spring-framework.git
bamboo_capability_system_builder_ant_Ant_1_8=/opt/ant-1.8
bamboo_planRepository_1_branchDisplayName=master
bamboo_artifactory_override_resolve_repo=libs-milestone
bamboo_capability_system_builder_node_Node_js_10_16=/opt/node-10.16/bin/node
bamboo_repository_revision_number=09572e7b60e743d4b040f78924786bc09a65ed5f
bamboo_repository_262406229_git_repositoryUrl=https://github.com/spring-projects/spring-framework.git
bamboo_artifactory_task_override_jdk=true
bamboo_RIAK_BIN=/usr/sbin/riak
WRAPPER_BITS=32
bamboo_buildKey=SPR-PUB-JOB1
bamboo_repository_137199621_name=Plan Repository
bamboo_spr_jdk_home=/opt/jdk-8
bamboo_bintray_password=********
bamboo_sonar_token_password=********
PWD=/opt/bamboo-home/bin
bamboo_planRepository_2_branchDisplayName=master
bamboo_shortJobName=Default Job
bamboo_artifactory_override_resolver_password=********
bamboo_sonatype_token=RSJChaox
bamboo_capability_system_builder_gradle___gradlew=./gradlew
bamboo_buildResultsUrl=https://build.spring.io/browse/SPR-PUB-JOB1-7578
bamboo_capability_system_builder_mvn3_Maven_3_3=/opt/maven-3.3
bamboo_capability_system_builder_mvn3_Maven_3_2=/opt/maven-3.2
bamboo_capability_system_builder_mvn3_Maven_3_1=/opt/maven-3.1
bamboo_planRepository_repositoryUrl=https://github.com/spring-projects/spring-framework.git
bamboo_capability_system_builder_mvn3_Maven_3_6=/opt/maven-3.6
bamboo_agentId=286195722
bamboo_capability_system_builder_mvn3_Maven_3_5=/opt/maven-3.5
bamboo_capability_system_builder_mvn3_Maven_3_0=/opt/maven-3.0
bamboo_planRepository_revision=09572e7b60e743d4b040f78924786bc09a65ed5f
bamboo_planRepository_previousRevision=b8f77e53b58bc8e3b9b393d4e78434009ae1764d
bamboo_repository_137199621_revision_number=09572e7b60e743d4b040f78924786bc09a65ed5f
bamboo_capability_remote_build=true
bamboo_repository_branch_name=master
bamboo_sonatype_token_password=********
bamboo_sonatype_user=springsource
SHLVL=1
bamboo_org_jfrog_bamboo_buildInfo_serverUrl=https://repo.spring.io
bamboo_scdf_acceptance_tests_password=********
bamboo_repository_262406229_branch_name=master
WRAPPER_OS=linux
JAVA_HOME=/opt/jdk-8/
TERM=linux
XDG_SESSION_ID=c1
bamboo_planRepository_branch=master
bamboo_org_jfrog_bamboo_release_activated=false
bamboo_planRepository_1_type=gitv2
bamboo_planRepository_branchName=master
bamboo_repository_137199621_git_username=spring-buildmaster
bamboo_capability_system_jdk_JDK_12=/opt/jdk-12
WRAPPER_FILE_SEPARATOR=/
_=/opt/bamboo-home/bin/bamboo-agent.sh
bamboo_repository_262406229_revision_number=09572e7b60e743d4b040f78924786bc09a65ed5f
bamboo_capability_system_builder_ant_Ant_1_10=/opt/ant-1.10
WRAPPER_PATH_SEPARATOR=:
bamboo_sonar_password=********
bamboo_hg_cache_directory=/opt/bamboo-home/xml-data/build-dir/_hg-repositories-cache
bamboo_planRepository_1_username=spring-buildmaster
bamboo_planRepository_type=gitv2
bamboo_repository_262406229_git_branch=master
bamboo_git_cache_directory=/opt/bamboo-home/xml-data/build-dir/_git-repositories-cache
bamboo_planRepository_2_branchName=master
bamboo_artifactory_username=buildmaster
bamboo_tmp_directory=/opt/bamboo-home/temp
bamboo_planKey=SPR-PUB
bamboo_planRepository_username=spring-buildmaster
bamboo_JDK8_HOME=/opt/jdk-8
bamboo_snifftask=sniff
bamboo_planRepository_1_branchName=master
bamboo_sonar_version=5.6.3
bamboo_sonar_jdbc_password=********
bamboo_bintray_api_key_password=********
GRADLE_OPTS=-Xms128m
bamboo_repository_262406229_git_username=spring-buildmaster
XDG_DATA_DIRS=/usr/local/share:/usr/share:/var/lib/snapd/desktop
bamboo_capability_system_jdk_JDK_1_11=/opt/jdk-11
bamboo_resultsUrl=https://build.spring.io/browse/SPR-PUB-JOB1-7578
bamboo_capability_system_jdk_JDK_1_10=/opt/jdk-10
bamboo_build_working_directory=/opt/bamboo-home/xml-data/build-dir/SPR-PUB-JOB1
bamboo_planRepository_1_name=Spring Framework
bamboo_capability_system_os=ubuntu1804
bamboo_nexusPush_stagingProfile=buildmaster
bamboo_shortPlanName=Publication
MAIL=/var/mail/bamboo
bamboo_planRepository_2_username=spring-buildmaster
bamboo_repository_137199621_branch_name=master
bamboo_planRepository_name=Spring Framework
LOGNAME=bamboo
bamboo_buildNumber=7578
bamboo_repository_137199621_git_branch=master
SHELL=/bin/bash
bamboo_planName=Spring Framework - Publication
bamboo_JDK7_HOME=/opt/jdk-7
bamboo_repository_137199621_previous_revision_number=b8f77e53b58bc8e3b9b393d4e78434009ae1764d
bamboo_shortPlanKey=PUB
OLDPWD=/opt/users/bamboo
bamboo_shortJobKey=JOB1
bamboo_artifactory_password=********
bamboo_repository_262406229_name=Spring Framework
bamboo_planRepository_2_name=Plan Repository
bamboo_repository_262406229_previous_revision_number=b8f77e53b58bc8e3b9b393d4e78434009ae1764d
bamboo_buildTimeStamp=2019-07-10T14:08:06.261Z
bamboo_repository_previous_revision_number=b8f77e53b58bc8e3b9b393d4e78434009ae1764d
bamboo_sonar_username=buildmaster
bamboo_********_password=********
bamboo_repository_git_branch=master
bamboo_buildResultKey=SPR-PUB-JOB1-7578
bamboo_nexusPush_close=true
bamboo_artifactory_override_resolver_username=buildmaster
bamboo_buildPlanName=Spring Framework - Publication - Default Job
bamboo_planRepository_1_revision=09572e7b60e743d4b040f78924786bc09a65ed5f
bamboo_repository_name=Plan Repository
bamboo_signing_key_password=********
bamboo_planRepository_2_previousRevision=b8f77e53b58bc8e3b9b393d4e78434009ae1764d
bamboo_capability_system_builder_groovy_Groovy_2_5=/opt/groovy-2.5
LANG=en_US.UTF-8
bamboo_buildFailed=false
bamboo_capability_system_docker_executable=/usr/bin/docker
DISPLAY=localhost:1.0
bamboo_capability_system_jdk_OpenJDK_7=/opt/jdk-7
bamboo_capability_system_builder_groovy_Groovy_2_4=/opt/groovy-2.4
bamboo_artifactory_override_deployer_username=buildmaster
bamboo_artifactory_password_mask_b=********
bamboo_capability_system_builder_command_Bash=/bin/bash
bamboo_artifactory_password_mask_a=********
bamboo_agentWorkingDirectory=/opt/bamboo-home/xml-data/build-dir
bamboo_planRepository_2_revision=09572e7b60e743d4b040f78924786bc09a65ed5f
bamboo_capability_system_git_executable=/usr/bin/git
bamboo_repository_git_username=spring-buildmaster
bamboo_planRepository_1_previousRevision=b8f77e53b58bc8e3b9b393d4e78434009ae1764d
bamboo_capability_os_family=unix
bamboo_planRepository_branchDisplayName=master
bamboo_capability_system_builder_maven_Artifactory_Maven_3_6=/opt/maven-3.6
bamboo_capability_system_builder_maven_Artifactory_Maven_3_5=/opt/maven-3.5
GIT_SSL_NO_VERIFY=true
bamboo_capability_system_builder_maven_Artifactory_Maven_3_3=/opt/maven-3.3
bamboo_planRepository_2_type=gitv2
bamboo_capability_system_builder_maven_Artifactory_Maven_3_2=/opt/maven-3.2
bamboo_s3_properties=/home/bamboo/tools/s3.properties
bamboo_capability_system_builder_maven_Artifactory_Maven_3_1=/opt/maven-3.1
bamboo_artifactory_override_deploy_repo=libs-snapshot-local
bamboo_capability_system_builder_maven_Artifactory_Maven_3_0=/opt/maven-3.0
bamboo_plan_storageTag=SPR-PUB
bamboo_bintray_username_password=********
bamboo_planRepository_2_repositoryUrl=https://github.com/spring-projects/spring-framework.git
USER=bamboo
bamboo_repository_git_repositoryUrl=https://github.com/spring-projects/spring-framework.git
bamboo_working_directory=/opt/bamboo-home/xml-data/build-dir/SPR-PUB-JOB1
bamboo_org_jfrog_bamboo_buildInfo_activated=true
bamboo_planRepository_1_repositoryUrl=https://github.com/spring-projects/spring-framework.git
bamboo_capability_system_jdk_JDK_1_8=/opt/jdk-8
bamboo_artifactory_override_deployer_password=********
bamboo_capability_system_jdk_JDK_1_9=/opt/jdk-9
WRAPPER_ARCH=x86
bamboo_capability_system_jdk_JDK_1_6=/opt/jdk-6
bamboo_sonatype_password=********
bamboo_capability_system_jdk_JDK_1_7=/opt/jdk-7
bamboo_sonar_ip=10.194.6.9
XDG_RUNTIME_DIR=/run/user/1002
HOME=/home/bamboo
PATH=/bin:/home/bamboo/bin:/usr/local/sbin:/usr/local/bin:/usr/sbin:/usr/bin:/sbin:/bin:/usr/games:/usr/local/games:/snap/bin:/home/bamboo/bin:/usr/local/bin:/bin:/home/bamboo/bin:/usr/local/sbin:/usr/local/bin:/usr/sbin:/usr/bin:/sbin:/bin:/usr/games:/usr/local/games:/snap/bin:/home/bamboo/bin:/usr/local/bin
10-Jul-2019 14:08:32 > Task :buildSrc:compileJava NO-SOURCE
10-Jul-2019 14:08:33 > Task :buildSrc:compileGroovy
10-Jul-2019 14:08:33 > Task :buildSrc:processResources
10-Jul-2019 14:08:33 > Task :buildSrc:classes
10-Jul-2019 14:08:33 > Task :buildSrc:jar
10-Jul-2019 14:08:33 > Task :buildSrc:assemble
10-Jul-2019 14:08:33 > Task :buildSrc:compileTestJava NO-SOURCE
10-Jul-2019 14:08:33 > Task :buildSrc:compileTestGroovy NO-SOURCE
10-Jul-2019 14:08:33 > Task :buildSrc:processTestResources NO-SOURCE
10-Jul-2019 14:08:33 > Task :buildSrc:testClasses UP-TO-DATE
10-Jul-2019 14:08:33 > Task :buildSrc:test NO-SOURCE
10-Jul-2019 14:08:33 > Task :buildSrc:check UP-TO-DATE
10-Jul-2019 14:08:33 > Task :buildSrc:build
10-Jul-2019 14:08:43 Cannot publish pom for project ':spring-build-src' since it does not contain the Maven plugin install task and task ':spring-build-src:artifactoryPublish' does not specify a custom pom path.
10-Jul-2019 14:08:43 Cannot publish pom for project ':' since it does not contain the Maven plugin install task and task ':artifactoryPublish' does not specify a custom pom path.
10-Jul-2019 14:08:43 Cannot publish pom for project ':spring-core-coroutines' since it does not contain the Maven plugin install task and task ':spring-core-coroutines:artifactoryPublish' does not specify a custom pom path.
10-Jul-2019 14:08:45 > Task :clean UP-TO-DATE
10-Jul-2019 14:08:45 > Task :spring-aop:clean UP-TO-DATE
10-Jul-2019 14:08:45 > Task :spring-aspects:clean UP-TO-DATE
10-Jul-2019 14:08:46 > Task :spring-beans:clean UP-TO-DATE
10-Jul-2019 14:08:46 > Task :spring-build-src:clean
10-Jul-2019 14:08:46 > Task :spring-context:clean UP-TO-DATE
10-Jul-2019 14:08:46 > Task :spring-context-indexer:clean UP-TO-DATE
10-Jul-2019 14:08:46 > Task :spring-context-support:clean UP-TO-DATE
10-Jul-2019 14:08:46 > Task :spring-core:clean UP-TO-DATE
10-Jul-2019 14:08:46 > Task :spring-core-coroutines:clean UP-TO-DATE
10-Jul-2019 14:08:46 > Task :spring-expression:clean UP-TO-DATE
10-Jul-2019 14:08:46 > Task :spring-framework-bom:clean UP-TO-DATE
10-Jul-2019 14:08:46 > Task :spring-instrument:clean UP-TO-DATE
10-Jul-2019 14:08:46 > Task :spring-jcl:clean UP-TO-DATE
10-Jul-2019 14:08:46 > Task :spring-jdbc:clean UP-TO-DATE
10-Jul-2019 14:08:46 > Task :spring-jms:clean UP-TO-DATE
10-Jul-2019 14:08:46 > Task :spring-messaging:clean UP-TO-DATE
10-Jul-2019 14:08:46 > Task :spring-orm:clean UP-TO-DATE
10-Jul-2019 14:08:46 > Task :spring-oxm:clean UP-TO-DATE
10-Jul-2019 14:08:46 > Task :spring-test:clean UP-TO-DATE
10-Jul-2019 14:08:46 > Task :spring-tx:clean UP-TO-DATE
10-Jul-2019 14:08:46 > Task :spring-web:clean UP-TO-DATE
10-Jul-2019 14:08:46 > Task :spring-webflux:clean UP-TO-DATE
10-Jul-2019 14:08:46 > Task :spring-webmvc:clean UP-TO-DATE
10-Jul-2019 14:08:46 > Task :spring-websocket:clean UP-TO-DATE
10-Jul-2019 14:08:46 > Task :compileKotlin NO-SOURCE
10-Jul-2019 14:08:46 > Task :compileJava NO-SOURCE
10-Jul-2019 14:08:46 > Task :compileGroovy NO-SOURCE
10-Jul-2019 14:08:46 > Task :processResources NO-SOURCE
10-Jul-2019 14:08:46 > Task :classes UP-TO-DATE
10-Jul-2019 14:08:46 > Task :checkstyleMain NO-SOURCE
10-Jul-2019 14:08:46 > Task :spring-core:cglibRepackJar
10-Jul-2019 14:08:46 > Task :spring-core:objenesisRepackJar
10-Jul-2019 14:08:51 > Task :spring-core-coroutines:compileKotlin
10-Jul-2019 14:08:51 > Task :spring-core-coroutines:compileJava NO-SOURCE
10-Jul-2019 14:08:51 > Task :spring-core-coroutines:processResources NO-SOURCE
10-Jul-2019 14:08:51 > Task :spring-core-coroutines:classes UP-TO-DATE
10-Jul-2019 14:08:51 > Task :spring-core-coroutines:inspectClassesForKotlinIC
10-Jul-2019 14:08:51 > Task :spring-core-coroutines:jar
10-Jul-2019 14:08:51 > Task :spring-jcl:compileKotlin
10-Jul-2019 14:08:52 > Task :spring-jcl:compileJava
10-Jul-2019 14:08:52 > Task :spring-jcl:processResources
10-Jul-2019 14:08:52 > Task :spring-jcl:classes
10-Jul-2019 14:08:52 > Task :spring-jcl:inspectClassesForKotlinIC
10-Jul-2019 14:08:52 > Task :spring-jcl:jar
10-Jul-2019 14:08:53 > Task :spring-core:compileKotlin
10-Jul-2019 14:08:56 > Task :spring-core:compileJava
10-Jul-2019 14:08:56 > Task :spring-core:processResources NO-SOURCE
10-Jul-2019 14:08:56 > Task :spring-core:classes
10-Jul-2019 14:08:56 > Task :spring-core:inspectClassesForKotlinIC
10-Jul-2019 14:08:56 > Task :spring-core:jar
10-Jul-2019 14:09:00 > Task :spring-beans:compileGroovy
10-Jul-2019 14:09:00 > Task :spring-beans:compileKotlin
10-Jul-2019 14:09:00 > Task :spring-beans:compileJava NO-SOURCE
10-Jul-2019 14:09:00 > Task :spring-beans:processResources
10-Jul-2019 14:09:00 > Task :spring-beans:classes
10-Jul-2019 14:09:00 > Task :spring-beans:inspectClassesForKotlinIC
10-Jul-2019 14:09:00 > Task :spring-beans:jar
10-Jul-2019 14:09:00 > Task :spring-aop:compileKotlin
10-Jul-2019 14:09:01 > Task :spring-aop:compileJava
10-Jul-2019 14:09:01 > Task :spring-aop:processResources
10-Jul-2019 14:09:01 > Task :spring-aop:classes
10-Jul-2019 14:09:01 > Task :spring-core-coroutines:compileTestKotlin NO-SOURCE
10-Jul-2019 14:09:01 > Task :spring-core-coroutines:compileTestJava NO-SOURCE
10-Jul-2019 14:09:01 > Task :spring-core-coroutines:processTestResources NO-SOURCE
10-Jul-2019 14:09:01 > Task :spring-core-coroutines:testClasses UP-TO-DATE
10-Jul-2019 14:09:01 > Task :spring-jcl:compileTestKotlin NO-SOURCE
10-Jul-2019 14:09:01 > Task :spring-jcl:compileTestJava NO-SOURCE
10-Jul-2019 14:09:01 > Task :spring-jcl:processTestResources NO-SOURCE
10-Jul-2019 14:09:01 > Task :spring-jcl:testClasses UP-TO-DATE
10-Jul-2019 14:09:04 > Task :spring-core:compileTestKotlin
10-Jul-2019 14:09:10 > Task :spring-core:compileTestJava
10-Jul-2019 14:09:10 > Task :spring-core:processTestResources
10-Jul-2019 14:09:10 > Task :spring-core:testClasses
10-Jul-2019 14:09:12 > Task :spring-beans:compileTestKotlin
10-Jul-2019 14:09:14
10-Jul-2019 14:09:14 > Task :spring-beans:compileTestJava
10-Jul-2019 14:09:14 Note: Some input files use unchecked or unsafe operations.
10-Jul-2019 14:09:14 Note: Recompile with -Xlint:unchecked for details.
10-Jul-2019 14:09:15
10-Jul-2019 14:09:15 > Task :spring-beans:compileTestGroovy NO-SOURCE
10-Jul-2019 14:09:15 > Task :spring-beans:processTestResources
10-Jul-2019 14:09:15 > Task :spring-beans:testClasses
10-Jul-2019 14:09:15 > Task :spring-aop:compileTestKotlin
10-Jul-2019 14:09:15 > Task :spring-aop:inspectClassesForKotlinIC
10-Jul-2019 14:09:15 > Task :spring-aop:jar
10-Jul-2019 14:09:16 > Task :spring-aop:compileTestJava
10-Jul-2019 14:09:16 > Task :spring-aop:processTestResources
10-Jul-2019 14:09:16 > Task :spring-aop:testClasses
10-Jul-2019 14:09:16 > Task :spring-expression:compileKotlin
10-Jul-2019 14:09:16 > Task :spring-expression:compileJava
10-Jul-2019 14:09:16 > Task :spring-expression:processResources
10-Jul-2019 14:09:16 > Task :spring-expression:classes
10-Jul-2019 14:09:16 > Task :spring-expression:inspectClassesForKotlinIC
10-Jul-2019 14:09:16 > Task :spring-expression:jar
10-Jul-2019 14:09:16 > Task :spring-instrument:compileKotlin
10-Jul-2019 14:09:16 > Task :spring-instrument:compileJava
10-Jul-2019 14:09:16 > Task :spring-instrument:processResources NO-SOURCE
10-Jul-2019 14:09:16 > Task :spring-instrument:classes
10-Jul-2019 14:09:16 > Task :spring-instrument:inspectClassesForKotlinIC
10-Jul-2019 14:09:16 > Task :spring-instrument:jar
10-Jul-2019 14:09:21 > Task :spring-context:compileKotlin
10-Jul-2019 14:09:22 > Task :spring-context:compileJava
10-Jul-2019 14:09:22 > Task :spring-context:compileGroovy NO-SOURCE
10-Jul-2019 14:09:22 > Task :spring-context:processResources
10-Jul-2019 14:09:22 > Task :spring-context:classes
10-Jul-2019 14:09:22 > Task :spring-expression:compileTestKotlin
10-Jul-2019 14:09:25 > Task :spring-expression:compileTestJava
10-Jul-2019 14:09:25 > Task :spring-expression:processTestResources
10-Jul-2019 14:09:25 > Task :spring-expression:testClasses
10-Jul-2019 14:09:25 > Task :spring-instrument:compileTestKotlin NO-SOURCE
10-Jul-2019 14:09:25 > Task :spring-instrument:compileTestJava NO-SOURCE
10-Jul-2019 14:09:25 > Task :spring-instrument:processTestResources
10-Jul-2019 14:09:25 > Task :spring-instrument:testClasses
10-Jul-2019 14:09:27 > Task :spring-context:compileTestKotlin
10-Jul-2019 14:09:27 > Task :spring-context:inspectClassesForKotlinIC
10-Jul-2019 14:09:27 > Task :spring-context:jar
10-Jul-2019 14:09:31
10-Jul-2019 14:09:31 > Task :spring-context:compileTestJava
10-Jul-2019 14:09:31 Note: Some input files use or override a deprecated API.
10-Jul-2019 14:09:31 Note: Recompile with -Xlint:deprecation for details.
10-Jul-2019 14:09:31 Note: Some input files use unchecked or unsafe operations.
10-Jul-2019 14:09:31 Note: Recompile with -Xlint:unchecked for details.
10-Jul-2019 14:09:32
10-Jul-2019 14:09:32 > Task :spring-context:compileTestGroovy
10-Jul-2019 14:09:32 > Task :spring-context:processTestResources
10-Jul-2019 14:09:32 > Task :spring-context:testClasses
10-Jul-2019 14:09:33 > Task :spring-tx:compileKotlin
10-Jul-2019 14:09:33 > Task :spring-tx:compileJava
10-Jul-2019 14:09:33 > Task :spring-tx:processResources
10-Jul-2019 14:09:33 > Task :spring-tx:classes
10-Jul-2019 14:09:33 > Task :spring-tx:inspectClassesForKotlinIC
10-Jul-2019 14:09:33 > Task :spring-tx:jar
10-Jul-2019 14:09:34 > Task :spring-jdbc:compileKotlin
10-Jul-2019 14:09:35 > Task :spring-jdbc:compileJava
10-Jul-2019 14:09:35 > Task :spring-jdbc:processResources
10-Jul-2019 14:09:35 > Task :spring-jdbc:classes
10-Jul-2019 14:09:35 > Task :spring-tx:compileTestKotlin
10-Jul-2019 14:09:52 > Task :spring-tx:compileTestJava
10-Jul-2019 14:09:52 > Task :spring-tx:processTestResources
10-Jul-2019 14:09:52 > Task :spring-tx:testClasses
10-Jul-2019 14:09:53 > Task :spring-jdbc:compileTestKotlin
10-Jul-2019 14:09:53 > Task :spring-jdbc:inspectClassesForKotlinIC
10-Jul-2019 14:09:53 > Task :spring-jdbc:jar
10-Jul-2019 14:09:54 > Task :spring-jdbc:compileTestJava
10-Jul-2019 14:09:54 > Task :spring-jdbc:processTestResources
10-Jul-2019 14:09:54 > Task :spring-jdbc:testClasses
10-Jul-2019 14:09:56 > Task :spring-oxm:compileKotlin
10-Jul-2019 14:09:56 > Task :spring-oxm:compileJava
10-Jul-2019 14:09:56 > Task :spring-oxm:processResources
10-Jul-2019 14:09:56 > Task :spring-oxm:classes
10-Jul-2019 14:09:56 > Task :spring-oxm:inspectClassesForKotlinIC
10-Jul-2019 14:09:56 > Task :spring-oxm:jar
10-Jul-2019 14:09:59 > Task :spring-web:compileKotlin
10-Jul-2019 14:10:00 > Task :spring-web:compileJava
10-Jul-2019 14:10:00 > Task :spring-web:processResources
10-Jul-2019 14:10:00 > Task :spring-web:classes
10-Jul-2019 14:10:00 > Task :spring-web:inspectClassesForKotlinIC
10-Jul-2019 14:10:01 > Task :spring-web:jar
10-Jul-2019 14:10:01 > Task :spring-orm:compileKotlin
10-Jul-2019 14:10:02 > Task :spring-orm:compileJava
10-Jul-2019 14:10:02 > Task :spring-orm:processResources NO-SOURCE
10-Jul-2019 14:10:02 > Task :spring-orm:classes
10-Jul-2019 14:10:02
10-Jul-2019 14:10:02 > Task :spring-oxm:genJaxb
10-Jul-2019 14:10:02 [ant:javac] : warning: 'includeantruntime' was not set, defaulting to build.sysclasspath=last; set to false for repeatable builds
10-Jul-2019 14:10:02
10-Jul-2019 14:10:02 > Task :spring-oxm:compileTestKotlin
10-Jul-2019 14:10:03 > Task :spring-oxm:compileTestJava
10-Jul-2019 14:10:03 > Task :spring-oxm:processTestResources
10-Jul-2019 14:10:03 > Task :spring-oxm:testClasses
10-Jul-2019 14:10:05 > Task :spring-web:compileTestKotlin
10-Jul-2019 14:10:09 > Task :spring-web:compileTestJava
10-Jul-2019 14:10:09 > Task :spring-web:processTestResources
10-Jul-2019 14:10:09 > Task :spring-web:testClasses
10-Jul-2019 14:10:09 > Task :spring-orm:compileTestKotlin
10-Jul-2019 14:10:09 > Task :spring-orm:inspectClassesForKotlinIC
10-Jul-2019 14:10:09 > Task :spring-orm:jar
10-Jul-2019 14:10:10 > Task :spring-orm:compileTestJava
10-Jul-2019 14:10:10 > Task :spring-orm:processTestResources
10-Jul-2019 14:10:10 > Task :spring-orm:testClasses
10-Jul-2019 14:10:10 > Task :spring-context-support:compileKotlin
10-Jul-2019 14:10:10 > Task :spring-context-support:compileJava
10-Jul-2019 14:10:10 > Task :spring-context-support:processResources
10-Jul-2019 14:10:10 > Task :spring-context-support:classes
10-Jul-2019 14:10:11 > Task :spring-context-support:compileTestKotlin
10-Jul-2019 14:10:11 > Task :spring-context-support:inspectClassesForKotlinIC
10-Jul-2019 14:10:11 > Task :spring-context-support:jar
10-Jul-2019 14:10:11 > Task :spring-context-support:compileTestJava
10-Jul-2019 14:10:11 > Task :spring-context-support:processTestResources
10-Jul-2019 14:10:11 > Task :spring-context-support:testClasses
10-Jul-2019 14:10:13
10-Jul-2019 14:10:13 > Task :spring-webflux:compileKotlin
10-Jul-2019 14:10:13 w: /opt/bamboo-home/xml-data/build-dir/SPR-PUB-JOB1/spring-webflux/src/main/kotlin/org/springframework/web/reactive/function/client/WebClientExtensions.kt: (122, 64): Parameter 'batchSize' is never used
10-Jul-2019 14:10:14
10-Jul-2019 14:10:14 > Task :spring-webflux:compileJava
10-Jul-2019 14:10:14 > Task :spring-webflux:processResources
10-Jul-2019 14:10:14 > Task :spring-webflux:classes
10-Jul-2019 14:10:14 > Task :spring-webflux:inspectClassesForKotlinIC
10-Jul-2019 14:10:14 > Task :spring-webflux:jar
10-Jul-2019 14:10:16 > Task :spring-webmvc:compileKotlin
10-Jul-2019 14:10:16 > Task :spring-webmvc:compileJava
10-Jul-2019 14:10:16 > Task :spring-webmvc:processResources
10-Jul-2019 14:10:16 > Task :spring-webmvc:classes
10-Jul-2019 14:10:17 > Task :spring-webmvc:inspectClassesForKotlinIC
10-Jul-2019 14:10:17 > Task :spring-webmvc:jar
10-Jul-2019 14:10:17 > Task :spring-messaging:compileKotlin
10-Jul-2019 14:10:18 > Task :spring-messaging:compileJava
10-Jul-2019 14:10:18 > Task :spring-messaging:processResources NO-SOURCE
10-Jul-2019 14:10:18 > Task :spring-messaging:classes
10-Jul-2019 14:10:18 > Task :spring-messaging:inspectClassesForKotlinIC
10-Jul-2019 14:10:18 > Task :spring-messaging:jar
10-Jul-2019 14:10:18 > Task :spring-websocket:compileKotlin
10-Jul-2019 14:10:19 > Task :spring-websocket:compileJava
10-Jul-2019 14:10:19 > Task :spring-websocket:processResources
10-Jul-2019 14:10:19 > Task :spring-websocket:classes
10-Jul-2019 14:10:19 > Task :spring-websocket:inspectClassesForKotlinIC
10-Jul-2019 14:10:19 > Task :spring-websocket:jar
10-Jul-2019 14:10:21 > Task :spring-test:compileKotlin
10-Jul-2019 14:10:22 > Task :spring-test:compileJava
10-Jul-2019 14:10:22 > Task :spring-test:processResources
10-Jul-2019 14:10:22 > Task :spring-test:classes
10-Jul-2019 14:10:25 > Task :spring-webflux:compileTestKotlin
10-Jul-2019 14:10:27 > Task :spring-webflux:compileTestJava
10-Jul-2019 14:10:27 > Task :spring-webflux:processTestResources
10-Jul-2019 14:10:27 > Task :spring-webflux:testClasses
10-Jul-2019 14:10:28 > Task :spring-webmvc:compileTestKotlin
10-Jul-2019 14:10:31 > Task :spring-webmvc:compileTestJava
10-Jul-2019 14:10:31 > Task :spring-webmvc:processTestResources
10-Jul-2019 14:10:31 > Task :spring-webmvc:testClasses
10-Jul-2019 14:10:33 > Task :spring-messaging:compileTestKotlin
10-Jul-2019 14:10:34 > Task :spring-messaging:compileTestJava
10-Jul-2019 14:10:34 > Task :spring-messaging:processTestResources
10-Jul-2019 14:10:34 > Task :spring-messaging:testClasses
10-Jul-2019 14:10:34 > Task :spring-websocket:compileTestKotlin
10-Jul-2019 14:10:36 > Task :spring-websocket:compileTestJava
10-Jul-2019 14:10:36 > Task :spring-websocket:processTestResources
10-Jul-2019 14:10:36 > Task :spring-websocket:testClasses
10-Jul-2019 14:10:37 > Task :spring-test:compileTestKotlin
10-Jul-2019 14:10:37 > Task :spring-test:inspectClassesForKotlinIC
10-Jul-2019 14:10:37 > Task :spring-test:jar
10-Jul-2019 14:10:40 > Task :spring-test:compileTestJava
10-Jul-2019 14:10:40 > Task :spring-test:processTestResources
10-Jul-2019 14:10:40 > Task :spring-test:testClasses
10-Jul-2019 14:10:40 > Task :compileTestKotlin
10-Jul-2019 14:10:41 > Task :compileTestJava
10-Jul-2019 14:10:41 > Task :compileTestGroovy NO-SOURCE
10-Jul-2019 14:10:41 > Task :processTestResources
10-Jul-2019 14:10:41 > Task :testClasses
10-Jul-2019 14:10:42 > Task :checkstyleTest
10-Jul-2019 14:10:46 > Task :test
10-Jul-2019 14:10:46 > Task :check
10-Jul-2019 14:10:49 > Task :spring-aop:checkstyleMain
10-Jul-2019 14:10:50 > Task :spring-aop:checkstyleTest
10-Jul-2019 14:10:53 > Task :spring-aop:test
10-Jul-2019 14:10:53 > Task :spring-aop:check
10-Jul-2019 14:10:53 > Task :spring-aspects:compileKotlin
10-Jul-2019 14:10:54 > Task :spring-aspects:compileJava
10-Jul-2019 14:10:54 > Task :spring-aspects:processResources
10-Jul-2019 14:10:54 > Task :spring-aspects:classes
10-Jul-2019 14:10:55 > Task :spring-aspects:checkstyleMain
10-Jul-2019 14:10:55 > Task :spring-aspects:compileTestKotlin
10-Jul-2019 14:10:55 > Task :spring-aspects:inspectClassesForKotlinIC
10-Jul-2019 14:10:55 > Task :spring-aspects:jar
10-Jul-2019 14:10:56 > Task :spring-aspects:compileTestJava
10-Jul-2019 14:10:56 > Task :spring-aspects:processTestResources
10-Jul-2019 14:10:56 > Task :spring-aspects:testClasses
10-Jul-2019 14:10:57 > Task :spring-aspects:checkstyleTest
10-Jul-2019 14:11:01 > Task :spring-aspects:test
10-Jul-2019 14:11:01 > Task :spring-aspects:check
10-Jul-2019 14:11:04 > Task :spring-beans:checkstyleMain
10-Jul-2019 14:11:06 > Task :spring-beans:checkstyleTest
10-Jul-2019 14:11:14 > Task :spring-beans:test
10-Jul-2019 14:11:14 > Task :spring-beans:check
10-Jul-2019 14:11:14 > Task :spring-build-src:compileKotlin NO-SOURCE
10-Jul-2019 14:11:14 > Task :spring-build-src:compileJava NO-SOURCE
10-Jul-2019 14:11:14 > Task :spring-build-src:compileGroovy
10-Jul-2019 14:11:14 > Task :spring-build-src:processResources
10-Jul-2019 14:11:14 > Task :spring-build-src:classes
10-Jul-2019 14:11:14 > Task :spring-build-src:checkstyleMain NO-SOURCE
10-Jul-2019 14:11:14 > Task :spring-build-src:compileTestKotlin NO-SOURCE
10-Jul-2019 14:11:14 > Task :spring-build-src:compileTestJava NO-SOURCE
10-Jul-2019 14:11:14 > Task :spring-build-src:compileTestGroovy NO-SOURCE
10-Jul-2019 14:11:14 > Task :spring-build-src:processTestResources NO-SOURCE
10-Jul-2019 14:11:14 > Task :spring-build-src:testClasses UP-TO-DATE
10-Jul-2019 14:11:14 > Task :spring-build-src:checkstyleTest NO-SOURCE
10-Jul-2019 14:11:14 > Task :spring-build-src:test NO-SOURCE
10-Jul-2019 14:11:14 > Task :spring-build-src:check UP-TO-DATE
10-Jul-2019 14:11:18 > Task :spring-context:checkstyleMain
10-Jul-2019 14:11:21 > Task :spring-context:checkstyleTest
10-Jul-2019 14:11:41
10-Jul-2019 14:11:41 > Task :spring-context:test
10-Jul-2019 14:11:41
10-Jul-2019 14:11:41 org.springframework.jmx.support.ConnectorServerFactoryBeanTests > startupWithLocatedServer FAILED
10-Jul-2019 14:11:41     java.net.BindException at ConnectorServerFactoryBeanTests.java:50
10-Jul-2019 14:11:53
10-Jul-2019 14:11:53 3243 tests completed, 1 failed, 38 skipped
10-Jul-2019 14:11:53
10-Jul-2019 14:11:53 > Task :spring-context:test FAILED
10-Jul-2019 14:11:53
10-Jul-2019 14:11:53 FAILURE: Build failed with an exception.
10-Jul-2019 14:11:53
10-Jul-2019 14:11:53 * What went wrong:
10-Jul-2019 14:11:53 Execution failed for task ':spring-context:test'.
10-Jul-2019 14:11:53 > There were failing tests. See the report at: file:///opt/bamboo-home/xml-data/build-dir/SPR-PUB-JOB1/spring-context/build/reports/tests/test/index.html
10-Jul-2019 14:11:53
10-Jul-2019 14:11:53 * Try:
10-Jul-2019 14:11:53 Run with --info or --debug option to get more log output. Run with --scan to get full insights.
10-Jul-2019 14:11:53
10-Jul-2019 14:11:53 * Exception is:
10-Jul-2019 14:11:53 org.gradle.api.tasks.TaskExecutionException: Execution failed for task ':spring-context:test'.
10-Jul-2019 14:11:53         at org.gradle.api.internal.tasks.execution.ExecuteActionsTaskExecuter$3.accept(ExecuteActionsTaskExecuter.java:148)
10-Jul-2019 14:11:53         at org.gradle.api.internal.tasks.execution.ExecuteActionsTaskExecuter$3.accept(ExecuteActionsTaskExecuter.java:145)
10-Jul-2019 14:11:53         at org.gradle.internal.Try$Failure.ifSuccessfulOrElse(Try.java:191)
10-Jul-2019 14:11:53         at org.gradle.api.internal.tasks.execution.ExecuteActionsTaskExecuter.execute(ExecuteActionsTaskExecuter.java:138)
10-Jul-2019 14:11:53         at org.gradle.api.internal.tasks.execution.ResolveBeforeExecutionStateTaskExecuter.execute(ResolveBeforeExecutionStateTaskExecuter.java:75)
10-Jul-2019 14:11:53         at org.gradle.api.internal.tasks.execution.ValidatingTaskExecuter.execute(ValidatingTaskExecuter.java:62)
10-Jul-2019 14:11:53         at org.gradle.api.internal.tasks.execution.SkipEmptySourceFilesTaskExecuter.execute(SkipEmptySourceFilesTaskExecuter.java:108)
10-Jul-2019 14:11:53         at org.gradle.api.internal.tasks.execution.ResolveBeforeExecutionOutputsTaskExecuter.execute(ResolveBeforeExecutionOutputsTaskExecuter.java:67)
10-Jul-2019 14:11:53         at org.gradle.api.internal.tasks.execution.ResolveAfterPreviousExecutionStateTaskExecuter.execute(ResolveAfterPreviousExecutionStateTaskExecuter.java:46)
10-Jul-2019 14:11:53         at org.gradle.api.internal.tasks.execution.CleanupStaleOutputsExecuter.execute(CleanupStaleOutputsExecuter.java:94)
10-Jul-2019 14:11:53         at org.gradle.api.internal.tasks.execution.FinalizePropertiesTaskExecuter.execute(FinalizePropertiesTaskExecuter.java:46)
10-Jul-2019 14:11:53         at org.gradle.api.internal.tasks.execution.ResolveTaskExecutionModeExecuter.execute(ResolveTaskExecutionModeExecuter.java:95)
10-Jul-2019 14:11:53         at org.gradle.api.internal.tasks.execution.SkipTaskWithNoActionsExecuter.execute(SkipTaskWithNoActionsExecuter.java:57)
10-Jul-2019 14:11:53         at org.gradle.api.internal.tasks.execution.SkipOnlyIfTaskExecuter.execute(SkipOnlyIfTaskExecuter.java:56)
10-Jul-2019 14:11:53         at org.gradle.api.internal.tasks.execution.CatchExceptionTaskExecuter.execute(CatchExceptionTaskExecuter.java:36)
10-Jul-2019 14:11:53         at org.gradle.api.internal.tasks.execution.EventFiringTaskExecuter$1.executeTask(EventFiringTaskExecuter.java:73)
10-Jul-2019 14:11:53         at org.gradle.api.internal.tasks.execution.EventFiringTaskExecuter$1.call(EventFiringTaskExecuter.java:52)
10-Jul-2019 14:11:53         at org.gradle.api.internal.tasks.execution.EventFiringTaskExecuter$1.call(EventFiringTaskExecuter.java:49)
10-Jul-2019 14:11:53         at org.gradle.internal.operations.DefaultBuildOperationExecutor$CallableBuildOperationWorker.execute(DefaultBuildOperationExecutor.java:416)
10-Jul-2019 14:11:53         at org.gradle.internal.operations.DefaultBuildOperationExecutor$CallableBuildOperationWorker.execute(DefaultBuildOperationExecutor.java:406)
10-Jul-2019 14:11:53         at org.gradle.internal.operations.DefaultBuildOperationExecutor$1.execute(DefaultBuildOperationExecutor.java:165)
10-Jul-2019 14:11:53         at org.gradle.internal.operations.DefaultBuildOperationExecutor.execute(DefaultBuildOperationExecutor.java:250)
10-Jul-2019 14:11:53         at org.gradle.internal.operations.DefaultBuildOperationExecutor.execute(DefaultBuildOperationExecutor.java:158)
10-Jul-2019 14:11:53         at org.gradle.internal.operations.DefaultBuildOperationExecutor.call(DefaultBuildOperationExecutor.java:102)
10-Jul-2019 14:11:53         at org.gradle.internal.operations.DelegatingBuildOperationExecutor.call(DelegatingBuildOperationExecutor.java:36)
10-Jul-2019 14:11:53         at org.gradle.api.internal.tasks.execution.EventFiringTaskExecuter.execute(EventFiringTaskExecuter.java:49)
10-Jul-2019 14:11:53         at org.gradle.execution.plan.LocalTaskNodeExecutor.execute(LocalTaskNodeExecutor.java:43)
10-Jul-2019 14:11:53         at org.gradle.execution.taskgraph.DefaultTaskExecutionGraph$InvokeNodeExecutorsAction.execute(DefaultTaskExecutionGraph.java:355)
10-Jul-2019 14:11:53         at org.gradle.execution.taskgraph.DefaultTaskExecutionGraph$InvokeNodeExecutorsAction.execute(DefaultTaskExecutionGraph.java:343)
10-Jul-2019 14:11:53         at org.gradle.execution.taskgraph.DefaultTaskExecutionGraph$BuildOperationAwareExecutionAction.execute(DefaultTaskExecutionGraph.java:336)
10-Jul-2019 14:11:53         at org.gradle.execution.taskgraph.DefaultTaskExecutionGraph$BuildOperationAwareExecutionAction.execute(DefaultTaskExecutionGraph.java:322)
10-Jul-2019 14:11:53         at org.gradle.execution.plan.DefaultPlanExecutor$ExecutorWorker$1.execute(DefaultPlanExecutor.java:134)
10-Jul-2019 14:11:53         at org.gradle.execution.plan.DefaultPlanExecutor$ExecutorWorker$1.execute(DefaultPlanExecutor.java:129)
10-Jul-2019 14:11:53         at org.gradle.execution.plan.DefaultPlanExecutor$ExecutorWorker.execute(DefaultPlanExecutor.java:202)
10-Jul-2019 14:11:53         at org.gradle.execution.plan.DefaultPlanExecutor$ExecutorWorker.executeNextNode(DefaultPlanExecutor.java:193)
10-Jul-2019 14:11:53         at org.gradle.execution.plan.DefaultPlanExecutor$ExecutorWorker.run(DefaultPlanExecutor.java:129)
10-Jul-2019 14:11:53         at org.gradle.internal.concurrent.ExecutorPolicy$CatchAndRecordFailures.onExecute(ExecutorPolicy.java:63)
10-Jul-2019 14:11:53         at org.gradle.internal.concurrent.ManagedExecutorImpl$1.run(ManagedExecutorImpl.java:46)
10-Jul-2019 14:11:53         at org.gradle.internal.concurrent.ThreadFactoryImpl$ManagedThreadRunnable.run(ThreadFactoryImpl.java:55)
10-Jul-2019 14:11:53 Caused by: org.gradle.api.GradleException: There were failing tests. See the report at: file:///opt/bamboo-home/xml-data/build-dir/SPR-PUB-JOB1/spring-context/build/reports/tests/test/index.html
10-Jul-2019 14:11:53         at org.gradle.api.tasks.testing.AbstractTestTask.handleTestFailures(AbstractTestTask.java:626)
10-Jul-2019 14:11:53         at org.gradle.api.tasks.testing.AbstractTestTask.executeTests(AbstractTestTask.java:498)
10-Jul-2019 14:11:53         at org.gradle.api.tasks.testing.Test.executeTests(Test.java:594)
10-Jul-2019 14:11:53         at org.gradle.internal.reflect.JavaMethod.invoke(JavaMethod.java:103)
10-Jul-2019 14:11:53         at org.gradle.api.internal.project.taskfactory.StandardTaskAction.doExecute(StandardTaskAction.java:48)
10-Jul-2019 14:11:53         at org.gradle.api.internal.project.taskfactory.StandardTaskAction.execute(StandardTaskAction.java:41)
10-Jul-2019 14:11:53         at org.gradle.api.internal.project.taskfactory.StandardTaskAction.execute(StandardTaskAction.java:28)
10-Jul-2019 14:11:53         at org.gradle.api.internal.AbstractTask$TaskActionWrapper.execute(AbstractTask.java:702)
10-Jul-2019 14:11:53         at org.gradle.api.internal.AbstractTask$TaskActionWrapper.execute(AbstractTask.java:669)
10-Jul-2019 14:11:53         at org.gradle.api.internal.tasks.execution.ExecuteActionsTaskExecuter$5.run(ExecuteActionsTaskExecuter.java:401)
10-Jul-2019 14:11:53         at org.gradle.internal.operations.DefaultBuildOperationExecutor$RunnableBuildOperationWorker.execute(DefaultBuildOperationExecutor.java:402)
10-Jul-2019 14:11:53         at org.gradle.internal.operations.DefaultBuildOperationExecutor$RunnableBuildOperationWorker.execute(DefaultBuildOperationExecutor.java:394)
10-Jul-2019 14:11:53         at org.gradle.internal.operations.DefaultBuildOperationExecutor$1.execute(DefaultBuildOperationExecutor.java:165)
10-Jul-2019 14:11:53         at org.gradle.internal.operations.DefaultBuildOperationExecutor.execute(DefaultBuildOperationExecutor.java:250)
10-Jul-2019 14:11:53         at org.gradle.internal.operations.DefaultBuildOperationExecutor.execute(DefaultBuildOperationExecutor.java:158)
10-Jul-2019 14:11:53         at org.gradle.internal.operations.DefaultBuildOperationExecutor.run(DefaultBuildOperationExecutor.java:92)
10-Jul-2019 14:11:53         at org.gradle.internal.operations.DelegatingBuildOperationExecutor.run(DelegatingBuildOperationExecutor.java:31)
10-Jul-2019 14:11:53         at org.gradle.api.internal.tasks.execution.ExecuteActionsTaskExecuter.executeAction(ExecuteActionsTaskExecuter.java:390)
10-Jul-2019 14:11:53         at org.gradle.api.internal.tasks.execution.ExecuteActionsTaskExecuter.executeActions(ExecuteActionsTaskExecuter.java:373)
10-Jul-2019 14:11:53         at org.gradle.api.internal.tasks.execution.ExecuteActionsTaskExecuter.access$200(ExecuteActionsTaskExecuter.java:79)
10-Jul-2019 14:11:53         at org.gradle.api.internal.tasks.execution.ExecuteActionsTaskExecuter$TaskExecution.execute(ExecuteActionsTaskExecuter.java:210)
10-Jul-2019 14:11:53         at org.gradle.internal.execution.steps.ExecuteStep.lambda$execute$1(ExecuteStep.java:33)
10-Jul-2019 14:11:53         at org.gradle.internal.execution.steps.ExecuteStep.execute(ExecuteStep.java:33)
10-Jul-2019 14:11:53         at org.gradle.internal.execution.steps.ExecuteStep.execute(ExecuteStep.java:26)
10-Jul-2019 14:11:53         at org.gradle.internal.execution.steps.CleanupOutputsStep.execute(CleanupOutputsStep.java:58)
10-Jul-2019 14:11:53         at org.gradle.internal.execution.steps.CleanupOutputsStep.execute(CleanupOutputsStep.java:35)
10-Jul-2019 14:11:53         at org.gradle.internal.execution.steps.ResolveInputChangesStep.execute(ResolveInputChangesStep.java:48)
10-Jul-2019 14:11:53         at org.gradle.internal.execution.steps.ResolveInputChangesStep.execute(ResolveInputChangesStep.java:33)
10-Jul-2019 14:11:53         at org.gradle.internal.execution.steps.CancelExecutionStep.execute(CancelExecutionStep.java:39)
10-Jul-2019 14:11:53         at org.gradle.internal.execution.steps.TimeoutStep.executeWithoutTimeout(TimeoutStep.java:73)
10-Jul-2019 14:11:53         at org.gradle.internal.execution.steps.TimeoutStep.execute(TimeoutStep.java:54)
10-Jul-2019 14:11:53         at org.gradle.internal.execution.steps.CatchExceptionStep.execute(CatchExceptionStep.java:35)
10-Jul-2019 14:11:53         at org.gradle.internal.execution.steps.CreateOutputsStep.execute(CreateOutputsStep.java:51)
10-Jul-2019 14:11:53         at org.gradle.internal.execution.steps.SnapshotOutputsStep.execute(SnapshotOutputsStep.java:45)
10-Jul-2019 14:11:53         at org.gradle.internal.execution.steps.SnapshotOutputsStep.execute(SnapshotOutputsStep.java:31)
10-Jul-2019 14:11:53         at org.gradle.internal.execution.steps.CacheStep.executeWithoutCache(CacheStep.java:201)
10-Jul-2019 14:11:53         at org.gradle.internal.execution.steps.CacheStep.execute(CacheStep.java:70)
10-Jul-2019 14:11:53         at org.gradle.internal.execution.steps.CacheStep.execute(CacheStep.java:45)
10-Jul-2019 14:11:53         at org.gradle.internal.execution.steps.BroadcastChangingOutputsStep.execute(BroadcastChangingOutputsStep.java:49)
10-Jul-2019 14:11:53         at org.gradle.internal.execution.steps.StoreSnapshotsStep.execute(StoreSnapshotsStep.java:43)
10-Jul-2019 14:11:53         at org.gradle.internal.execution.steps.StoreSnapshotsStep.execute(StoreSnapshotsStep.java:32)
10-Jul-2019 14:11:53         at org.gradle.internal.execution.steps.RecordOutputsStep.execute(RecordOutputsStep.java:38)
10-Jul-2019 14:11:53         at org.gradle.internal.execution.steps.RecordOutputsStep.execute(RecordOutputsStep.java:24)
10-Jul-2019 14:11:53         at org.gradle.internal.execution.steps.SkipUpToDateStep.executeBecause(SkipUpToDateStep.java:96)
10-Jul-2019 14:11:53         at org.gradle.internal.execution.steps.SkipUpToDateStep.lambda$execute$0(SkipUpToDateStep.java:89)
10-Jul-2019 14:11:53         at org.gradle.internal.execution.steps.SkipUpToDateStep.execute(SkipUpToDateStep.java:54)
10-Jul-2019 14:11:53         at org.gradle.internal.execution.steps.SkipUpToDateStep.execute(SkipUpToDateStep.java:38)
10-Jul-2019 14:11:53         at org.gradle.internal.execution.steps.ResolveChangesStep.execute(ResolveChangesStep.java:77)
10-Jul-2019 14:11:53         at org.gradle.internal.execution.steps.ResolveChangesStep.execute(ResolveChangesStep.java:37)
10-Jul-2019 14:11:53         at org.gradle.internal.execution.steps.legacy.MarkSnapshottingInputsFinishedStep.execute(MarkSnapshottingInputsFinishedStep.java:36)
10-Jul-2019 14:11:53         at org.gradle.internal.execution.steps.legacy.MarkSnapshottingInputsFinishedStep.execute(MarkSnapshottingInputsFinishedStep.java:26)
10-Jul-2019 14:11:53         at org.gradle.internal.execution.steps.ResolveCachingStateStep.execute(ResolveCachingStateStep.java:90)
10-Jul-2019 14:11:53         at org.gradle.internal.execution.steps.ResolveCachingStateStep.execute(ResolveCachingStateStep.java:48)
10-Jul-2019 14:11:53         at org.gradle.internal.execution.impl.DefaultWorkExecutor.execute(DefaultWorkExecutor.java:33)
10-Jul-2019 14:11:53         at org.gradle.api.internal.tasks.execution.ExecuteActionsTaskExecuter.execute(ExecuteActionsTaskExecuter.java:117)
10-Jul-2019 14:11:53         ... 35 more
10-Jul-2019 14:11:53
10-Jul-2019 14:11:53
10-Jul-2019 14:11:53 Deprecated Gradle features were used in this build, making it incompatible with Gradle 6.0.
10-Jul-2019 14:11:53
10-Jul-2019 14:11:53 Use '--warning-mode all' to show the individual deprecation warnings.
10-Jul-2019 14:11:53 * Get more help at https://help.gradle.org
10-Jul-2019 14:11:53 See https://docs.gradle.org/5.5/userguide/command_line_interface.html#sec:command_line_warnings
10-Jul-2019 14:11:53
10-Jul-2019 14:11:53 194 actionable tasks: 170 executed, 24 up-to-date
10-Jul-2019 14:11:53 BUILD FAILED in 3m 23s
10-Jul-2019 14:11:53
10-Jul-2019 14:11:53 Failing task since return code of [./gradlew --refresh-dependencies --no-daemon -PtestGroups=ci -P BRANCH_NAME=master --stacktrace clean check build -I /tmp/artifactory.init.script4891382225472074595gradle -DbuildInfoConfig.propertiesFile=/tmp/buildinfo5053846951560817950properties artifactoryPublish -Dartifactory.resolve.password=******** -Dartifactory.publish.password=********] was 1 while expected 0
10-Jul-2019 14:11:53 Parsing test results under /opt/bamboo-home/xml-data/build-dir/SPR-PUB-JOB1...
10-Jul-2019 14:11:54 Finished task 'Artifactory Gradle' with result: Failed
10-Jul-2019 14:11:54 Running post build plugin 'Docker Container Cleanup'
10-Jul-2019 14:11:54 Running post build plugin 'NCover Results Collector'
10-Jul-2019 14:11:54 Running post build plugin 'Artifactory Release Management Staging'
10-Jul-2019 14:11:54 Running post build plugin 'Artifactory Build Info Copier'
10-Jul-2019 14:11:54 Running post build plugin 'Artifactory Gradle Properties Info Copier'
10-Jul-2019 14:11:54 Running post build plugin 'Clover Results Collector'
10-Jul-2019 14:11:54 Running post build plugin 'npm Cache Cleanup'
10-Jul-2019 14:11:54 Running post build plugin 'Artifact Copier'
10-Jul-2019 14:11:55 Successfully removed working directory at '/opt/bamboo-home/xml-data/build-dir/SPR-PUB-JOB1'
10-Jul-2019 14:11:55 Finalising the build...
10-Jul-2019 14:11:55 Stopping timer.
10-Jul-2019 14:11:55 Build SPR-PUB-JOB1-7578 completed.
10-Jul-2019 14:11:53 Running on server: post build plugin 'NCover Results Collector'
10-Jul-2019 14:11:53 Running on server: post build plugin 'Build Hanging Detection Configuration'
10-Jul-2019 14:11:53 Running on server: post build plugin 'Clover Delta Calculator'
10-Jul-2019 14:11:53 Running on server: post build plugin 'Maven Dependencies Postprocessor'
10-Jul-2019 14:11:53 All post build plugins have finished
10-Jul-2019 14:11:53 Generating build results summary...
10-Jul-2019 14:12:03 Saving build results to disk...
10-Jul-2019 14:12:03 Logging substituted variables...
10-Jul-2019 14:12:05 Indexing build results...
10-Jul-2019 14:12:05 Finished building SPR-PUB-JOB1-7578.