Build #7,588

Build: #7588 failed

Job: Default Job failed

Stages & jobs

  1. Default Stage

Test results

  • 5,321 tests in total
  • 1 test failed
  • 1 failure is new
  • 81 tests were quarantined / skipped
  • 47 seconds taken in total.

Build 7,588 has the following 1 errors: 1 new failure(s) occurred since the previous build.

New test failures 1
Status Test Duration
Collapse Failed ConnectorServerFactoryBeanTests registerWithMBeanServer History
< 1 sec
java.net.BindException: java.net.BindException: Address already in use (Bind failed)
java.net.BindException: Address already in use (Bind failed)
	at java.net.PlainSocketImpl.socketBind(Native Method)
	at java.net.AbstractPlainSocketImpl.bind(AbstractPlainSocketImpl.java:387)
	at java.net.ServerSocket.bind(ServerSocket.java:375)
	at java.net.ServerSocket.<init>(ServerSocket.java:237)
	at java.net.ServerSocket.<init>(ServerSocket.java:181)
	at com.sun.jmx.remote.socket.SocketConnectionServer.start(SocketConnectionServer.java:157)
(54 more lines...)