Build #7,594

Build: #7594 failed

Job: Default Job failed

Stages & jobs

  1. Default Stage

Build log

The build generated 601 lines of output. Download or view full build log

12-Jul-2019 13:39:28 Build Spring Framework - Publication - Default Job #7594 (SPR-PUB-JOB1-7594) started building on agent bamboo-24.af.pivotal.io
12-Jul-2019 13:39:28 Remote agent on host bamboo-24.af.pivotal.io
12-Jul-2019 13:39:28 Build working directory is /opt/bamboo-home/xml-data/build-dir/SPR-PUB-JOB1
12-Jul-2019 13:39:28 Executing build Spring Framework - Publication - Default Job #7594 (SPR-PUB-JOB1-7594)
12-Jul-2019 13:39:28 Starting task 'Checkout Default Repository' of type 'com.atlassian.bamboo.plugins.vcs:task.vcs.checkout'
12-Jul-2019 13:39:28 Build always requires a clean checkout
12-Jul-2019 13:39:28 Cleaning build directory '/opt/bamboo-home/xml-data/build-dir/SPR-PUB-JOB1'
12-Jul-2019 13:39:28 Checking out into /opt/bamboo-home/xml-data/build-dir/SPR-PUB-JOB1
12-Jul-2019 13:39:28 Updating source code to revision: 4f8b347aa014e814c35d8448f85aaf119a133552
12-Jul-2019 13:39:28 Creating local git repository in '/opt/bamboo-home/xml-data/build-dir/SPR-PUB-JOB1/.git'.
12-Jul-2019 13:39:28 Initialized empty Git repository in /opt/bamboo-home/xml-data/build-dir/SPR-PUB-JOB1/.git/
12-Jul-2019 13:39:29 Fetching 'refs/heads/master' from 'https://github.com/spring-projects/spring-framework.git'.
12-Jul-2019 13:39:53 From https://github.com/spring-projects/spring-framework
12-Jul-2019 13:39:53 * [new branch]      master     -> master
12-Jul-2019 13:39:53 * [new tag]               v3.1.0.RELEASE -> v3.1.0.RELEASE
12-Jul-2019 13:39:53 * [new tag]               v3.2.0.M1      -> v3.2.0.M1
12-Jul-2019 13:39:53 * [new tag]               v3.2.0.M2      -> v3.2.0.M2
12-Jul-2019 13:39:53 * [new tag]               v3.2.0.RC1     -> v3.2.0.RC1
12-Jul-2019 13:39:53 * [new tag]               v3.2.0.RC2-A   -> v3.2.0.RC2-A
12-Jul-2019 13:39:53 * [new tag]               v3.2.0.RELEASE -> v3.2.0.RELEASE
12-Jul-2019 13:39:53 * [new tag]               v3.2.1.RELEASE -> v3.2.1.RELEASE
12-Jul-2019 13:39:53 * [new tag]               v3.2.2.RELEASE -> v3.2.2.RELEASE
12-Jul-2019 13:39:53 * [new tag]               v4.0.0.M1      -> v4.0.0.M1
12-Jul-2019 13:39:53 * [new tag]               v4.0.0.M2      -> v4.0.0.M2
12-Jul-2019 13:39:53 * [new tag]               v4.0.0.M3      -> v4.0.0.M3
12-Jul-2019 13:39:53 * [new tag]               v4.0.0.RC1     -> v4.0.0.RC1
12-Jul-2019 13:39:53 * [new tag]               v4.0.0.RC2     -> v4.0.0.RC2
12-Jul-2019 13:39:53 Checking out revision 4f8b347aa014e814c35d8448f85aaf119a133552.
12-Jul-2019 13:39:53 Already on 'master'
12-Jul-2019 13:39:53 Updated source code to revision: 4f8b347aa014e814c35d8448f85aaf119a133552
12-Jul-2019 13:39:53 Finished task 'Checkout Default Repository' with result: Success
12-Jul-2019 13:39:53 Running pre-build action: Artifactory Release Staging
12-Jul-2019 13:39:53 Running pre-build action: VCS Version Collector
12-Jul-2019 13:39:53
Substituting variable: ${bamboo.spr.jdk.home} with /opt/jdk-8
12-Jul-2019 13:39:53
Substituting variable: ${bamboo.repository.branch.name} with master
12-Jul-2019 13:39:53 Starting task 'Artifactory Gradle' of type 'org.jfrog.bamboo.bamboo-artifactory-plugin:artifactoryGradleTask'
12-Jul-2019 13:39:53 Bamboo Artifactory Plugin version: 2.6.3
12-Jul-2019 13:39:53
Beginning to execute external process for build 'Spring Framework - Publication - Default Job #7594 (SPR-PUB-JOB1-7594)'
... running command line:
./gradlew --refresh-dependencies --no-daemon -PtestGroups=ci -P BRANCH_NAME=master --stacktrace clean check build -I /tmp/artifactory.init.script4285692524188876493gradle -DbuildInfoConfig.propertiesFile=/tmp/buildinfo5704799423220033749properties artifactoryPublish -Dartifactory.resolve.password=******** -Dartifactory.publish.password=********
... in: /opt/bamboo-home/xml-data/build-dir/SPR-PUB-JOB1
... using extra environment variables:
bamboo_planRepository_1_branch=master
bamboo_********_username_password=********
bamboo_signing_store_password=********
bamboo_planRepository_2_branch=master
bamboo_capability_system_builder_ant_Ant_1_9=/opt/ant-1.9
bamboo_repository_137199621_git_repositoryUrl=https://github.com/spring-projects/spring-framework.git
bamboo_capability_system_builder_ant_Ant_1_8=/opt/ant-1.8
bamboo_planRepository_1_branchDisplayName=master
bamboo_artifactory_override_resolve_repo=libs-milestone
bamboo_capability_system_builder_node_Node_js_10_16=/opt/node-10.16/bin/node
bamboo_repository_revision_number=4f8b347aa014e814c35d8448f85aaf119a133552
bamboo_repository_262406229_git_repositoryUrl=https://github.com/spring-projects/spring-framework.git
bamboo_artifactory_task_override_jdk=true
bamboo_RIAK_BIN=/usr/sbin/riak
WRAPPER_BITS=32
bamboo_buildKey=SPR-PUB-JOB1
bamboo_repository_137199621_name=Plan Repository
bamboo_spr_jdk_home=/opt/jdk-8
bamboo_bintray_password=********
bamboo_sonar_token_password=********
PWD=/opt/bamboo-home/bin
bamboo_planRepository_2_branchDisplayName=master
bamboo_shortJobName=Default Job
bamboo_artifactory_override_resolver_password=********
bamboo_sonatype_token=RSJChaox
bamboo_capability_system_builder_gradle___gradlew=./gradlew
bamboo_buildResultsUrl=https://build.spring.io/browse/SPR-PUB-JOB1-7594
bamboo_capability_system_builder_mvn3_Maven_3_3=/opt/maven-3.3
bamboo_capability_system_builder_mvn3_Maven_3_2=/opt/maven-3.2
bamboo_capability_system_builder_mvn3_Maven_3_1=/opt/maven-3.1
bamboo_planRepository_repositoryUrl=https://github.com/spring-projects/spring-framework.git
bamboo_capability_system_builder_mvn3_Maven_3_6=/opt/maven-3.6
bamboo_agentId=284196868
bamboo_capability_system_builder_mvn3_Maven_3_5=/opt/maven-3.5
bamboo_capability_system_builder_mvn3_Maven_3_0=/opt/maven-3.0
bamboo_planRepository_revision=4f8b347aa014e814c35d8448f85aaf119a133552
bamboo_planRepository_previousRevision=b4207823afa0f48e06d6bbfe9ae8821e389e380f
bamboo_repository_137199621_revision_number=4f8b347aa014e814c35d8448f85aaf119a133552
bamboo_capability_remote_build=true
bamboo_repository_branch_name=master
bamboo_sonatype_token_password=********
bamboo_sonatype_user=springsource
SHLVL=1
bamboo_org_jfrog_bamboo_buildInfo_serverUrl=https://repo.spring.io
bamboo_scdf_acceptance_tests_password=********
bamboo_repository_262406229_branch_name=master
WRAPPER_OS=linux
JAVA_HOME=/opt/jdk-8/
TERM=linux
XDG_SESSION_ID=c1
bamboo_planRepository_branch=master
bamboo_org_jfrog_bamboo_release_activated=false
bamboo_planRepository_1_type=gitv2
bamboo_planRepository_branchName=master
bamboo_repository_137199621_git_username=spring-buildmaster
bamboo_capability_system_jdk_JDK_12=/opt/jdk-12
WRAPPER_FILE_SEPARATOR=/
_=/opt/bamboo-home/bin/bamboo-agent.sh
bamboo_repository_262406229_revision_number=4f8b347aa014e814c35d8448f85aaf119a133552
bamboo_capability_system_builder_ant_Ant_1_10=/opt/ant-1.10
WRAPPER_PATH_SEPARATOR=:
bamboo_sonar_password=********
bamboo_hg_cache_directory=/opt/bamboo-home/xml-data/build-dir/_hg-repositories-cache
bamboo_planRepository_1_username=spring-buildmaster
bamboo_planRepository_type=gitv2
bamboo_repository_262406229_git_branch=master
bamboo_git_cache_directory=/opt/bamboo-home/xml-data/build-dir/_git-repositories-cache
bamboo_planRepository_2_branchName=master
bamboo_artifactory_username=buildmaster
bamboo_tmp_directory=/opt/bamboo-home/temp
bamboo_planKey=SPR-PUB
bamboo_planRepository_username=spring-buildmaster
bamboo_JDK8_HOME=/opt/jdk-8
bamboo_snifftask=sniff
bamboo_planRepository_1_branchName=master
bamboo_sonar_version=5.6.3
bamboo_sonar_jdbc_password=********
bamboo_bintray_api_key_password=********
GRADLE_OPTS=-Xms128m
bamboo_repository_262406229_git_username=spring-buildmaster
XDG_DATA_DIRS=/usr/local/share:/usr/share:/var/lib/snapd/desktop
bamboo_capability_system_jdk_JDK_1_11=/opt/jdk-11
bamboo_resultsUrl=https://build.spring.io/browse/SPR-PUB-JOB1-7594
bamboo_capability_system_jdk_JDK_1_10=/opt/jdk-10
bamboo_build_working_directory=/opt/bamboo-home/xml-data/build-dir/SPR-PUB-JOB1
bamboo_planRepository_1_name=Spring Framework
bamboo_capability_system_os=ubuntu1804
bamboo_nexusPush_stagingProfile=buildmaster
bamboo_shortPlanName=Publication
MAIL=/var/mail/bamboo
bamboo_planRepository_2_username=spring-buildmaster
bamboo_repository_137199621_branch_name=master
bamboo_planRepository_name=Spring Framework
LOGNAME=bamboo
bamboo_buildNumber=7594
bamboo_repository_137199621_git_branch=master
SHELL=/bin/bash
bamboo_planName=Spring Framework - Publication
bamboo_JDK7_HOME=/opt/jdk-7
bamboo_repository_137199621_previous_revision_number=b4207823afa0f48e06d6bbfe9ae8821e389e380f
bamboo_shortPlanKey=PUB
OLDPWD=/opt/users/bamboo
bamboo_shortJobKey=JOB1
bamboo_artifactory_password=********
bamboo_repository_262406229_name=Spring Framework
bamboo_planRepository_2_name=Plan Repository
bamboo_repository_262406229_previous_revision_number=b4207823afa0f48e06d6bbfe9ae8821e389e380f
bamboo_buildTimeStamp=2019-07-12T13:39:28.360Z
bamboo_repository_previous_revision_number=b4207823afa0f48e06d6bbfe9ae8821e389e380f
bamboo_sonar_username=buildmaster
bamboo_********_password=********
bamboo_repository_git_branch=master
bamboo_buildResultKey=SPR-PUB-JOB1-7594
bamboo_nexusPush_close=true
bamboo_artifactory_override_resolver_username=buildmaster
bamboo_buildPlanName=Spring Framework - Publication - Default Job
bamboo_planRepository_1_revision=4f8b347aa014e814c35d8448f85aaf119a133552
bamboo_repository_name=Plan Repository
bamboo_signing_key_password=********
bamboo_planRepository_2_previousRevision=b4207823afa0f48e06d6bbfe9ae8821e389e380f
bamboo_capability_system_builder_groovy_Groovy_2_5=/opt/groovy-2.5
LANG=en_US.UTF-8
bamboo_buildFailed=false
bamboo_capability_system_docker_executable=/usr/bin/docker
DISPLAY=localhost:1.0
bamboo_capability_system_jdk_OpenJDK_7=/opt/jdk-7
bamboo_capability_system_builder_groovy_Groovy_2_4=/opt/groovy-2.4
bamboo_artifactory_override_deployer_username=buildmaster
bamboo_artifactory_password_mask_b=********
bamboo_capability_system_builder_command_Bash=/bin/bash
bamboo_artifactory_password_mask_a=********
bamboo_agentWorkingDirectory=/opt/bamboo-home/xml-data/build-dir
bamboo_planRepository_2_revision=4f8b347aa014e814c35d8448f85aaf119a133552
bamboo_capability_system_git_executable=/usr/bin/git
bamboo_repository_git_username=spring-buildmaster
bamboo_planRepository_1_previousRevision=b4207823afa0f48e06d6bbfe9ae8821e389e380f
bamboo_capability_os_family=unix
bamboo_planRepository_branchDisplayName=master
bamboo_capability_system_builder_maven_Artifactory_Maven_3_6=/opt/maven-3.6
bamboo_capability_system_builder_maven_Artifactory_Maven_3_5=/opt/maven-3.5
GIT_SSL_NO_VERIFY=true
bamboo_capability_system_builder_maven_Artifactory_Maven_3_3=/opt/maven-3.3
bamboo_planRepository_2_type=gitv2
bamboo_capability_system_builder_maven_Artifactory_Maven_3_2=/opt/maven-3.2
bamboo_s3_properties=/home/bamboo/tools/s3.properties
bamboo_capability_system_builder_maven_Artifactory_Maven_3_1=/opt/maven-3.1
bamboo_artifactory_override_deploy_repo=libs-snapshot-local
bamboo_capability_system_builder_maven_Artifactory_Maven_3_0=/opt/maven-3.0
bamboo_plan_storageTag=SPR-PUB
bamboo_bintray_username_password=********
bamboo_planRepository_2_repositoryUrl=https://github.com/spring-projects/spring-framework.git
USER=bamboo
bamboo_repository_git_repositoryUrl=https://github.com/spring-projects/spring-framework.git
bamboo_working_directory=/opt/bamboo-home/xml-data/build-dir/SPR-PUB-JOB1
bamboo_org_jfrog_bamboo_buildInfo_activated=true
bamboo_planRepository_1_repositoryUrl=https://github.com/spring-projects/spring-framework.git
bamboo_capability_system_jdk_JDK_1_8=/opt/jdk-8
bamboo_artifactory_override_deployer_password=********
bamboo_capability_system_jdk_JDK_1_9=/opt/jdk-9
WRAPPER_ARCH=x86
bamboo_capability_system_jdk_JDK_1_6=/opt/jdk-6
bamboo_sonatype_password=********
bamboo_capability_system_jdk_JDK_1_7=/opt/jdk-7
bamboo_sonar_ip=10.194.6.9
XDG_RUNTIME_DIR=/run/user/1002
HOME=/home/bamboo
PATH=/bin:/home/bamboo/bin:/usr/local/sbin:/usr/local/bin:/usr/sbin:/usr/bin:/sbin:/bin:/usr/games:/usr/local/games:/snap/bin:/home/bamboo/bin:/usr/local/bin:/bin:/home/bamboo/bin:/usr/local/sbin:/usr/local/bin:/usr/sbin:/usr/bin:/sbin:/bin:/usr/games:/usr/local/games:/snap/bin:/home/bamboo/bin:/usr/local/bin
12-Jul-2019 13:39:54 Downloading https://services.gradle.org/distributions/gradle-5.5.1-bin.zip
12-Jul-2019 13:40:09 .....................................................................................
12-Jul-2019 13:40:10
12-Jul-2019 13:40:10 Welcome to Gradle 5.5.1!
12-Jul-2019 13:40:10
12-Jul-2019 13:40:10 Here are the highlights of this release:
12-Jul-2019 13:40:10 - Kickstart Gradle plugin development with gradle init
12-Jul-2019 13:40:10 - Distribute organization-wide Gradle properties in custom Gradle distributions
12-Jul-2019 13:40:10 - Transform dependency artifacts on resolution
12-Jul-2019 13:40:10
12-Jul-2019 13:40:10 For more details see https://docs.gradle.org/5.5.1/release-notes.html
12-Jul-2019 13:40:10
12-Jul-2019 13:40:13 > Task :buildSrc:compileJava NO-SOURCE
12-Jul-2019 13:40:22 > Task :buildSrc:compileGroovy
12-Jul-2019 13:40:22 > Task :buildSrc:processResources
12-Jul-2019 13:40:22 > Task :buildSrc:classes
12-Jul-2019 13:40:22 > Task :buildSrc:jar
12-Jul-2019 13:40:22 > Task :buildSrc:assemble
12-Jul-2019 13:40:22 > Task :buildSrc:compileTestJava NO-SOURCE
12-Jul-2019 13:40:22 > Task :buildSrc:compileTestGroovy NO-SOURCE
12-Jul-2019 13:40:22 > Task :buildSrc:processTestResources NO-SOURCE
12-Jul-2019 13:40:22 > Task :buildSrc:testClasses UP-TO-DATE
12-Jul-2019 13:40:22 > Task :buildSrc:test NO-SOURCE
12-Jul-2019 13:40:22 > Task :buildSrc:check UP-TO-DATE
12-Jul-2019 13:40:22 > Task :buildSrc:build
12-Jul-2019 13:40:38 Cannot publish pom for project ':spring-core-coroutines' since it does not contain the Maven plugin install task and task ':spring-core-coroutines:artifactoryPublish' does not specify a custom pom path.
12-Jul-2019 13:40:38 Cannot publish pom for project ':spring-build-src' since it does not contain the Maven plugin install task and task ':spring-build-src:artifactoryPublish' does not specify a custom pom path.
12-Jul-2019 13:40:38 Cannot publish pom for project ':' since it does not contain the Maven plugin install task and task ':artifactoryPublish' does not specify a custom pom path.
12-Jul-2019 13:40:41 > Task :clean UP-TO-DATE
12-Jul-2019 13:40:41 > Task :spring-aop:clean UP-TO-DATE
12-Jul-2019 13:40:41 > Task :spring-aspects:clean UP-TO-DATE
12-Jul-2019 13:40:41 > Task :spring-beans:clean UP-TO-DATE
12-Jul-2019 13:40:41 > Task :spring-build-src:clean
12-Jul-2019 13:40:41 > Task :spring-context:clean UP-TO-DATE
12-Jul-2019 13:40:41 > Task :spring-context-indexer:clean UP-TO-DATE
12-Jul-2019 13:40:41 > Task :spring-context-support:clean UP-TO-DATE
12-Jul-2019 13:40:41 > Task :spring-core:clean UP-TO-DATE
12-Jul-2019 13:40:41 > Task :spring-core-coroutines:clean UP-TO-DATE
12-Jul-2019 13:40:41 > Task :spring-expression:clean UP-TO-DATE
12-Jul-2019 13:40:41 > Task :spring-framework-bom:clean UP-TO-DATE
12-Jul-2019 13:40:41 > Task :spring-instrument:clean UP-TO-DATE
12-Jul-2019 13:40:41 > Task :spring-jcl:clean UP-TO-DATE
12-Jul-2019 13:40:41 > Task :spring-jdbc:clean UP-TO-DATE
12-Jul-2019 13:40:41 > Task :spring-jms:clean UP-TO-DATE
12-Jul-2019 13:40:41 > Task :spring-messaging:clean UP-TO-DATE
12-Jul-2019 13:40:41 > Task :spring-orm:clean UP-TO-DATE
12-Jul-2019 13:40:41 > Task :spring-oxm:clean UP-TO-DATE
12-Jul-2019 13:40:41 > Task :spring-test:clean UP-TO-DATE
12-Jul-2019 13:40:41 > Task :spring-tx:clean UP-TO-DATE
12-Jul-2019 13:40:41 > Task :spring-web:clean UP-TO-DATE
12-Jul-2019 13:40:41 > Task :spring-webflux:clean UP-TO-DATE
12-Jul-2019 13:40:41 > Task :spring-webmvc:clean UP-TO-DATE
12-Jul-2019 13:40:41 > Task :spring-websocket:clean UP-TO-DATE
12-Jul-2019 13:40:41 > Task :compileKotlin NO-SOURCE
12-Jul-2019 13:40:41 > Task :compileJava NO-SOURCE
12-Jul-2019 13:40:41 > Task :compileGroovy NO-SOURCE
12-Jul-2019 13:40:41 > Task :processResources NO-SOURCE
12-Jul-2019 13:40:41 > Task :classes UP-TO-DATE
12-Jul-2019 13:40:41 > Task :checkstyleMain NO-SOURCE
12-Jul-2019 13:40:46 > Task :checkstyleNohttp
12-Jul-2019 13:40:47 > Task :spring-core:cglibRepackJar
12-Jul-2019 13:40:47 > Task :spring-core:objenesisRepackJar
12-Jul-2019 13:40:52 > Task :spring-core-coroutines:compileKotlin
12-Jul-2019 13:40:52 > Task :spring-core-coroutines:compileJava NO-SOURCE
12-Jul-2019 13:40:52 > Task :spring-core-coroutines:processResources NO-SOURCE
12-Jul-2019 13:40:52 > Task :spring-core-coroutines:classes UP-TO-DATE
12-Jul-2019 13:40:52 > Task :spring-core-coroutines:inspectClassesForKotlinIC
12-Jul-2019 13:40:52 > Task :spring-core-coroutines:jar
12-Jul-2019 13:40:52 > Task :spring-jcl:compileKotlin
12-Jul-2019 13:40:52 > Task :spring-jcl:compileJava
12-Jul-2019 13:40:52 > Task :spring-jcl:processResources
12-Jul-2019 13:40:52 > Task :spring-jcl:classes
12-Jul-2019 13:40:52 > Task :spring-jcl:inspectClassesForKotlinIC
12-Jul-2019 13:40:52 > Task :spring-jcl:jar
12-Jul-2019 13:40:54 > Task :spring-core:compileKotlin
12-Jul-2019 13:40:58 > Task :spring-core:compileJava
12-Jul-2019 13:40:58 > Task :spring-core:processResources NO-SOURCE
12-Jul-2019 13:40:58 > Task :spring-core:classes
12-Jul-2019 13:40:58 > Task :spring-core:inspectClassesForKotlinIC
12-Jul-2019 13:40:58 > Task :spring-core:jar
12-Jul-2019 13:41:02 > Task :spring-beans:compileGroovy
12-Jul-2019 13:41:03 > Task :spring-beans:compileKotlin
12-Jul-2019 13:41:03 > Task :spring-beans:compileJava NO-SOURCE
12-Jul-2019 13:41:03 > Task :spring-beans:processResources
12-Jul-2019 13:41:03 > Task :spring-beans:classes
12-Jul-2019 13:41:03 > Task :spring-beans:inspectClassesForKotlinIC
12-Jul-2019 13:41:03 > Task :spring-beans:jar
12-Jul-2019 13:41:03 > Task :spring-aop:compileKotlin
12-Jul-2019 13:41:04 > Task :spring-aop:compileJava
12-Jul-2019 13:41:04 > Task :spring-aop:processResources
12-Jul-2019 13:41:04 > Task :spring-aop:classes
12-Jul-2019 13:41:04 > Task :spring-core-coroutines:compileTestKotlin NO-SOURCE
12-Jul-2019 13:41:04 > Task :spring-core-coroutines:compileTestJava NO-SOURCE
12-Jul-2019 13:41:04 > Task :spring-core-coroutines:processTestResources NO-SOURCE
12-Jul-2019 13:41:04 > Task :spring-core-coroutines:testClasses UP-TO-DATE
12-Jul-2019 13:41:04 > Task :spring-jcl:compileTestKotlin NO-SOURCE
12-Jul-2019 13:41:04 > Task :spring-jcl:compileTestJava NO-SOURCE
12-Jul-2019 13:41:04 > Task :spring-jcl:processTestResources NO-SOURCE
12-Jul-2019 13:41:04 > Task :spring-jcl:testClasses UP-TO-DATE
12-Jul-2019 13:41:07 > Task :spring-core:compileTestKotlin
12-Jul-2019 13:41:15 > Task :spring-core:compileTestJava
12-Jul-2019 13:41:15 > Task :spring-core:processTestResources
12-Jul-2019 13:41:15 > Task :spring-core:testClasses
12-Jul-2019 13:41:17 > Task :spring-beans:compileTestKotlin
12-Jul-2019 13:41:20
12-Jul-2019 13:41:20 > Task :spring-beans:compileTestJava
12-Jul-2019 13:41:20 Note: Some input files use unchecked or unsafe operations.
12-Jul-2019 13:41:20 Note: Recompile with -Xlint:unchecked for details.
12-Jul-2019 13:41:21
12-Jul-2019 13:41:21 > Task :spring-beans:compileTestGroovy NO-SOURCE
12-Jul-2019 13:41:21 > Task :spring-beans:processTestResources
12-Jul-2019 13:41:21 > Task :spring-beans:testClasses
12-Jul-2019 13:41:21 > Task :spring-aop:compileTestKotlin
12-Jul-2019 13:41:21 > Task :spring-aop:inspectClassesForKotlinIC
12-Jul-2019 13:41:21 > Task :spring-aop:jar
12-Jul-2019 13:41:22 > Task :spring-aop:compileTestJava
12-Jul-2019 13:41:22 > Task :spring-aop:processTestResources
12-Jul-2019 13:41:22 > Task :spring-aop:testClasses
12-Jul-2019 13:41:22 > Task :spring-expression:compileKotlin
12-Jul-2019 13:41:22 > Task :spring-expression:compileJava
12-Jul-2019 13:41:22 > Task :spring-expression:processResources
12-Jul-2019 13:41:22 > Task :spring-expression:classes
12-Jul-2019 13:41:22 > Task :spring-expression:inspectClassesForKotlinIC
12-Jul-2019 13:41:22 > Task :spring-expression:jar
12-Jul-2019 13:41:22 > Task :spring-instrument:compileKotlin
12-Jul-2019 13:41:22 > Task :spring-instrument:compileJava
12-Jul-2019 13:41:22 > Task :spring-instrument:processResources NO-SOURCE
12-Jul-2019 13:41:22 > Task :spring-instrument:classes
12-Jul-2019 13:41:22 > Task :spring-instrument:inspectClassesForKotlinIC
12-Jul-2019 13:41:22 > Task :spring-instrument:jar
12-Jul-2019 13:41:27 > Task :spring-context:compileKotlin
12-Jul-2019 13:41:28 > Task :spring-context:compileJava
12-Jul-2019 13:41:28 > Task :spring-context:compileGroovy NO-SOURCE
12-Jul-2019 13:41:28 > Task :spring-context:processResources
12-Jul-2019 13:41:28 > Task :spring-context:classes
12-Jul-2019 13:41:28 > Task :spring-expression:compileTestKotlin
12-Jul-2019 13:41:32 > Task :spring-expression:compileTestJava
12-Jul-2019 13:41:32 > Task :spring-expression:processTestResources
12-Jul-2019 13:41:32 > Task :spring-expression:testClasses
12-Jul-2019 13:41:32 > Task :spring-instrument:compileTestKotlin NO-SOURCE
12-Jul-2019 13:41:32 > Task :spring-instrument:compileTestJava NO-SOURCE
12-Jul-2019 13:41:32 > Task :spring-instrument:processTestResources
12-Jul-2019 13:41:32 > Task :spring-instrument:testClasses
12-Jul-2019 13:41:33 > Task :spring-context:compileTestKotlin
12-Jul-2019 13:41:33 > Task :spring-context:inspectClassesForKotlinIC
12-Jul-2019 13:41:33 > Task :spring-context:jar
12-Jul-2019 13:41:38 Note: Some input files use or override a deprecated API.
12-Jul-2019 13:41:38 Note: Recompile with -Xlint:deprecation for details.
12-Jul-2019 13:41:38 Note: Some input files use unchecked or unsafe operations.
12-Jul-2019 13:41:38 Note: Recompile with -Xlint:unchecked for details.
12-Jul-2019 13:41:38
12-Jul-2019 13:41:38 > Task :spring-context:compileTestJava
12-Jul-2019 13:41:39
12-Jul-2019 13:41:39 > Task :spring-context:compileTestGroovy
12-Jul-2019 13:41:39 > Task :spring-context:processTestResources
12-Jul-2019 13:41:39 > Task :spring-context:testClasses
12-Jul-2019 13:41:39 > Task :spring-tx:compileKotlin
12-Jul-2019 13:41:40 > Task :spring-tx:compileJava
12-Jul-2019 13:41:40 > Task :spring-tx:processResources
12-Jul-2019 13:41:40 > Task :spring-tx:classes
12-Jul-2019 13:41:40 > Task :spring-tx:inspectClassesForKotlinIC
12-Jul-2019 13:41:40 > Task :spring-tx:jar
12-Jul-2019 13:41:41 > Task :spring-jdbc:compileKotlin
12-Jul-2019 13:41:42 > Task :spring-jdbc:compileJava
12-Jul-2019 13:41:42 > Task :spring-jdbc:processResources
12-Jul-2019 13:41:42 > Task :spring-jdbc:classes
12-Jul-2019 13:41:42 > Task :spring-tx:compileTestKotlin
12-Jul-2019 13:42:01 > Task :spring-tx:compileTestJava
12-Jul-2019 13:42:01 > Task :spring-tx:processTestResources
12-Jul-2019 13:42:01 > Task :spring-tx:testClasses
12-Jul-2019 13:42:02 > Task :spring-jdbc:compileTestKotlin
12-Jul-2019 13:42:02 > Task :spring-jdbc:inspectClassesForKotlinIC
12-Jul-2019 13:42:02 > Task :spring-jdbc:jar
12-Jul-2019 13:42:03 > Task :spring-jdbc:compileTestJava
12-Jul-2019 13:42:03 > Task :spring-jdbc:processTestResources
12-Jul-2019 13:42:03 > Task :spring-jdbc:testClasses
12-Jul-2019 13:42:04 > Task :spring-oxm:compileKotlin
12-Jul-2019 13:42:04 > Task :spring-oxm:compileJava
12-Jul-2019 13:42:04 > Task :spring-oxm:processResources
12-Jul-2019 13:42:04 > Task :spring-oxm:classes
12-Jul-2019 13:42:04 > Task :spring-oxm:inspectClassesForKotlinIC
12-Jul-2019 13:42:04 > Task :spring-oxm:jar
12-Jul-2019 13:42:06 > Task :spring-web:compileKotlin
12-Jul-2019 13:42:11 > Task :spring-web:compileJava
12-Jul-2019 13:42:11 > Task :spring-web:processResources
12-Jul-2019 13:42:11 > Task :spring-web:classes
12-Jul-2019 13:42:11 > Task :spring-web:inspectClassesForKotlinIC
12-Jul-2019 13:42:11 > Task :spring-web:jar
12-Jul-2019 13:42:12 > Task :spring-orm:compileKotlin
12-Jul-2019 13:42:14 > Task :spring-orm:compileJava
12-Jul-2019 13:42:14 > Task :spring-orm:processResources NO-SOURCE
12-Jul-2019 13:42:14 > Task :spring-orm:classes
12-Jul-2019 13:42:15
12-Jul-2019 13:42:15 > Task :spring-oxm:genJaxb
12-Jul-2019 13:42:15 [ant:javac] : warning: 'includeantruntime' was not set, defaulting to build.sysclasspath=last; set to false for repeatable builds
12-Jul-2019 13:42:15
12-Jul-2019 13:42:15 > Task :spring-oxm:compileTestKotlin
12-Jul-2019 13:42:16 > Task :spring-oxm:compileTestJava
12-Jul-2019 13:42:16 > Task :spring-oxm:processTestResources
12-Jul-2019 13:42:16 > Task :spring-oxm:testClasses
12-Jul-2019 13:42:18 > Task :spring-web:compileTestKotlin
12-Jul-2019 13:42:23 > Task :spring-web:compileTestJava
12-Jul-2019 13:42:23 > Task :spring-web:processTestResources
12-Jul-2019 13:42:23 > Task :spring-web:testClasses
12-Jul-2019 13:42:23 > Task :spring-orm:compileTestKotlin
12-Jul-2019 13:42:23 > Task :spring-orm:inspectClassesForKotlinIC
12-Jul-2019 13:42:23 > Task :spring-orm:jar
12-Jul-2019 13:42:24 > Task :spring-orm:compileTestJava
12-Jul-2019 13:42:24 > Task :spring-orm:processTestResources
12-Jul-2019 13:42:24 > Task :spring-orm:testClasses
12-Jul-2019 13:42:24 > Task :spring-context-support:compileKotlin
12-Jul-2019 13:42:26 > Task :spring-context-support:compileJava
12-Jul-2019 13:42:26 > Task :spring-context-support:processResources
12-Jul-2019 13:42:26 > Task :spring-context-support:classes
12-Jul-2019 13:42:26 > Task :spring-context-support:compileTestKotlin
12-Jul-2019 13:42:26 > Task :spring-context-support:inspectClassesForKotlinIC
12-Jul-2019 13:42:26 > Task :spring-context-support:jar
12-Jul-2019 13:42:27 > Task :spring-context-support:compileTestJava
12-Jul-2019 13:42:27 > Task :spring-context-support:processTestResources
12-Jul-2019 13:42:27 > Task :spring-context-support:testClasses
12-Jul-2019 13:42:29 > Task :spring-webflux:compileKotlin
12-Jul-2019 13:42:30 > Task :spring-webflux:compileJava
12-Jul-2019 13:42:30 > Task :spring-webflux:processResources
12-Jul-2019 13:42:30 > Task :spring-webflux:classes
12-Jul-2019 13:42:30 > Task :spring-webflux:inspectClassesForKotlinIC
12-Jul-2019 13:42:30 > Task :spring-webflux:jar
12-Jul-2019 13:42:32 > Task :spring-webmvc:compileKotlin
12-Jul-2019 13:42:36 > Task :spring-webmvc:compileJava
12-Jul-2019 13:42:36 > Task :spring-webmvc:processResources
12-Jul-2019 13:42:36 > Task :spring-webmvc:classes
12-Jul-2019 13:42:36 > Task :spring-webmvc:inspectClassesForKotlinIC
12-Jul-2019 13:42:36 > Task :spring-webmvc:jar
12-Jul-2019 13:42:37 > Task :spring-messaging:compileKotlin
12-Jul-2019 13:42:38 > Task :spring-messaging:compileJava
12-Jul-2019 13:42:38 > Task :spring-messaging:processResources NO-SOURCE
12-Jul-2019 13:42:38 > Task :spring-messaging:classes
12-Jul-2019 13:42:38 > Task :spring-messaging:inspectClassesForKotlinIC
12-Jul-2019 13:42:38 > Task :spring-messaging:jar
12-Jul-2019 13:42:38 > Task :spring-websocket:compileKotlin
12-Jul-2019 13:42:39 > Task :spring-websocket:compileJava
12-Jul-2019 13:42:39 > Task :spring-websocket:processResources
12-Jul-2019 13:42:39 > Task :spring-websocket:classes
12-Jul-2019 13:42:39 > Task :spring-websocket:inspectClassesForKotlinIC
12-Jul-2019 13:42:39 > Task :spring-websocket:jar
12-Jul-2019 13:42:42 > Task :spring-test:compileKotlin
12-Jul-2019 13:42:45 > Task :spring-test:compileJava
12-Jul-2019 13:42:45 > Task :spring-test:processResources
12-Jul-2019 13:42:45 > Task :spring-test:classes
12-Jul-2019 13:42:47 > Task :spring-webflux:compileTestKotlin
12-Jul-2019 13:42:51 > Task :spring-webflux:compileTestJava
12-Jul-2019 13:42:51 > Task :spring-webflux:processTestResources
12-Jul-2019 13:42:51 > Task :spring-webflux:testClasses
12-Jul-2019 13:42:52 > Task :spring-webmvc:compileTestKotlin
12-Jul-2019 13:42:56 > Task :spring-webmvc:compileTestJava
12-Jul-2019 13:42:56 > Task :spring-webmvc:processTestResources
12-Jul-2019 13:42:56 > Task :spring-webmvc:testClasses
12-Jul-2019 13:42:58 > Task :spring-messaging:compileTestKotlin
12-Jul-2019 13:42:59 > Task :spring-messaging:compileTestJava
12-Jul-2019 13:42:59 > Task :spring-messaging:processTestResources
12-Jul-2019 13:42:59 > Task :spring-messaging:testClasses
12-Jul-2019 13:42:59 > Task :spring-websocket:compileTestKotlin
12-Jul-2019 13:43:01 > Task :spring-websocket:compileTestJava
12-Jul-2019 13:43:01 > Task :spring-websocket:processTestResources
12-Jul-2019 13:43:01 > Task :spring-websocket:testClasses
12-Jul-2019 13:43:02 > Task :spring-test:compileTestKotlin
12-Jul-2019 13:43:02 > Task :spring-test:inspectClassesForKotlinIC
12-Jul-2019 13:43:02 > Task :spring-test:jar
12-Jul-2019 13:43:05 > Task :spring-test:compileTestJava
12-Jul-2019 13:43:06 > Task :spring-test:processTestResources
12-Jul-2019 13:43:06 > Task :spring-test:testClasses
12-Jul-2019 13:43:06 > Task :compileTestKotlin
12-Jul-2019 13:43:08 > Task :compileTestJava
12-Jul-2019 13:43:08 > Task :compileTestGroovy NO-SOURCE
12-Jul-2019 13:43:08 > Task :processTestResources
12-Jul-2019 13:43:08 > Task :testClasses
12-Jul-2019 13:43:09 > Task :checkstyleTest
12-Jul-2019 13:43:13 > Task :test
12-Jul-2019 13:43:13 > Task :check
12-Jul-2019 13:43:16 > Task :spring-aop:checkstyleMain
12-Jul-2019 13:43:17 > Task :spring-aop:checkstyleTest
12-Jul-2019 13:43:20 > Task :spring-aop:test
12-Jul-2019 13:43:20 > Task :spring-aop:check
12-Jul-2019 13:43:20 > Task :spring-aspects:compileKotlin
12-Jul-2019 13:43:22 > Task :spring-aspects:compileJava
12-Jul-2019 13:43:22 > Task :spring-aspects:processResources
12-Jul-2019 13:43:22 > Task :spring-aspects:classes
12-Jul-2019 13:43:22 > Task :spring-aspects:checkstyleMain
12-Jul-2019 13:43:22 > Task :spring-aspects:compileTestKotlin
12-Jul-2019 13:43:22 > Task :spring-aspects:inspectClassesForKotlinIC
12-Jul-2019 13:43:22 > Task :spring-aspects:jar
12-Jul-2019 13:43:24 > Task :spring-aspects:compileTestJava
12-Jul-2019 13:43:24 > Task :spring-aspects:processTestResources
12-Jul-2019 13:43:24 > Task :spring-aspects:testClasses
12-Jul-2019 13:43:24 > Task :spring-aspects:checkstyleTest
12-Jul-2019 13:43:29 > Task :spring-aspects:test
12-Jul-2019 13:43:29 > Task :spring-aspects:check
12-Jul-2019 13:43:32 > Task :spring-beans:checkstyleMain
12-Jul-2019 13:43:34 > Task :spring-beans:checkstyleTest
12-Jul-2019 13:43:42 > Task :spring-beans:test
12-Jul-2019 13:43:42 > Task :spring-beans:check
12-Jul-2019 13:43:42 > Task :spring-build-src:compileKotlin NO-SOURCE
12-Jul-2019 13:43:42 > Task :spring-build-src:compileJava NO-SOURCE
12-Jul-2019 13:43:42 > Task :spring-build-src:compileGroovy
12-Jul-2019 13:43:42 > Task :spring-build-src:processResources
12-Jul-2019 13:43:42 > Task :spring-build-src:classes
12-Jul-2019 13:43:42 > Task :spring-build-src:checkstyleMain NO-SOURCE
12-Jul-2019 13:43:42 > Task :spring-build-src:compileTestKotlin NO-SOURCE
12-Jul-2019 13:43:42 > Task :spring-build-src:compileTestJava NO-SOURCE
12-Jul-2019 13:43:42 > Task :spring-build-src:compileTestGroovy NO-SOURCE
12-Jul-2019 13:43:42 > Task :spring-build-src:processTestResources NO-SOURCE
12-Jul-2019 13:43:42 > Task :spring-build-src:testClasses UP-TO-DATE
12-Jul-2019 13:43:42 > Task :spring-build-src:checkstyleTest NO-SOURCE
12-Jul-2019 13:43:42 > Task :spring-build-src:test NO-SOURCE
12-Jul-2019 13:43:42 > Task :spring-build-src:check UP-TO-DATE
12-Jul-2019 13:43:46 > Task :spring-context:checkstyleMain
12-Jul-2019 13:43:49 > Task :spring-context:checkstyleTest
12-Jul-2019 13:44:19 > Task :spring-context:test
12-Jul-2019 13:44:22 > Task :spring-context:check
12-Jul-2019 13:44:22 > Task :spring-context-indexer:compileKotlin
12-Jul-2019 13:44:23 > Task :spring-context-indexer:compileJava
12-Jul-2019 13:44:23 > Task :spring-context-indexer:processResources
12-Jul-2019 13:44:23 > Task :spring-context-indexer:classes
12-Jul-2019 13:44:23 > Task :spring-context-indexer:checkstyleMain
12-Jul-2019 13:44:23 > Task :spring-context-indexer:compileTestKotlin
12-Jul-2019 13:44:23 > Task :spring-context-indexer:compileTestJava
12-Jul-2019 13:44:23 > Task :spring-context-indexer:processTestResources NO-SOURCE
12-Jul-2019 13:44:23 > Task :spring-context-indexer:testClasses
12-Jul-2019 13:44:23 > Task :spring-context-indexer:checkstyleTest
12-Jul-2019 13:44:25 > Task :spring-context-indexer:test
12-Jul-2019 13:44:25 > Task :spring-context-indexer:check
12-Jul-2019 13:44:26 > Task :spring-context-support:checkstyleMain
12-Jul-2019 13:44:26 > Task :spring-context-support:checkstyleTest
12-Jul-2019 13:44:35 > Task :spring-context-support:test
12-Jul-2019 13:44:35 > Task :spring-context-support:check
12-Jul-2019 13:44:41 > Task :spring-core:checkstyleMain
12-Jul-2019 13:44:43 > Task :spring-core:checkstyleTest
12-Jul-2019 13:44:55 > Task :spring-core:test
12-Jul-2019 13:44:55 > Task :spring-core:check
12-Jul-2019 13:44:55 > Task :spring-core-coroutines:checkstyleMain NO-SOURCE
12-Jul-2019 13:44:55 > Task :spring-core-coroutines:checkstyleTest NO-SOURCE
12-Jul-2019 13:44:55 > Task :spring-core-coroutines:test NO-SOURCE
12-Jul-2019 13:44:55 > Task :spring-core-coroutines:check UP-TO-DATE
12-Jul-2019 13:44:55 > Task :spring-expression:checkstyleMain
12-Jul-2019 13:44:57 > Task :spring-expression:checkstyleTest
12-Jul-2019 13:44:58 > Task :spring-expression:test
12-Jul-2019 13:44:58 > Task :spring-expression:check
12-Jul-2019 13:44:58 > Task :spring-framework-bom:compileKotlin NO-SOURCE
12-Jul-2019 13:44:58 > Task :spring-framework-bom:compileJava NO-SOURCE
12-Jul-2019 13:44:58 > Task :spring-framework-bom:processResources NO-SOURCE
12-Jul-2019 13:44:58 > Task :spring-framework-bom:classes UP-TO-DATE
12-Jul-2019 13:44:58 > Task :spring-framework-bom:checkstyleMain NO-SOURCE
12-Jul-2019 13:44:58 > Task :spring-framework-bom:compileTestKotlin NO-SOURCE
12-Jul-2019 13:44:58 > Task :spring-framework-bom:compileTestJava NO-SOURCE
12-Jul-2019 13:44:58 > Task :spring-framework-bom:processTestResources NO-SOURCE
12-Jul-2019 13:44:58 > Task :spring-framework-bom:testClasses UP-TO-DATE
12-Jul-2019 13:44:58 > Task :spring-framework-bom:checkstyleTest NO-SOURCE
12-Jul-2019 13:44:58 > Task :spring-framework-bom:test NO-SOURCE
12-Jul-2019 13:44:58 > Task :spring-framework-bom:check UP-TO-DATE
12-Jul-2019 13:44:59 > Task :spring-instrument:checkstyleMain
12-Jul-2019 13:44:59 > Task :spring-instrument:checkstyleTest NO-SOURCE
12-Jul-2019 13:44:59 > Task :spring-instrument:test NO-SOURCE
12-Jul-2019 13:44:59 > Task :spring-instrument:check
12-Jul-2019 13:44:59 > Task :spring-jcl:checkstyleMain
12-Jul-2019 13:44:59 > Task :spring-jcl:checkstyleTest NO-SOURCE
12-Jul-2019 13:44:59 > Task :spring-jcl:test NO-SOURCE
12-Jul-2019 13:44:59 > Task :spring-jcl:check
12-Jul-2019 13:45:00 > Task :spring-jdbc:checkstyleMain
12-Jul-2019 13:45:01 > Task :spring-jdbc:checkstyleTest
12-Jul-2019 13:45:10 > Task :spring-jdbc:test
12-Jul-2019 13:45:10 > Task :spring-jdbc:check
12-Jul-2019 13:45:10 > Task :spring-jms:compileKotlin
12-Jul-2019 13:45:11 > Task :spring-jms:compileJava
12-Jul-2019 13:45:11 > Task :spring-jms:processResources
12-Jul-2019 13:45:11 > Task :spring-jms:classes
12-Jul-2019 13:45:12 > Task :spring-jms:checkstyleMain
12-Jul-2019 13:45:12 > Task :spring-jms:compileTestKotlin
12-Jul-2019 13:45:12 > Task :spring-jms:compileTestJava
12-Jul-2019 13:45:12 > Task :spring-jms:processTestResources
12-Jul-2019 13:45:12 > Task :spring-jms:testClasses
12-Jul-2019 13:45:13 > Task :spring-jms:checkstyleTest
12-Jul-2019 13:45:17 > Task :spring-jms:test
12-Jul-2019 13:45:17 > Task :spring-jms:check
12-Jul-2019 13:45:19 > Task :spring-messaging:checkstyleMain
12-Jul-2019 13:45:20 > Task :spring-messaging:checkstyleTest
12-Jul-2019 13:45:50 > Task :spring-messaging:test
12-Jul-2019 13:46:06 > Task :spring-messaging:check
12-Jul-2019 13:46:07 > Task :spring-orm:checkstyleMain
12-Jul-2019 13:46:07 > Task :spring-orm:checkstyleTest
12-Jul-2019 13:46:13 > Task :spring-orm:test
12-Jul-2019 13:46:13 > Task :spring-orm:check
12-Jul-2019 13:46:14 > Task :spring-oxm:checkstyleMain
12-Jul-2019 13:46:14 > Task :spring-oxm:checkstyleTest
12-Jul-2019 13:46:16 > Task :spring-oxm:test
12-Jul-2019 13:46:16 > Task :spring-oxm:check
12-Jul-2019 13:46:26 > Task :spring-test:testJUnitJupiter
12-Jul-2019 13:46:33 > Task :spring-test:testNG
12-Jul-2019 13:47:03 > Task :spring-test:test
12-Jul-2019 13:47:09 > Task :spring-test:aggregateTestReports
12-Jul-2019 13:47:12 > Task :spring-test:checkstyleMain
12-Jul-2019 13:47:14 > Task :spring-test:checkstyleTest
12-Jul-2019 13:47:14 > Task :spring-test:check
12-Jul-2019 13:47:15 > Task :spring-tx:checkstyleMain
12-Jul-2019 13:47:16
12-Jul-2019 13:47:16 > Task :spring-tx:checkstyleTest FAILED
12-Jul-2019 13:47:16 [ant:checkstyle] [ERROR] /opt/bamboo-home/xml-data/build-dir/SPR-PUB-JOB1/spring-tx/src/test/java/org/springframework/transaction/event/TransactionalEventListenerTests.java:51: Using the '.*' form of import should be avoided - org.assertj.core.api.Assertions.*. [AvoidStarImport]
12-Jul-2019 13:47:16 [ant:checkstyle] [ERROR] /opt/bamboo-home/xml-data/build-dir/SPR-PUB-JOB1/spring-tx/src/test/java/org/springframework/transaction/event/TransactionalEventListenerTests.java:52: Using the '.*' form of import should be avoided - org.springframework.transaction.event.TransactionPhase.*. [AvoidStarImport]
12-Jul-2019 13:47:16
12-Jul-2019 13:47:16 FAILURE: Build failed with an exception.
12-Jul-2019 13:47:16
12-Jul-2019 13:47:16 * What went wrong:
12-Jul-2019 13:47:16 Execution failed for task ':spring-tx:checkstyleTest'.
12-Jul-2019 13:47:16 > Checkstyle rule violations were found. See the report at: file:///opt/bamboo-home/xml-data/build-dir/SPR-PUB-JOB1/spring-tx/build/reports/checkstyle/test.html
12-Jul-2019 13:47:16   Checkstyle files with violations: 1
12-Jul-2019 13:47:16   Checkstyle violations by severity: [error:2]
12-Jul-2019 13:47:16
12-Jul-2019 13:47:16
12-Jul-2019 13:47:16 * Try:
12-Jul-2019 13:47:16 Run with --info or --debug option to get more log output. Run with --scan to get full insights.
12-Jul-2019 13:47:16
12-Jul-2019 13:47:16 * Exception is:
12-Jul-2019 13:47:16 org.gradle.api.tasks.TaskExecutionException: Execution failed for task ':spring-tx:checkstyleTest'.
12-Jul-2019 13:47:16         at org.gradle.api.internal.tasks.execution.ExecuteActionsTaskExecuter$3.accept(ExecuteActionsTaskExecuter.java:148)
12-Jul-2019 13:47:16         at org.gradle.api.internal.tasks.execution.ExecuteActionsTaskExecuter$3.accept(ExecuteActionsTaskExecuter.java:145)
12-Jul-2019 13:47:16         at org.gradle.internal.Try$Failure.ifSuccessfulOrElse(Try.java:191)
12-Jul-2019 13:47:16         at org.gradle.api.internal.tasks.execution.ExecuteActionsTaskExecuter.execute(ExecuteActionsTaskExecuter.java:138)
12-Jul-2019 13:47:16         at org.gradle.api.internal.tasks.execution.ResolveBeforeExecutionStateTaskExecuter.execute(ResolveBeforeExecutionStateTaskExecuter.java:75)
12-Jul-2019 13:47:16         at org.gradle.api.internal.tasks.execution.ValidatingTaskExecuter.execute(ValidatingTaskExecuter.java:62)
12-Jul-2019 13:47:16         at org.gradle.api.internal.tasks.execution.SkipEmptySourceFilesTaskExecuter.execute(SkipEmptySourceFilesTaskExecuter.java:108)
12-Jul-2019 13:47:16         at org.gradle.api.internal.tasks.execution.ResolveBeforeExecutionOutputsTaskExecuter.execute(ResolveBeforeExecutionOutputsTaskExecuter.java:67)
12-Jul-2019 13:47:16         at org.gradle.api.internal.tasks.execution.ResolveAfterPreviousExecutionStateTaskExecuter.execute(ResolveAfterPreviousExecutionStateTaskExecuter.java:46)
12-Jul-2019 13:47:16         at org.gradle.api.internal.tasks.execution.CleanupStaleOutputsExecuter.execute(CleanupStaleOutputsExecuter.java:94)
12-Jul-2019 13:47:16         at org.gradle.api.internal.tasks.execution.FinalizePropertiesTaskExecuter.execute(FinalizePropertiesTaskExecuter.java:46)
12-Jul-2019 13:47:16         at org.gradle.api.internal.tasks.execution.ResolveTaskExecutionModeExecuter.execute(ResolveTaskExecutionModeExecuter.java:95)
12-Jul-2019 13:47:16         at org.gradle.api.internal.tasks.execution.SkipTaskWithNoActionsExecuter.execute(SkipTaskWithNoActionsExecuter.java:57)
12-Jul-2019 13:47:16         at org.gradle.api.internal.tasks.execution.SkipOnlyIfTaskExecuter.execute(SkipOnlyIfTaskExecuter.java:56)
12-Jul-2019 13:47:16         at org.gradle.api.internal.tasks.execution.CatchExceptionTaskExecuter.execute(CatchExceptionTaskExecuter.java:36)
12-Jul-2019 13:47:16         at org.gradle.api.internal.tasks.execution.EventFiringTaskExecuter$1.executeTask(EventFiringTaskExecuter.java:73)
12-Jul-2019 13:47:16         at org.gradle.api.internal.tasks.execution.EventFiringTaskExecuter$1.call(EventFiringTaskExecuter.java:52)
12-Jul-2019 13:47:16         at org.gradle.api.internal.tasks.execution.EventFiringTaskExecuter$1.call(EventFiringTaskExecuter.java:49)
12-Jul-2019 13:47:16         at org.gradle.internal.operations.DefaultBuildOperationExecutor$CallableBuildOperationWorker.execute(DefaultBuildOperationExecutor.java:416)
12-Jul-2019 13:47:16         at org.gradle.internal.operations.DefaultBuildOperationExecutor$CallableBuildOperationWorker.execute(DefaultBuildOperationExecutor.java:406)
12-Jul-2019 13:47:16         at org.gradle.internal.operations.DefaultBuildOperationExecutor$1.execute(DefaultBuildOperationExecutor.java:165)
12-Jul-2019 13:47:16         at org.gradle.internal.operations.DefaultBuildOperationExecutor.execute(DefaultBuildOperationExecutor.java:250)
12-Jul-2019 13:47:16         at org.gradle.internal.operations.DefaultBuildOperationExecutor.execute(DefaultBuildOperationExecutor.java:158)
12-Jul-2019 13:47:16         at org.gradle.internal.operations.DefaultBuildOperationExecutor.call(DefaultBuildOperationExecutor.java:102)
12-Jul-2019 13:47:16         at org.gradle.internal.operations.DelegatingBuildOperationExecutor.call(DelegatingBuildOperationExecutor.java:36)
12-Jul-2019 13:47:16         at org.gradle.api.internal.tasks.execution.EventFiringTaskExecuter.execute(EventFiringTaskExecuter.java:49)
12-Jul-2019 13:47:16         at org.gradle.execution.plan.LocalTaskNodeExecutor.execute(LocalTaskNodeExecutor.java:43)
12-Jul-2019 13:47:16         at org.gradle.execution.taskgraph.DefaultTaskExecutionGraph$InvokeNodeExecutorsAction.execute(DefaultTaskExecutionGraph.java:355)
12-Jul-2019 13:47:16         at org.gradle.execution.taskgraph.DefaultTaskExecutionGraph$InvokeNodeExecutorsAction.execute(DefaultTaskExecutionGraph.java:343)
12-Jul-2019 13:47:16         at org.gradle.execution.taskgraph.DefaultTaskExecutionGraph$BuildOperationAwareExecutionAction.execute(DefaultTaskExecutionGraph.java:336)
12-Jul-2019 13:47:16         at org.gradle.execution.taskgraph.DefaultTaskExecutionGraph$BuildOperationAwareExecutionAction.execute(DefaultTaskExecutionGraph.java:322)
12-Jul-2019 13:47:16         at org.gradle.execution.plan.DefaultPlanExecutor$ExecutorWorker$1.execute(DefaultPlanExecutor.java:134)
12-Jul-2019 13:47:16         at org.gradle.execution.plan.DefaultPlanExecutor$ExecutorWorker$1.execute(DefaultPlanExecutor.java:129)
12-Jul-2019 13:47:16         at org.gradle.execution.plan.DefaultPlanExecutor$ExecutorWorker.execute(DefaultPlanExecutor.java:202)
12-Jul-2019 13:47:16         at org.gradle.execution.plan.DefaultPlanExecutor$ExecutorWorker.executeNextNode(DefaultPlanExecutor.java:193)
12-Jul-2019 13:47:16         at org.gradle.execution.plan.DefaultPlanExecutor$ExecutorWorker.run(DefaultPlanExecutor.java:129)
12-Jul-2019 13:47:16         at org.gradle.internal.concurrent.ExecutorPolicy$CatchAndRecordFailures.onExecute(ExecutorPolicy.java:63)
12-Jul-2019 13:47:16         at org.gradle.internal.concurrent.ManagedExecutorImpl$1.run(ManagedExecutorImpl.java:46)
12-Jul-2019 13:47:16         at org.gradle.internal.concurrent.ThreadFactoryImpl$ManagedThreadRunnable.run(ThreadFactoryImpl.java:55)
12-Jul-2019 13:47:16 Caused by: org.gradle.api.GradleException: Checkstyle rule violations were found. See the report at: file:///opt/bamboo-home/xml-data/build-dir/SPR-PUB-JOB1/spring-tx/build/reports/checkstyle/test.html
12-Jul-2019 13:47:16 Checkstyle files with violations: 1
12-Jul-2019 13:47:16 Checkstyle violations by severity: [error:2]
12-Jul-2019 13:47:16
12-Jul-2019 13:47:16         at org.gradle.api.plugins.quality.internal.CheckstyleInvoker$_invoke_closure1.doCall(CheckstyleInvoker.groovy:102)
12-Jul-2019 13:47:16         at org.gradle.util.ClosureBackedAction.execute(ClosureBackedAction.java:70)
12-Jul-2019 13:47:16         at org.gradle.util.ClosureBackedAction.execute(ClosureBackedAction.java:52)
12-Jul-2019 13:47:16         at org.gradle.api.internal.project.antbuilder.DefaultIsolatedAntBuilder$2.execute(DefaultIsolatedAntBuilder.java:152)
12-Jul-2019 13:47:16         at org.gradle.api.internal.project.antbuilder.DefaultIsolatedAntBuilder$2.execute(DefaultIsolatedAntBuilder.java:134)
12-Jul-2019 13:47:16         at org.gradle.api.internal.project.antbuilder.ClassPathToClassLoaderCache.withCachedClassLoader(ClassPathToClassLoaderCache.java:134)
12-Jul-2019 13:47:16         at org.gradle.api.internal.project.antbuilder.DefaultIsolatedAntBuilder.execute(DefaultIsolatedAntBuilder.java:128)
12-Jul-2019 13:47:16         at org.gradle.api.internal.project.IsolatedAntBuilder$execute$0.call(Unknown Source)
12-Jul-2019 13:47:16         at org.gradle.api.plugins.quality.internal.CheckstyleInvoker.invoke(CheckstyleInvoker.groovy:51)
12-Jul-2019 13:47:16         at org.gradle.api.plugins.quality.Checkstyle.run(Checkstyle.java:148)
12-Jul-2019 13:47:16         at org.gradle.internal.reflect.JavaMethod.invoke(JavaMethod.java:103)
12-Jul-2019 13:47:16         at org.gradle.api.internal.project.taskfactory.StandardTaskAction.doExecute(StandardTaskAction.java:48)
12-Jul-2019 13:47:16         at org.gradle.api.internal.project.taskfactory.StandardTaskAction.execute(StandardTaskAction.java:41)
12-Jul-2019 13:47:16         at org.gradle.api.internal.project.taskfactory.StandardTaskAction.execute(StandardTaskAction.java:28)
12-Jul-2019 13:47:16         at org.gradle.api.internal.AbstractTask$TaskActionWrapper.execute(AbstractTask.java:702)
12-Jul-2019 13:47:16         at org.gradle.api.internal.AbstractTask$TaskActionWrapper.execute(AbstractTask.java:669)
12-Jul-2019 13:47:16         at org.gradle.api.internal.tasks.execution.ExecuteActionsTaskExecuter$5.run(ExecuteActionsTaskExecuter.java:401)
12-Jul-2019 13:47:16         at org.gradle.internal.operations.DefaultBuildOperationExecutor$RunnableBuildOperationWorker.execute(DefaultBuildOperationExecutor.java:402)
12-Jul-2019 13:47:16         at org.gradle.internal.operations.DefaultBuildOperationExecutor$RunnableBuildOperationWorker.execute(DefaultBuildOperationExecutor.java:394)
12-Jul-2019 13:47:16         at org.gradle.internal.operations.DefaultBuildOperationExecutor$1.execute(DefaultBuildOperationExecutor.java:165)
12-Jul-2019 13:47:16         at org.gradle.internal.operations.DefaultBuildOperationExecutor.execute(DefaultBuildOperationExecutor.java:250)
12-Jul-2019 13:47:16         at org.gradle.internal.operations.DefaultBuildOperationExecutor.execute(DefaultBuildOperationExecutor.java:158)
12-Jul-2019 13:47:16         at org.gradle.internal.operations.DefaultBuildOperationExecutor.run(DefaultBuildOperationExecutor.java:92)
12-Jul-2019 13:47:16         at org.gradle.internal.operations.DelegatingBuildOperationExecutor.run(DelegatingBuildOperationExecutor.java:31)
12-Jul-2019 13:47:16         at org.gradle.api.internal.tasks.execution.ExecuteActionsTaskExecuter.executeAction(ExecuteActionsTaskExecuter.java:390)
12-Jul-2019 13:47:16         at org.gradle.api.internal.tasks.execution.ExecuteActionsTaskExecuter.executeActions(ExecuteActionsTaskExecuter.java:373)
12-Jul-2019 13:47:16         at org.gradle.api.internal.tasks.execution.ExecuteActionsTaskExecuter.access$200(ExecuteActionsTaskExecuter.java:79)
12-Jul-2019 13:47:16         at org.gradle.api.internal.tasks.execution.ExecuteActionsTaskExecuter$TaskExecution.execute(ExecuteActionsTaskExecuter.java:210)
12-Jul-2019 13:47:16         at org.gradle.internal.execution.steps.ExecuteStep.lambda$execute$1(ExecuteStep.java:33)
12-Jul-2019 13:47:16         at org.gradle.internal.execution.steps.ExecuteStep.execute(ExecuteStep.java:33)
12-Jul-2019 13:47:16         at org.gradle.internal.execution.steps.ExecuteStep.execute(ExecuteStep.java:26)
12-Jul-2019 13:47:16         at org.gradle.internal.execution.steps.CleanupOutputsStep.execute(CleanupOutputsStep.java:58)
12-Jul-2019 13:47:16         at org.gradle.internal.execution.steps.CleanupOutputsStep.execute(CleanupOutputsStep.java:35)
12-Jul-2019 13:47:16         at org.gradle.internal.execution.steps.ResolveInputChangesStep.execute(ResolveInputChangesStep.java:48)
12-Jul-2019 13:47:16         at org.gradle.internal.execution.steps.ResolveInputChangesStep.execute(ResolveInputChangesStep.java:33)
12-Jul-2019 13:47:16         at org.gradle.internal.execution.steps.CancelExecutionStep.execute(CancelExecutionStep.java:39)
12-Jul-2019 13:47:16         at org.gradle.internal.execution.steps.TimeoutStep.executeWithoutTimeout(TimeoutStep.java:73)
12-Jul-2019 13:47:16         at org.gradle.internal.execution.steps.TimeoutStep.execute(TimeoutStep.java:54)
12-Jul-2019 13:47:16         at org.gradle.internal.execution.steps.CatchExceptionStep.execute(CatchExceptionStep.java:35)
12-Jul-2019 13:47:16         at org.gradle.internal.execution.steps.CreateOutputsStep.execute(CreateOutputsStep.java:51)
12-Jul-2019 13:47:16         at org.gradle.internal.execution.steps.SnapshotOutputsStep.execute(SnapshotOutputsStep.java:45)
12-Jul-2019 13:47:16         at org.gradle.internal.execution.steps.SnapshotOutputsStep.execute(SnapshotOutputsStep.java:31)
12-Jul-2019 13:47:16         at org.gradle.internal.execution.steps.CacheStep.executeWithoutCache(CacheStep.java:201)
12-Jul-2019 13:47:16         at org.gradle.internal.execution.steps.CacheStep.execute(CacheStep.java:70)
12-Jul-2019 13:47:16         at org.gradle.internal.execution.steps.CacheStep.execute(CacheStep.java:45)
12-Jul-2019 13:47:16         at org.gradle.internal.execution.steps.BroadcastChangingOutputsStep.execute(BroadcastChangingOutputsStep.java:49)
12-Jul-2019 13:47:16         at org.gradle.internal.execution.steps.StoreSnapshotsStep.execute(StoreSnapshotsStep.java:43)
12-Jul-2019 13:47:16         at org.gradle.internal.execution.steps.StoreSnapshotsStep.execute(StoreSnapshotsStep.java:32)
12-Jul-2019 13:47:16         at org.gradle.internal.execution.steps.RecordOutputsStep.execute(RecordOutputsStep.java:38)
12-Jul-2019 13:47:16         at org.gradle.internal.execution.steps.RecordOutputsStep.execute(RecordOutputsStep.java:24)
12-Jul-2019 13:47:16         at org.gradle.internal.execution.steps.SkipUpToDateStep.executeBecause(SkipUpToDateStep.java:96)
12-Jul-2019 13:47:16         at org.gradle.internal.execution.steps.SkipUpToDateStep.lambda$execute$0(SkipUpToDateStep.java:89)
12-Jul-2019 13:47:16         at org.gradle.internal.execution.steps.SkipUpToDateStep.execute(SkipUpToDateStep.java:54)
12-Jul-2019 13:47:16         at org.gradle.internal.execution.steps.SkipUpToDateStep.execute(SkipUpToDateStep.java:38)
12-Jul-2019 13:47:16         at org.gradle.internal.execution.steps.ResolveChangesStep.execute(ResolveChangesStep.java:77)
12-Jul-2019 13:47:16         at org.gradle.internal.execution.steps.ResolveChangesStep.execute(ResolveChangesStep.java:37)
12-Jul-2019 13:47:16         at org.gradle.internal.execution.steps.legacy.MarkSnapshottingInputsFinishedStep.execute(MarkSnapshottingInputsFinishedStep.java:36)
12-Jul-2019 13:47:16         at org.gradle.internal.execution.steps.legacy.MarkSnapshottingInputsFinishedStep.execute(MarkSnapshottingInputsFinishedStep.java:26)
12-Jul-2019 13:47:16         at org.gradle.internal.execution.steps.ResolveCachingStateStep.execute(ResolveCachingStateStep.java:90)
12-Jul-2019 13:47:16         at org.gradle.internal.execution.steps.ResolveCachingStateStep.execute(ResolveCachingStateStep.java:48)
12-Jul-2019 13:47:16         at org.gradle.internal.execution.impl.DefaultWorkExecutor.execute(DefaultWorkExecutor.java:33)
12-Jul-2019 13:47:16         at org.gradle.api.internal.tasks.execution.ExecuteActionsTaskExecuter.execute(ExecuteActionsTaskExecuter.java:117)
12-Jul-2019 13:47:16         ... 35 more
12-Jul-2019 13:47:16
12-Jul-2019 13:47:16
12-Jul-2019 13:47:16 * Get more help at https://help.gradle.org
12-Jul-2019 13:47:16
12-Jul-2019 13:47:16 BUILD FAILED in 7m 22s
12-Jul-2019 13:47:16
12-Jul-2019 13:47:16 Deprecated Gradle features were used in this build, making it incompatible with Gradle 6.0.
12-Jul-2019 13:47:16 Use '--warning-mode all' to show the individual deprecation warnings.
12-Jul-2019 13:47:16 See https://docs.gradle.org/5.5.1/userguide/command_line_interface.html#sec:command_line_warnings
12-Jul-2019 13:47:16 243 actionable tasks: 219 executed, 24 up-to-date
12-Jul-2019 13:47:17
12-Jul-2019 13:47:17 Failing task since return code of [./gradlew --refresh-dependencies --no-daemon -PtestGroups=ci -P BRANCH_NAME=master --stacktrace clean check build -I /tmp/artifactory.init.script4285692524188876493gradle -DbuildInfoConfig.propertiesFile=/tmp/buildinfo5704799423220033749properties artifactoryPublish -Dartifactory.resolve.password=******** -Dartifactory.publish.password=********] was 1 while expected 0
12-Jul-2019 13:47:17 Parsing test results under /opt/bamboo-home/xml-data/build-dir/SPR-PUB-JOB1...
12-Jul-2019 13:47:18 Finished task 'Artifactory Gradle' with result: Failed
12-Jul-2019 13:47:18 Running post build plugin 'Docker Container Cleanup'
12-Jul-2019 13:47:18 Running post build plugin 'NCover Results Collector'
12-Jul-2019 13:47:18 Running post build plugin 'Artifactory Release Management Staging'
12-Jul-2019 13:47:18 Running post build plugin 'Artifactory Build Info Copier'
12-Jul-2019 13:47:18 Running post build plugin 'Artifactory Gradle Properties Info Copier'
12-Jul-2019 13:47:18 Running post build plugin 'Clover Results Collector'
12-Jul-2019 13:47:18 Running post build plugin 'npm Cache Cleanup'
12-Jul-2019 13:47:18 Running post build plugin 'Artifact Copier'
12-Jul-2019 13:47:19 Successfully removed working directory at '/opt/bamboo-home/xml-data/build-dir/SPR-PUB-JOB1'
12-Jul-2019 13:47:19 Finalising the build...
12-Jul-2019 13:47:19 Stopping timer.
12-Jul-2019 13:47:19 Build SPR-PUB-JOB1-7594 completed.
12-Jul-2019 13:47:19 Running on server: post build plugin 'NCover Results Collector'
12-Jul-2019 13:47:19 Running on server: post build plugin 'Build Hanging Detection Configuration'
12-Jul-2019 13:47:19 Running on server: post build plugin 'Clover Delta Calculator'
12-Jul-2019 13:47:19 Running on server: post build plugin 'Maven Dependencies Postprocessor'
12-Jul-2019 13:47:19 All post build plugins have finished
12-Jul-2019 13:47:19 Generating build results summary...
12-Jul-2019 13:47:34 Saving build results to disk...
12-Jul-2019 13:47:34 Logging substituted variables...
12-Jul-2019 13:47:35 Indexing build results...
12-Jul-2019 13:47:35 Finished building SPR-PUB-JOB1-7594.