Build #7,854

Build: #7854 failed

Job: Default Job failed

Stages & jobs

  1. Default Stage

Build log

The build generated 506 lines of output. Download or view full build log

04-Sep-2019 08:12:58 Build Spring Framework - Publication - Default Job #7854 (SPR-PUB-JOB1-7854) started building on agent bamboo-22.af.pivotal.io
04-Sep-2019 08:12:58 Remote agent on host bamboo-22.af.pivotal.io
04-Sep-2019 08:12:59 Build working directory is /opt/bamboo-home/xml-data/build-dir/SPR-PUB-JOB1
04-Sep-2019 08:12:59 Executing build Spring Framework - Publication - Default Job #7854 (SPR-PUB-JOB1-7854)
04-Sep-2019 08:12:59 Starting task 'Checkout Default Repository' of type 'com.atlassian.bamboo.plugins.vcs:task.vcs.checkout'
04-Sep-2019 08:12:59 Build always requires a clean checkout
04-Sep-2019 08:12:59 Cleaning build directory '/opt/bamboo-home/xml-data/build-dir/SPR-PUB-JOB1'
04-Sep-2019 08:12:59 Checking out into /opt/bamboo-home/xml-data/build-dir/SPR-PUB-JOB1
04-Sep-2019 08:12:59 Updating source code to revision: 57d9b92b9483cc31c54ad463cbb3bbeee5fb2490
04-Sep-2019 08:12:59 Creating local git repository in '/opt/bamboo-home/xml-data/build-dir/SPR-PUB-JOB1/.git'.
04-Sep-2019 08:12:59 Initialized empty Git repository in /opt/bamboo-home/xml-data/build-dir/SPR-PUB-JOB1/.git/
04-Sep-2019 08:13:01 Fetching 'refs/heads/master' from 'https://github.com/spring-projects/spring-framework.git'.
04-Sep-2019 08:13:21 From https://github.com/spring-projects/spring-framework
04-Sep-2019 08:13:21 * [new branch]      master     -> master
04-Sep-2019 08:13:21 * [new tag]               v3.1.0.RELEASE -> v3.1.0.RELEASE
04-Sep-2019 08:13:21 * [new tag]               v3.2.0.M1      -> v3.2.0.M1
04-Sep-2019 08:13:21 * [new tag]               v3.2.0.M2      -> v3.2.0.M2
04-Sep-2019 08:13:21 * [new tag]               v3.2.0.RC1     -> v3.2.0.RC1
04-Sep-2019 08:13:21 * [new tag]               v3.2.0.RC2-A   -> v3.2.0.RC2-A
04-Sep-2019 08:13:21 * [new tag]               v3.2.0.RELEASE -> v3.2.0.RELEASE
04-Sep-2019 08:13:21 * [new tag]               v3.2.1.RELEASE -> v3.2.1.RELEASE
04-Sep-2019 08:13:21 * [new tag]               v3.2.2.RELEASE -> v3.2.2.RELEASE
04-Sep-2019 08:13:21 * [new tag]               v4.0.0.M1      -> v4.0.0.M1
04-Sep-2019 08:13:21 * [new tag]               v4.0.0.M2      -> v4.0.0.M2
04-Sep-2019 08:13:21 * [new tag]               v4.0.0.M3      -> v4.0.0.M3
04-Sep-2019 08:13:21 * [new tag]               v4.0.0.RC1     -> v4.0.0.RC1
04-Sep-2019 08:13:21 * [new tag]               v4.0.0.RC2     -> v4.0.0.RC2
04-Sep-2019 08:13:21 Checking out revision 57d9b92b9483cc31c54ad463cbb3bbeee5fb2490.
04-Sep-2019 08:13:22 Already on 'master'
04-Sep-2019 08:13:22 Updated source code to revision: 57d9b92b9483cc31c54ad463cbb3bbeee5fb2490
04-Sep-2019 08:13:22 Finished task 'Checkout Default Repository' with result: Success
04-Sep-2019 08:13:22 Running pre-build action: Artifactory Release Staging
04-Sep-2019 08:13:22 Running pre-build action: VCS Version Collector
04-Sep-2019 08:13:22
Substituting variable: ${bamboo.spr.jdk.home} with /opt/jdk-8
04-Sep-2019 08:13:22
Substituting variable: ${bamboo.repository.branch.name} with master
04-Sep-2019 08:13:22 Starting task 'Artifactory Gradle' of type 'org.jfrog.bamboo.bamboo-artifactory-plugin:artifactoryGradleTask'
04-Sep-2019 08:13:22 Bamboo Artifactory Plugin version: 2.6.3
04-Sep-2019 08:13:22
Beginning to execute external process for build 'Spring Framework - Publication - Default Job #7854 (SPR-PUB-JOB1-7854)'
... running command line:
./gradlew --refresh-dependencies --no-daemon -PtestGroups=ci -P BRANCH_NAME=master --stacktrace clean check build -DbuildInfoConfig.propertiesFile=/tmp/buildinfo1493097195724336751properties artifactoryPublish -Dartifactory.resolve.password=******** -Dartifactory.publish.password=********
... in: /opt/bamboo-home/xml-data/build-dir/SPR-PUB-JOB1
... using extra environment variables:
bamboo_planRepository_1_branch=master
bamboo_********_username_password=********
bamboo_signing_store_password=********
bamboo_planRepository_2_branch=master
bamboo_capability_system_builder_ant_Ant_1_9=/opt/ant-1.9
bamboo_repository_137199621_git_repositoryUrl=https://github.com/spring-projects/spring-framework.git
bamboo_capability_system_builder_ant_Ant_1_8=/opt/ant-1.8
bamboo_planRepository_1_branchDisplayName=master
bamboo_artifactory_override_resolve_repo=libs-milestone
bamboo_capability_system_builder_node_Node_js_10_16=/opt/node-10.16/bin/node
bamboo_repository_revision_number=57d9b92b9483cc31c54ad463cbb3bbeee5fb2490
bamboo_repository_262406229_git_repositoryUrl=https://github.com/spring-projects/spring-framework.git
bamboo_artifactory_task_override_jdk=true
bamboo_RIAK_BIN=/usr/sbin/riak
WRAPPER_BITS=32
bamboo_buildKey=SPR-PUB-JOB1
bamboo_repository_137199621_name=Plan Repository
bamboo_spr_jdk_home=/opt/jdk-8
bamboo_bintray_password=********
bamboo_sonar_token_password=********
PWD=/opt/bamboo-home/bin
bamboo_planRepository_2_branchDisplayName=master
bamboo_shortJobName=Default Job
bamboo_artifactory_override_resolver_password=********
bamboo_sonatype_token=RSJChaox
bamboo_capability_system_builder_gradle___gradlew=./gradlew
bamboo_buildResultsUrl=https://build.spring.io/browse/SPR-PUB-JOB1-7854
bamboo_capability_system_builder_mvn3_Maven_3_3=/opt/maven-3.3
bamboo_capability_system_builder_mvn3_Maven_3_2=/opt/maven-3.2
bamboo_capability_system_builder_mvn3_Maven_3_1=/opt/maven-3.1
bamboo_planRepository_repositoryUrl=https://github.com/spring-projects/spring-framework.git
bamboo_capability_system_builder_mvn3_Maven_3_6=/opt/maven-3.6
bamboo_agentId=286195714
bamboo_capability_system_builder_mvn3_Maven_3_5=/opt/maven-3.5
bamboo_capability_system_builder_mvn3_Maven_3_0=/opt/maven-3.0
bamboo_planRepository_revision=57d9b92b9483cc31c54ad463cbb3bbeee5fb2490
bamboo_planRepository_previousRevision=57d9b92b9483cc31c54ad463cbb3bbeee5fb2490
bamboo_repository_137199621_revision_number=57d9b92b9483cc31c54ad463cbb3bbeee5fb2490
bamboo_capability_remote_build=true
bamboo_repository_branch_name=master
bamboo_sonatype_token_password=********
bamboo_sonatype_user=springsource
SHLVL=1
bamboo_org_jfrog_bamboo_buildInfo_serverUrl=https://repo.spring.io
bamboo_scdf_acceptance_tests_password=********
bamboo_repository_262406229_branch_name=master
WRAPPER_OS=linux
JAVA_HOME=/opt/jdk-8/
bamboo_dependenciesDisabled=false
TERM=linux
XDG_SESSION_ID=c1
bamboo_planRepository_branch=master
bamboo_org_jfrog_bamboo_release_activated=false
bamboo_planRepository_1_type=gitv2
bamboo_planRepository_branchName=master
bamboo_repository_137199621_git_username=spring-buildmaster
bamboo_capability_system_jdk_JDK_12=/opt/jdk-12
WRAPPER_FILE_SEPARATOR=/
_=/opt/bamboo-home/bin/bamboo-agent.sh
bamboo_capability_system_builder_gradlew_gradlew=./
bamboo_repository_262406229_revision_number=57d9b92b9483cc31c54ad463cbb3bbeee5fb2490
bamboo_capability_system_builder_ant_Ant_1_10=/opt/ant-1.10
WRAPPER_PATH_SEPARATOR=:
bamboo_sonar_password=********
bamboo_hg_cache_directory=/opt/bamboo-home/xml-data/build-dir/_hg-repositories-cache
bamboo_planRepository_1_username=spring-buildmaster
bamboo_planRepository_type=gitv2
bamboo_repository_262406229_git_branch=master
bamboo_ManualBuildTriggerReason_userName=rstoyanchev
bamboo_git_cache_directory=/opt/bamboo-home/xml-data/build-dir/_git-repositories-cache
bamboo_planRepository_2_branchName=master
bamboo_artifactory_username=buildmaster
bamboo_tmp_directory=/opt/bamboo-home/temp
bamboo_planKey=SPR-PUB
bamboo_planRepository_username=spring-buildmaster
bamboo_JDK8_HOME=/opt/jdk-8
bamboo_snifftask=sniff
bamboo_planRepository_1_branchName=master
bamboo_sonar_version=5.6.3
bamboo_sonar_jdbc_password=********
bamboo_bintray_api_key_password=********
GRADLE_OPTS=-XX:MaxMetaspaceSize=1024m -Xmx1024m
bamboo_repository_262406229_git_username=spring-buildmaster
XDG_DATA_DIRS=/usr/local/share:/usr/share:/var/lib/snapd/desktop
bamboo_capability_system_jdk_JDK_1_11=/opt/jdk-11
bamboo_resultsUrl=https://build.spring.io/browse/SPR-PUB-JOB1-7854
bamboo_capability_system_jdk_JDK_1_10=/opt/jdk-10
bamboo_build_working_directory=/opt/bamboo-home/xml-data/build-dir/SPR-PUB-JOB1
bamboo_planRepository_1_name=Spring Framework
bamboo_capability_system_os=ubuntu1804
bamboo_nexusPush_stagingProfile=buildmaster
bamboo_shortPlanName=Publication
MAIL=/var/mail/bamboo
bamboo_planRepository_2_username=spring-buildmaster
bamboo_repository_137199621_branch_name=master
bamboo_planRepository_name=Spring Framework
LOGNAME=bamboo
bamboo_buildNumber=7854
bamboo_repository_137199621_git_branch=master
SHELL=/bin/bash
bamboo_planName=Spring Framework - Publication
bamboo_JDK7_HOME=/opt/jdk-7
bamboo_repository_137199621_previous_revision_number=57d9b92b9483cc31c54ad463cbb3bbeee5fb2490
bamboo_shortPlanKey=PUB
OLDPWD=/opt/users/bamboo
bamboo_shortJobKey=JOB1
bamboo_artifactory_password=********
bamboo_repository_262406229_name=Spring Framework
bamboo_planRepository_2_name=Plan Repository
bamboo_repository_262406229_previous_revision_number=57d9b92b9483cc31c54ad463cbb3bbeee5fb2490
bamboo_buildTimeStamp=2019-09-04T08:12:58.846Z
bamboo_repository_previous_revision_number=57d9b92b9483cc31c54ad463cbb3bbeee5fb2490
bamboo_sonar_username=buildmaster
bamboo_********_password=********
bamboo_repository_git_branch=master
bamboo_buildResultKey=SPR-PUB-JOB1-7854
bamboo_nexusPush_close=true
bamboo_artifactory_override_resolver_username=buildmaster
bamboo_buildPlanName=Spring Framework - Publication - Default Job
bamboo_planRepository_1_revision=57d9b92b9483cc31c54ad463cbb3bbeee5fb2490
bamboo_repository_name=Plan Repository
bamboo_signing_key_password=********
bamboo_planRepository_2_previousRevision=57d9b92b9483cc31c54ad463cbb3bbeee5fb2490
bamboo_capability_system_builder_groovy_Groovy_2_5=/opt/groovy-2.5
LANG=en_US.UTF-8
bamboo_buildFailed=false
bamboo_capability_system_docker_executable=/usr/bin/docker
DISPLAY=localhost:1.0
bamboo_capability_system_jdk_OpenJDK_7=/opt/jdk-7
bamboo_capability_system_builder_groovy_Groovy_2_4=/opt/groovy-2.4
bamboo_artifactory_override_deployer_username=buildmaster
bamboo_artifactory_password_mask_b=********
bamboo_capability_system_builder_command_Bash=/bin/bash
bamboo_artifactory_password_mask_a=********
bamboo_agentWorkingDirectory=/opt/bamboo-home/xml-data/build-dir
bamboo_planRepository_2_revision=57d9b92b9483cc31c54ad463cbb3bbeee5fb2490
bamboo_capability_system_git_executable=/usr/bin/git
bamboo_repository_git_username=spring-buildmaster
bamboo_planRepository_1_previousRevision=57d9b92b9483cc31c54ad463cbb3bbeee5fb2490
bamboo_capability_os_family=unix
bamboo_planRepository_branchDisplayName=master
bamboo_capability_system_builder_maven_Artifactory_Maven_3_6=/opt/maven-3.6
bamboo_capability_system_builder_maven_Artifactory_Maven_3_5=/opt/maven-3.5
GIT_SSL_NO_VERIFY=true
bamboo_capability_system_builder_maven_Artifactory_Maven_3_3=/opt/maven-3.3
bamboo_planRepository_2_type=gitv2
bamboo_capability_system_builder_maven_Artifactory_Maven_3_2=/opt/maven-3.2
bamboo_s3_properties=/home/bamboo/tools/s3.properties
bamboo_capability_system_builder_maven_Artifactory_Maven_3_1=/opt/maven-3.1
bamboo_artifactory_override_deploy_repo=libs-snapshot-local
bamboo_capability_system_builder_maven_Artifactory_Maven_3_0=/opt/maven-3.0
bamboo_plan_storageTag=SPR-PUB
bamboo_bintray_username_password=********
bamboo_planRepository_2_repositoryUrl=https://github.com/spring-projects/spring-framework.git
USER=bamboo
bamboo_repository_git_repositoryUrl=https://github.com/spring-projects/spring-framework.git
bamboo_working_directory=/opt/bamboo-home/xml-data/build-dir/SPR-PUB-JOB1
bamboo_org_jfrog_bamboo_buildInfo_activated=true
bamboo_planRepository_1_repositoryUrl=https://github.com/spring-projects/spring-framework.git
bamboo_capability_system_jdk_JDK_1_8=/opt/jdk-8
bamboo_artifactory_override_deployer_password=********
bamboo_capability_system_jdk_JDK_1_9=/opt/jdk-9
WRAPPER_ARCH=x86
bamboo_capability_system_jdk_JDK_1_6=/opt/jdk-6
bamboo_sonatype_password=********
bamboo_capability_system_jdk_JDK_1_7=/opt/jdk-7
bamboo_sonar_ip=10.194.6.9
XDG_RUNTIME_DIR=/run/user/1002
HOME=/home/bamboo
PATH=/bin:/home/bamboo/bin:/usr/local/sbin:/usr/local/bin:/usr/sbin:/usr/bin:/sbin:/bin:/usr/games:/usr/local/games:/snap/bin:/home/bamboo/bin:/usr/local/bin:/bin:/home/bamboo/bin:/usr/local/sbin:/usr/local/bin:/usr/sbin:/usr/bin:/sbin:/bin:/usr/games:/usr/local/games:/snap/bin:/home/bamboo/bin:/usr/local/bin
04-Sep-2019 08:13:27 > Task :buildSrc:compileJava
04-Sep-2019 08:13:27 > Task :buildSrc:compileGroovy NO-SOURCE
04-Sep-2019 08:13:27 > Task :buildSrc:pluginDescriptors
04-Sep-2019 08:13:27 > Task :buildSrc:processResources
04-Sep-2019 08:13:27 > Task :buildSrc:classes
04-Sep-2019 08:13:27 > Task :buildSrc:jar
04-Sep-2019 08:13:27 > Task :buildSrc:assemble
04-Sep-2019 08:13:27 > Task :buildSrc:pluginUnderTestMetadata
04-Sep-2019 08:13:27 > Task :buildSrc:compileTestJava NO-SOURCE
04-Sep-2019 08:13:27 > Task :buildSrc:compileTestGroovy NO-SOURCE
04-Sep-2019 08:13:27 > Task :buildSrc:processTestResources NO-SOURCE
04-Sep-2019 08:13:27 > Task :buildSrc:testClasses UP-TO-DATE
04-Sep-2019 08:13:27 > Task :buildSrc:test NO-SOURCE
04-Sep-2019 08:13:28 > Task :buildSrc:validateTaskProperties
04-Sep-2019 08:13:28 > Task :buildSrc:check
04-Sep-2019 08:13:28 > Task :buildSrc:build
04-Sep-2019 08:13:59 > Task :clean UP-TO-DATE
04-Sep-2019 08:13:59 > Task :framework-bom:clean UP-TO-DATE
04-Sep-2019 08:13:59 > Task :integration-tests:clean UP-TO-DATE
04-Sep-2019 08:13:59 > Task :kotlin-coroutines:clean UP-TO-DATE
04-Sep-2019 08:13:59 > Task :spring-aop:clean UP-TO-DATE
04-Sep-2019 08:13:59 > Task :spring-aspects:clean UP-TO-DATE
04-Sep-2019 08:13:59 > Task :spring-beans:clean UP-TO-DATE
04-Sep-2019 08:13:59 > Task :spring-context:clean UP-TO-DATE
04-Sep-2019 08:13:59 > Task :spring-context-indexer:clean UP-TO-DATE
04-Sep-2019 08:13:59 > Task :spring-context-support:clean UP-TO-DATE
04-Sep-2019 08:13:59 > Task :spring-core:clean UP-TO-DATE
04-Sep-2019 08:13:59 > Task :spring-expression:clean UP-TO-DATE
04-Sep-2019 08:13:59 > Task :spring-instrument:clean UP-TO-DATE
04-Sep-2019 08:13:59 > Task :spring-jcl:clean UP-TO-DATE
04-Sep-2019 08:13:59 > Task :spring-jdbc:clean UP-TO-DATE
04-Sep-2019 08:13:59 > Task :spring-jms:clean UP-TO-DATE
04-Sep-2019 08:13:59 > Task :spring-messaging:clean UP-TO-DATE
04-Sep-2019 08:13:59 > Task :spring-orm:clean UP-TO-DATE
04-Sep-2019 08:13:59 > Task :spring-oxm:clean UP-TO-DATE
04-Sep-2019 08:13:59 > Task :spring-test:clean UP-TO-DATE
04-Sep-2019 08:13:59 > Task :spring-tx:clean UP-TO-DATE
04-Sep-2019 08:13:59 > Task :spring-web:clean UP-TO-DATE
04-Sep-2019 08:13:59 > Task :spring-webflux:clean UP-TO-DATE
04-Sep-2019 08:13:59 > Task :spring-webmvc:clean UP-TO-DATE
04-Sep-2019 08:13:59 > Task :spring-websocket:clean UP-TO-DATE
04-Sep-2019 08:13:59 > Task :compileKotlin NO-SOURCE
04-Sep-2019 08:13:59 > Task :compileJava NO-SOURCE
04-Sep-2019 08:13:59 > Task :compileGroovy NO-SOURCE
04-Sep-2019 08:13:59 > Task :processResources NO-SOURCE
04-Sep-2019 08:13:59 > Task :classes UP-TO-DATE
04-Sep-2019 08:13:59 > Task :checkstyleMain NO-SOURCE
04-Sep-2019 08:14:05 > Task :checkstyleNohttp
04-Sep-2019 08:14:05 > Task :compileTestKotlin NO-SOURCE
04-Sep-2019 08:14:05 > Task :compileTestJava NO-SOURCE
04-Sep-2019 08:14:05 > Task :compileTestGroovy NO-SOURCE
04-Sep-2019 08:14:05 > Task :processTestResources NO-SOURCE
04-Sep-2019 08:14:05 > Task :testClasses UP-TO-DATE
04-Sep-2019 08:14:05 > Task :checkstyleTest NO-SOURCE
04-Sep-2019 08:14:05 > Task :test NO-SOURCE
04-Sep-2019 08:14:05 > Task :check
04-Sep-2019 08:14:05 > Task :framework-bom:check UP-TO-DATE
04-Sep-2019 08:14:05 > Task :integration-tests:compileJava NO-SOURCE
04-Sep-2019 08:14:05 > Task :integration-tests:processResources NO-SOURCE
04-Sep-2019 08:14:05 > Task :integration-tests:classes UP-TO-DATE
04-Sep-2019 08:14:05 > Task :integration-tests:checkstyleMain NO-SOURCE
04-Sep-2019 08:14:06 > Task :spring-core:cglibRepackJar
04-Sep-2019 08:14:11 > Task :kotlin-coroutines:compileKotlin
04-Sep-2019 08:14:11 > Task :kotlin-coroutines:compileJava NO-SOURCE
04-Sep-2019 08:14:11 > Task :kotlin-coroutines:processResources NO-SOURCE
04-Sep-2019 08:14:11 > Task :kotlin-coroutines:classes UP-TO-DATE
04-Sep-2019 08:14:11 > Task :kotlin-coroutines:inspectClassesForKotlinIC
04-Sep-2019 08:14:11 > Task :kotlin-coroutines:jar
04-Sep-2019 08:14:11 > Task :spring-core:objenesisRepackJar
04-Sep-2019 08:14:12 > Task :spring-jcl:compileJava
04-Sep-2019 08:14:12 > Task :spring-jcl:processResources
04-Sep-2019 08:14:12 > Task :spring-jcl:classes
04-Sep-2019 08:14:12 > Task :spring-jcl:jar
04-Sep-2019 08:14:13 > Task :spring-core:compileKotlin
04-Sep-2019 08:14:15 > Task :spring-core:compileJava
04-Sep-2019 08:14:15 > Task :spring-core:processResources NO-SOURCE
04-Sep-2019 08:14:15 > Task :spring-core:classes
04-Sep-2019 08:14:15 > Task :spring-core:inspectClassesForKotlinIC
04-Sep-2019 08:14:16 > Task :spring-core:jar
04-Sep-2019 08:14:19 > Task :spring-beans:compileGroovy
04-Sep-2019 08:14:20 > Task :spring-beans:compileKotlin
04-Sep-2019 08:14:20 > Task :spring-beans:compileJava NO-SOURCE
04-Sep-2019 08:14:20 > Task :spring-beans:processResources
04-Sep-2019 08:14:20 > Task :spring-beans:classes
04-Sep-2019 08:14:20 > Task :spring-beans:inspectClassesForKotlinIC
04-Sep-2019 08:14:20 > Task :spring-beans:jar
04-Sep-2019 08:14:21 > Task :spring-aop:compileJava
04-Sep-2019 08:14:21 > Task :spring-aop:processResources
04-Sep-2019 08:14:21 > Task :spring-aop:classes
04-Sep-2019 08:14:21 > Task :spring-aop:jar
04-Sep-2019 08:14:21 > Task :kotlin-coroutines:compileTestKotlin NO-SOURCE
04-Sep-2019 08:14:21 > Task :kotlin-coroutines:compileTestJava NO-SOURCE
04-Sep-2019 08:14:21 > Task :kotlin-coroutines:processTestResources NO-SOURCE
04-Sep-2019 08:14:21 > Task :kotlin-coroutines:testClasses UP-TO-DATE
04-Sep-2019 08:14:21 > Task :spring-jcl:compileTestJava NO-SOURCE
04-Sep-2019 08:14:21 > Task :spring-jcl:processTestResources NO-SOURCE
04-Sep-2019 08:14:21 > Task :spring-jcl:testClasses UP-TO-DATE
04-Sep-2019 08:14:25 > Task :spring-core:compileTestKotlin
04-Sep-2019 08:14:30
04-Sep-2019 08:14:30 > Task :spring-core:compileTestJava
04-Sep-2019 08:14:30 Note: Some input files use or override a deprecated API.
04-Sep-2019 08:14:30 Note: Recompile with -Xlint:deprecation for details.
04-Sep-2019 08:14:31
04-Sep-2019 08:14:31 > Task :spring-core:processTestResources
04-Sep-2019 08:14:31 > Task :spring-core:testClasses
04-Sep-2019 08:14:32 > Task :spring-beans:compileTestKotlin
04-Sep-2019 08:14:35
04-Sep-2019 08:14:35 > Task :spring-beans:compileTestJava
04-Sep-2019 08:14:35 Note: Some input files use unchecked or unsafe operations.
04-Sep-2019 08:14:35 Note: Recompile with -Xlint:unchecked for details.
04-Sep-2019 08:14:35
04-Sep-2019 08:14:35 > Task :spring-beans:compileTestGroovy NO-SOURCE
04-Sep-2019 08:14:35 > Task :spring-beans:processTestResources
04-Sep-2019 08:14:35 > Task :spring-beans:testClasses
04-Sep-2019 08:14:36 > Task :spring-aop:compileTestJava
04-Sep-2019 08:14:36 > Task :spring-aop:processTestResources
04-Sep-2019 08:14:36 > Task :spring-aop:testClasses
04-Sep-2019 08:14:36 > Task :spring-expression:compileJava
04-Sep-2019 08:14:36 > Task :spring-expression:processResources
04-Sep-2019 08:14:36 > Task :spring-expression:classes
04-Sep-2019 08:14:36 > Task :spring-expression:jar
04-Sep-2019 08:14:36 > Task :spring-instrument:compileJava
04-Sep-2019 08:14:36 > Task :spring-instrument:processResources NO-SOURCE
04-Sep-2019 08:14:36 > Task :spring-instrument:classes
04-Sep-2019 08:14:36 > Task :spring-instrument:jar
04-Sep-2019 08:14:41 > Task :spring-context:compileKotlin
04-Sep-2019 08:14:42 > Task :spring-context:compileJava
04-Sep-2019 08:14:42 > Task :spring-context:compileGroovy NO-SOURCE
04-Sep-2019 08:14:42 > Task :spring-context:processResources
04-Sep-2019 08:14:42 > Task :spring-context:classes
04-Sep-2019 08:14:46 > Task :spring-expression:compileTestJava
04-Sep-2019 08:14:46 > Task :spring-expression:processTestResources
04-Sep-2019 08:14:46 > Task :spring-expression:testClasses
04-Sep-2019 08:14:46 > Task :spring-instrument:compileTestJava NO-SOURCE
04-Sep-2019 08:14:46 > Task :spring-instrument:processTestResources
04-Sep-2019 08:14:46 > Task :spring-instrument:testClasses
04-Sep-2019 08:14:48 > Task :spring-context:compileTestKotlin
04-Sep-2019 08:14:48 > Task :spring-context:inspectClassesForKotlinIC
04-Sep-2019 08:14:48 > Task :spring-context:jar
04-Sep-2019 08:14:52
04-Sep-2019 08:14:52 > Task :spring-context:compileTestJava
04-Sep-2019 08:14:52 Note: Some input files use or override a deprecated API.
04-Sep-2019 08:14:52 Note: Recompile with -Xlint:deprecation for details.
04-Sep-2019 08:14:52 Note: Some input files use unchecked or unsafe operations.
04-Sep-2019 08:14:52 Note: Recompile with -Xlint:unchecked for details.
04-Sep-2019 08:14:53
04-Sep-2019 08:14:53 > Task :spring-context:compileTestGroovy
04-Sep-2019 08:14:53 > Task :spring-context:processTestResources
04-Sep-2019 08:14:53 > Task :spring-context:testClasses
04-Sep-2019 08:14:54 > Task :spring-tx:compileKotlin
04-Sep-2019 08:14:54 > Task :spring-tx:compileJava
04-Sep-2019 08:14:54 > Task :spring-tx:processResources
04-Sep-2019 08:14:54 > Task :spring-tx:classes
04-Sep-2019 08:14:54 > Task :spring-tx:inspectClassesForKotlinIC
04-Sep-2019 08:14:55 > Task :spring-tx:jar
04-Sep-2019 08:14:55 > Task :spring-jdbc:compileKotlin
04-Sep-2019 08:14:56 > Task :spring-jdbc:compileJava
04-Sep-2019 08:14:56 > Task :spring-jdbc:processResources
04-Sep-2019 08:14:56 > Task :spring-jdbc:classes
04-Sep-2019 08:14:56 > Task :spring-tx:compileTestKotlin
04-Sep-2019 08:15:14 > Task :spring-tx:compileTestJava
04-Sep-2019 08:15:14 > Task :spring-tx:processTestResources
04-Sep-2019 08:15:14 > Task :spring-tx:testClasses
04-Sep-2019 08:15:15 > Task :spring-jdbc:compileTestKotlin
04-Sep-2019 08:15:15 > Task :spring-jdbc:inspectClassesForKotlinIC
04-Sep-2019 08:15:15 > Task :spring-jdbc:jar
04-Sep-2019 08:15:16 > Task :spring-jdbc:compileTestJava
04-Sep-2019 08:15:16 > Task :spring-jdbc:processTestResources
04-Sep-2019 08:15:16 > Task :spring-jdbc:testClasses
04-Sep-2019 08:15:16 > Task :spring-oxm:compileJava
04-Sep-2019 08:15:16 > Task :spring-oxm:processResources
04-Sep-2019 08:15:16 > Task :spring-oxm:classes
04-Sep-2019 08:15:16 > Task :spring-oxm:jar
04-Sep-2019 08:15:19 > Task :spring-web:compileKotlin
04-Sep-2019 08:15:21 > Task :spring-web:compileJava
04-Sep-2019 08:15:21 > Task :spring-web:processResources
04-Sep-2019 08:15:21 > Task :spring-web:classes
04-Sep-2019 08:15:21 > Task :spring-web:inspectClassesForKotlinIC
04-Sep-2019 08:15:22 > Task :spring-web:jar
04-Sep-2019 08:15:23 > Task :spring-orm:compileJava
04-Sep-2019 08:15:23 > Task :spring-orm:processResources NO-SOURCE
04-Sep-2019 08:15:23 > Task :spring-orm:classes
04-Sep-2019 08:15:23 > Task :spring-orm:jar
04-Sep-2019 08:15:24
04-Sep-2019 08:15:24 > Task :spring-oxm:genJaxb
04-Sep-2019 08:15:24 [ant:javac] : warning: 'includeantruntime' was not set, defaulting to build.sysclasspath=last; set to false for repeatable builds
04-Sep-2019 08:15:26
04-Sep-2019 08:15:26 > Task :spring-oxm:compileTestJava
04-Sep-2019 08:15:26 > Task :spring-oxm:processTestResources
04-Sep-2019 08:15:26 > Task :spring-oxm:testClasses
04-Sep-2019 08:15:29 > Task :spring-web:compileTestKotlin
04-Sep-2019 08:15:32
04-Sep-2019 08:15:32 > Task :spring-web:compileTestJava
04-Sep-2019 08:15:32 Note: /opt/bamboo-home/xml-data/build-dir/SPR-PUB-JOB1/spring-web/src/test/java/org/springframework/http/server/reactive/RandomHandlerIntegrationTests.java uses or overrides a deprecated API.
04-Sep-2019 08:15:32 Note: Recompile with -Xlint:deprecation for details.
04-Sep-2019 08:15:33
04-Sep-2019 08:15:33 > Task :spring-web:processTestResources
04-Sep-2019 08:15:33 > Task :spring-web:testClasses
04-Sep-2019 08:15:33 > Task :spring-orm:compileTestJava
04-Sep-2019 08:15:33 > Task :spring-orm:processTestResources
04-Sep-2019 08:15:33 > Task :spring-orm:testClasses
04-Sep-2019 08:15:35 > Task :spring-context-support:compileJava
04-Sep-2019 08:15:35 > Task :spring-context-support:processResources
04-Sep-2019 08:15:35 > Task :spring-context-support:classes
04-Sep-2019 08:15:35 > Task :spring-context-support:jar
04-Sep-2019 08:15:36 > Task :spring-context-support:compileTestJava
04-Sep-2019 08:15:36 > Task :spring-context-support:processTestResources
04-Sep-2019 08:15:36 > Task :spring-context-support:testClasses
04-Sep-2019 08:15:38 > Task :spring-webflux:compileKotlin
04-Sep-2019 08:15:39 > Task :spring-webflux:compileJava
04-Sep-2019 08:15:39 > Task :spring-webflux:processResources
04-Sep-2019 08:15:39 > Task :spring-webflux:classes
04-Sep-2019 08:15:39 > Task :spring-webflux:inspectClassesForKotlinIC
04-Sep-2019 08:15:39 > Task :spring-webflux:jar
04-Sep-2019 08:15:41 > Task :spring-webmvc:compileKotlin
04-Sep-2019 08:15:42 > Task :spring-webmvc:compileJava
04-Sep-2019 08:15:42 > Task :spring-webmvc:processResources
04-Sep-2019 08:15:42 > Task :spring-webmvc:classes
04-Sep-2019 08:15:42 > Task :spring-webmvc:inspectClassesForKotlinIC
04-Sep-2019 08:15:42 > Task :spring-webmvc:jar
04-Sep-2019 08:15:43 > Task :spring-messaging:compileKotlin
04-Sep-2019 08:15:44 > Task :spring-messaging:compileJava
04-Sep-2019 08:15:44 > Task :spring-messaging:processResources NO-SOURCE
04-Sep-2019 08:15:44 > Task :spring-messaging:classes
04-Sep-2019 08:15:44 > Task :spring-messaging:inspectClassesForKotlinIC
04-Sep-2019 08:15:44 > Task :spring-messaging:jar
04-Sep-2019 08:15:45 > Task :spring-websocket:compileJava
04-Sep-2019 08:15:45 > Task :spring-websocket:processResources
04-Sep-2019 08:15:45 > Task :spring-websocket:classes
04-Sep-2019 08:15:45 > Task :spring-websocket:jar
04-Sep-2019 08:15:47 > Task :spring-test:compileKotlin
04-Sep-2019 08:15:48 > Task :spring-test:compileJava
04-Sep-2019 08:15:48 > Task :spring-test:processResources
04-Sep-2019 08:15:48 > Task :spring-test:classes
04-Sep-2019 08:15:51 > Task :spring-webflux:compileTestKotlin
04-Sep-2019 08:15:53 > Task :spring-webflux:compileTestJava
04-Sep-2019 08:15:53 > Task :spring-webflux:processTestResources
04-Sep-2019 08:15:53 > Task :spring-webflux:testClasses
04-Sep-2019 08:15:55 POM relocation to an other version number is not fully supported in Gradle : xml-apis:xml-apis:2.0.2 relocated to xml-apis:xml-apis:1.0.b2.
04-Sep-2019 08:15:55
04-Sep-2019 08:15:55 > Task :spring-webmvc:compileTestKotlin
04-Sep-2019 08:15:55 Please update your dependency to directly use the correct version 'xml-apis:xml-apis:1.0.b2'.
04-Sep-2019 08:15:55 Resolution will only pick dependencies of the relocated element.  Artifacts and other metadata will be ignored.
04-Sep-2019 08:15:59
04-Sep-2019 08:15:59 > Task :spring-webmvc:compileTestJava
04-Sep-2019 08:15:59 > Task :spring-webmvc:processTestResources
04-Sep-2019 08:15:59 > Task :spring-webmvc:testClasses
04-Sep-2019 08:16:01 > Task :spring-messaging:compileTestKotlin
04-Sep-2019 08:16:02 > Task :spring-messaging:compileTestJava
04-Sep-2019 08:16:02 > Task :spring-messaging:processTestResources
04-Sep-2019 08:16:02 > Task :spring-messaging:testClasses
04-Sep-2019 08:16:03 > Task :spring-websocket:compileTestJava
04-Sep-2019 08:16:03 > Task :spring-websocket:processTestResources
04-Sep-2019 08:16:03 > Task :spring-websocket:testClasses
04-Sep-2019 08:16:05 > Task :spring-test:compileTestKotlin
04-Sep-2019 08:16:05 > Task :spring-test:inspectClassesForKotlinIC
04-Sep-2019 08:16:05 > Task :spring-test:jar
04-Sep-2019 08:16:08 > Task :spring-test:compileTestJava
04-Sep-2019 08:16:08 > Task :spring-test:processTestResources
04-Sep-2019 08:16:08 > Task :spring-test:testClasses
04-Sep-2019 08:16:08 > Task :integration-tests:compileTestJava
04-Sep-2019 08:16:08 > Task :integration-tests:processTestResources
04-Sep-2019 08:16:08 > Task :integration-tests:testClasses
04-Sep-2019 08:16:10 > Task :integration-tests:checkstyleTest
04-Sep-2019 08:16:14 > Task :integration-tests:test
04-Sep-2019 08:16:14 > Task :integration-tests:check
04-Sep-2019 08:16:14 > Task :kotlin-coroutines:checkstyleMain NO-SOURCE
04-Sep-2019 08:16:14 > Task :kotlin-coroutines:checkstyleTest NO-SOURCE
04-Sep-2019 08:16:14 > Task :kotlin-coroutines:test NO-SOURCE
04-Sep-2019 08:16:14 > Task :kotlin-coroutines:check UP-TO-DATE
04-Sep-2019 08:16:18 > Task :spring-aop:checkstyleMain
04-Sep-2019 08:16:18 > Task :spring-aop:checkstyleTest
04-Sep-2019 08:16:22 > Task :spring-aop:test
04-Sep-2019 08:16:22 > Task :spring-aop:check
04-Sep-2019 08:16:22 > Task :spring-aspects:compileJava NO-SOURCE
04-Sep-2019 08:16:23 > Task :spring-aspects:compileAspectj
04-Sep-2019 08:16:23 > Task :spring-aspects:processResources
04-Sep-2019 08:16:23 > Task :spring-aspects:classes
04-Sep-2019 08:16:24 > Task :spring-aspects:checkstyleMain
04-Sep-2019 08:16:24 > Task :spring-aspects:compileTestJava NO-SOURCE
04-Sep-2019 08:16:26 > Task :spring-aspects:compileTestAspectj
04-Sep-2019 08:16:26 > Task :spring-aspects:processTestResources
04-Sep-2019 08:16:26 > Task :spring-aspects:testClasses
04-Sep-2019 08:16:26 > Task :spring-aspects:checkstyleTest
04-Sep-2019 08:16:31 > Task :spring-aspects:test
04-Sep-2019 08:16:31 > Task :spring-aspects:check
04-Sep-2019 08:16:34 > Task :spring-beans:checkstyleMain
04-Sep-2019 08:16:36 > Task :spring-beans:checkstyleTest
04-Sep-2019 08:16:46 > Task :spring-beans:test
04-Sep-2019 08:16:46 > Task :spring-beans:check
04-Sep-2019 08:16:50 > Task :spring-context:checkstyleMain
04-Sep-2019 08:16:54 > Task :spring-context:checkstyleTest
04-Sep-2019 08:17:24 > Task :spring-context:test
04-Sep-2019 08:17:29 > Task :spring-context:check
04-Sep-2019 08:17:29 > Task :spring-context-indexer:compileJava
04-Sep-2019 08:17:29 > Task :spring-context-indexer:processResources
04-Sep-2019 08:17:29 > Task :spring-context-indexer:classes
04-Sep-2019 08:17:29 > Task :spring-context-indexer:checkstyleMain
04-Sep-2019 08:17:30 > Task :spring-context-indexer:compileTestJava
04-Sep-2019 08:17:30 > Task :spring-context-indexer:processTestResources NO-SOURCE
04-Sep-2019 08:17:30 > Task :spring-context-indexer:testClasses
04-Sep-2019 08:17:30 > Task :spring-context-indexer:checkstyleTest
04-Sep-2019 08:17:32 > Task :spring-context-indexer:test
04-Sep-2019 08:17:32 > Task :spring-context-indexer:check
04-Sep-2019 08:17:33 > Task :spring-context-support:checkstyleMain
04-Sep-2019 08:17:33 > Task :spring-context-support:checkstyleTest
04-Sep-2019 08:17:43 > Task :spring-context-support:test
04-Sep-2019 08:17:43 > Task :spring-context-support:check
04-Sep-2019 08:17:48 > Task :spring-core:checkstyleMain
04-Sep-2019 08:17:51 > Task :spring-core:checkstyleTest
04-Sep-2019 08:17:53
04-Sep-2019 08:17:53 > Task :spring-core:test
04-Sep-2019 08:17:53
04-Sep-2019 08:17:53 org.springframework.core.io.support.PathMatchingResourcePatternResolverTests > classpathStarWithPatternInJar() FAILED
04-Sep-2019 08:17:53     org.opentest4j.AssertionFailedError at PathMatchingResourcePatternResolverTests.java:154
04-Sep-2019 08:17:53
04-Sep-2019 08:17:53 org.springframework.core.io.support.PathMatchingResourcePatternResolverTests > classpathWithPatternInJar() FAILED
04-Sep-2019 08:17:53     org.opentest4j.AssertionFailedError at PathMatchingResourcePatternResolverTests.java:154
04-Sep-2019 08:18:05
04-Sep-2019 08:18:05 3215 tests completed, 2 failed, 12 skipped
04-Sep-2019 08:18:05
04-Sep-2019 08:18:05 > Task :spring-core:test FAILED
04-Sep-2019 08:18:05
04-Sep-2019 08:18:05 FAILURE: Build failed with an exception.
04-Sep-2019 08:18:05
04-Sep-2019 08:18:05 * What went wrong:
04-Sep-2019 08:18:05 Execution failed for task ':spring-core:test'.
04-Sep-2019 08:18:05 > There were failing tests. See the report at: file:///opt/bamboo-home/xml-data/build-dir/SPR-PUB-JOB1/spring-core/build/reports/tests/test/index.html
04-Sep-2019 08:18:05
04-Sep-2019 08:18:05 * Try:
04-Sep-2019 08:18:05 Run with --info or --debug option to get more log output. Run with --scan to get full insights.
04-Sep-2019 08:18:05
04-Sep-2019 08:18:05 * Exception is:
04-Sep-2019 08:18:05 org.gradle.api.tasks.TaskExecutionException: Execution failed for task ':spring-core:test'.
04-Sep-2019 08:18:05         at org.gradle.api.internal.tasks.execution.ExecuteActionsTaskExecuter$3.accept(ExecuteActionsTaskExecuter.java:166)
04-Sep-2019 08:18:05         at org.gradle.api.internal.tasks.execution.ExecuteActionsTaskExecuter$3.accept(ExecuteActionsTaskExecuter.java:163)
04-Sep-2019 08:18:05         at org.gradle.internal.Try$Failure.ifSuccessfulOrElse(Try.java:191)
04-Sep-2019 08:18:05         at org.gradle.api.internal.tasks.execution.ExecuteActionsTaskExecuter.execute(ExecuteActionsTaskExecuter.java:156)
04-Sep-2019 08:18:05         at org.gradle.api.internal.tasks.execution.ValidatingTaskExecuter.execute(ValidatingTaskExecuter.java:62)
04-Sep-2019 08:18:05         at org.gradle.api.internal.tasks.execution.SkipEmptySourceFilesTaskExecuter.execute(SkipEmptySourceFilesTaskExecuter.java:108)
04-Sep-2019 08:18:05         at org.gradle.api.internal.tasks.execution.ResolveBeforeExecutionOutputsTaskExecuter.execute(ResolveBeforeExecutionOutputsTaskExecuter.java:67)
04-Sep-2019 08:18:05         at org.gradle.api.internal.tasks.execution.ResolveAfterPreviousExecutionStateTaskExecuter.execute(ResolveAfterPreviousExecutionStateTaskExecuter.java:46)
04-Sep-2019 08:18:05         at org.gradle.api.internal.tasks.execution.CleanupStaleOutputsExecuter.execute(CleanupStaleOutputsExecuter.java:94)
04-Sep-2019 08:18:05         at org.gradle.api.internal.tasks.execution.FinalizePropertiesTaskExecuter.execute(FinalizePropertiesTaskExecuter.java:46)
04-Sep-2019 08:18:05         at org.gradle.api.internal.tasks.execution.ResolveTaskExecutionModeExecuter.execute(ResolveTaskExecutionModeExecuter.java:95)
04-Sep-2019 08:18:05         at org.gradle.api.internal.tasks.execution.SkipTaskWithNoActionsExecuter.execute(SkipTaskWithNoActionsExecuter.java:57)
04-Sep-2019 08:18:05         at org.gradle.api.internal.tasks.execution.SkipOnlyIfTaskExecuter.execute(SkipOnlyIfTaskExecuter.java:56)
04-Sep-2019 08:18:05         at org.gradle.api.internal.tasks.execution.CatchExceptionTaskExecuter.execute(CatchExceptionTaskExecuter.java:36)
04-Sep-2019 08:18:05         at org.gradle.api.internal.tasks.execution.EventFiringTaskExecuter$1.executeTask(EventFiringTaskExecuter.java:77)
04-Sep-2019 08:18:05         at org.gradle.api.internal.tasks.execution.EventFiringTaskExecuter$1.call(EventFiringTaskExecuter.java:55)
04-Sep-2019 08:18:05         at org.gradle.api.internal.tasks.execution.EventFiringTaskExecuter$1.call(EventFiringTaskExecuter.java:52)
04-Sep-2019 08:18:05         at org.gradle.internal.operations.DefaultBuildOperationExecutor$CallableBuildOperationWorker.execute(DefaultBuildOperationExecutor.java:416)
04-Sep-2019 08:18:05         at org.gradle.internal.operations.DefaultBuildOperationExecutor$CallableBuildOperationWorker.execute(DefaultBuildOperationExecutor.java:406)
04-Sep-2019 08:18:05         at org.gradle.internal.operations.DefaultBuildOperationExecutor$1.execute(DefaultBuildOperationExecutor.java:165)
04-Sep-2019 08:18:05         at org.gradle.internal.operations.DefaultBuildOperationExecutor.execute(DefaultBuildOperationExecutor.java:250)
04-Sep-2019 08:18:05         at org.gradle.internal.operations.DefaultBuildOperationExecutor.execute(DefaultBuildOperationExecutor.java:158)
04-Sep-2019 08:18:05         at org.gradle.internal.operations.DefaultBuildOperationExecutor.call(DefaultBuildOperationExecutor.java:102)
04-Sep-2019 08:18:05         at org.gradle.internal.operations.DelegatingBuildOperationExecutor.call(DelegatingBuildOperationExecutor.java:36)
04-Sep-2019 08:18:05         at org.gradle.api.internal.tasks.execution.EventFiringTaskExecuter.execute(EventFiringTaskExecuter.java:52)
04-Sep-2019 08:18:05         at org.gradle.execution.plan.LocalTaskNodeExecutor.execute(LocalTaskNodeExecutor.java:43)
04-Sep-2019 08:18:05         at org.gradle.execution.taskgraph.DefaultTaskExecutionGraph$InvokeNodeExecutorsAction.execute(DefaultTaskExecutionGraph.java:355)
04-Sep-2019 08:18:05         at org.gradle.execution.taskgraph.DefaultTaskExecutionGraph$InvokeNodeExecutorsAction.execute(DefaultTaskExecutionGraph.java:343)
04-Sep-2019 08:18:05         at org.gradle.execution.taskgraph.DefaultTaskExecutionGraph$BuildOperationAwareExecutionAction.execute(DefaultTaskExecutionGraph.java:336)
04-Sep-2019 08:18:05         at org.gradle.execution.taskgraph.DefaultTaskExecutionGraph$BuildOperationAwareExecutionAction.execute(DefaultTaskExecutionGraph.java:322)
04-Sep-2019 08:18:05         at org.gradle.execution.plan.DefaultPlanExecutor$ExecutorWorker$1.execute(DefaultPlanExecutor.java:134)
04-Sep-2019 08:18:05         at org.gradle.execution.plan.DefaultPlanExecutor$ExecutorWorker$1.execute(DefaultPlanExecutor.java:129)
04-Sep-2019 08:18:05         at org.gradle.execution.plan.DefaultPlanExecutor$ExecutorWorker.execute(DefaultPlanExecutor.java:202)
04-Sep-2019 08:18:05         at org.gradle.execution.plan.DefaultPlanExecutor$ExecutorWorker.executeNextNode(DefaultPlanExecutor.java:193)
04-Sep-2019 08:18:05         at org.gradle.execution.plan.DefaultPlanExecutor$ExecutorWorker.run(DefaultPlanExecutor.java:129)
04-Sep-2019 08:18:05         at org.gradle.internal.concurrent.ExecutorPolicy$CatchAndRecordFailures.onExecute(ExecutorPolicy.java:64)
04-Sep-2019 08:18:05         at org.gradle.internal.concurrent.ManagedExecutorImpl$1.run(ManagedExecutorImpl.java:48)
04-Sep-2019 08:18:05         at org.gradle.internal.concurrent.ThreadFactoryImpl$ManagedThreadRunnable.run(ThreadFactoryImpl.java:56)
04-Sep-2019 08:18:05 Caused by: org.gradle.api.GradleException: There were failing tests. See the report at: file:///opt/bamboo-home/xml-data/build-dir/SPR-PUB-JOB1/spring-core/build/reports/tests/test/index.html
04-Sep-2019 08:18:05         at org.gradle.api.tasks.testing.AbstractTestTask.handleTestFailures(AbstractTestTask.java:632)
04-Sep-2019 08:18:05         at org.gradle.api.tasks.testing.AbstractTestTask.executeTests(AbstractTestTask.java:501)
04-Sep-2019 08:18:05         at org.gradle.api.tasks.testing.Test.executeTests(Test.java:613)
04-Sep-2019 08:18:05         at org.gradle.internal.reflect.JavaMethod.invoke(JavaMethod.java:103)
04-Sep-2019 08:18:05         at org.gradle.api.internal.project.taskfactory.StandardTaskAction.doExecute(StandardTaskAction.java:49)
04-Sep-2019 08:18:05         at org.gradle.api.internal.project.taskfactory.StandardTaskAction.execute(StandardTaskAction.java:42)
04-Sep-2019 08:18:05         at org.gradle.api.internal.project.taskfactory.StandardTaskAction.execute(StandardTaskAction.java:28)
04-Sep-2019 08:18:05         at org.gradle.api.internal.AbstractTask$TaskActionWrapper.execute(AbstractTask.java:717)
04-Sep-2019 08:18:05         at org.gradle.api.internal.AbstractTask$TaskActionWrapper.execute(AbstractTask.java:684)
04-Sep-2019 08:18:05         at org.gradle.api.internal.tasks.execution.ExecuteActionsTaskExecuter$5.run(ExecuteActionsTaskExecuter.java:476)
04-Sep-2019 08:18:05         at org.gradle.internal.operations.DefaultBuildOperationExecutor$RunnableBuildOperationWorker.execute(DefaultBuildOperationExecutor.java:402)
04-Sep-2019 08:18:05         at org.gradle.internal.operations.DefaultBuildOperationExecutor$RunnableBuildOperationWorker.execute(DefaultBuildOperationExecutor.java:394)
04-Sep-2019 08:18:05         at org.gradle.internal.operations.DefaultBuildOperationExecutor$1.execute(DefaultBuildOperationExecutor.java:165)
04-Sep-2019 08:18:05         at org.gradle.internal.operations.DefaultBuildOperationExecutor.execute(DefaultBuildOperationExecutor.java:250)
04-Sep-2019 08:18:05         at org.gradle.internal.operations.DefaultBuildOperationExecutor.execute(DefaultBuildOperationExecutor.java:158)
04-Sep-2019 08:18:05         at org.gradle.internal.operations.DefaultBuildOperationExecutor.run(DefaultBuildOperationExecutor.java:92)
04-Sep-2019 08:18:05         at org.gradle.internal.operations.DelegatingBuildOperationExecutor.run(DelegatingBuildOperationExecutor.java:31)
04-Sep-2019 08:18:05         at org.gradle.api.internal.tasks.execution.ExecuteActionsTaskExecuter.executeAction(ExecuteActionsTaskExecuter.java:461)
04-Sep-2019 08:18:05         at org.gradle.api.internal.tasks.execution.ExecuteActionsTaskExecuter.executeActions(ExecuteActionsTaskExecuter.java:444)
04-Sep-2019 08:18:05         at org.gradle.api.internal.tasks.execution.ExecuteActionsTaskExecuter.access$200(ExecuteActionsTaskExecuter.java:93)
04-Sep-2019 08:18:05         at org.gradle.api.internal.tasks.execution.ExecuteActionsTaskExecuter$TaskExecution.execute(ExecuteActionsTaskExecuter.java:237)
04-Sep-2019 08:18:05         at org.gradle.internal.execution.steps.ExecuteStep.lambda$execute$1(ExecuteStep.java:33)
04-Sep-2019 08:18:05         at org.gradle.internal.execution.steps.ExecuteStep.execute(ExecuteStep.java:33)
04-Sep-2019 08:18:05         at org.gradle.internal.execution.steps.ExecuteStep.execute(ExecuteStep.java:26)
04-Sep-2019 08:18:05         at org.gradle.internal.execution.steps.CleanupOutputsStep.execute(CleanupOutputsStep.java:58)
04-Sep-2019 08:18:05         at org.gradle.internal.execution.steps.CleanupOutputsStep.execute(CleanupOutputsStep.java:35)
04-Sep-2019 08:18:05         at org.gradle.internal.execution.steps.ResolveInputChangesStep.execute(ResolveInputChangesStep.java:48)
04-Sep-2019 08:18:05         at org.gradle.internal.execution.steps.ResolveInputChangesStep.execute(ResolveInputChangesStep.java:33)
04-Sep-2019 08:18:05         at org.gradle.internal.execution.steps.CancelExecutionStep.execute(CancelExecutionStep.java:39)
04-Sep-2019 08:18:05         at org.gradle.internal.execution.steps.TimeoutStep.executeWithoutTimeout(TimeoutStep.java:73)
04-Sep-2019 08:18:05         at org.gradle.internal.execution.steps.TimeoutStep.execute(TimeoutStep.java:54)
04-Sep-2019 08:18:05         at org.gradle.internal.execution.steps.CatchExceptionStep.execute(CatchExceptionStep.java:35)
04-Sep-2019 08:18:05         at org.gradle.internal.execution.steps.CreateOutputsStep.execute(CreateOutputsStep.java:51)
04-Sep-2019 08:18:05         at org.gradle.internal.execution.steps.SnapshotOutputsStep.execute(SnapshotOutputsStep.java:45)
04-Sep-2019 08:18:05         at org.gradle.internal.execution.steps.SnapshotOutputsStep.execute(SnapshotOutputsStep.java:31)
04-Sep-2019 08:18:05         at org.gradle.internal.execution.steps.CacheStep.executeWithoutCache(CacheStep.java:208)
04-Sep-2019 08:18:05         at org.gradle.internal.execution.steps.CacheStep.execute(CacheStep.java:70)
04-Sep-2019 08:18:05         at org.gradle.internal.execution.steps.CacheStep.execute(CacheStep.java:45)
04-Sep-2019 08:18:05         at org.gradle.internal.execution.steps.BroadcastChangingOutputsStep.execute(BroadcastChangingOutputsStep.java:49)
04-Sep-2019 08:18:05         at org.gradle.internal.execution.steps.StoreSnapshotsStep.execute(StoreSnapshotsStep.java:43)
04-Sep-2019 08:18:05         at org.gradle.internal.execution.steps.StoreSnapshotsStep.execute(StoreSnapshotsStep.java:32)
04-Sep-2019 08:18:05         at org.gradle.internal.execution.steps.RecordOutputsStep.execute(RecordOutputsStep.java:38)
04-Sep-2019 08:18:05         at org.gradle.internal.execution.steps.RecordOutputsStep.execute(RecordOutputsStep.java:24)
04-Sep-2019 08:18:05         at org.gradle.internal.execution.steps.SkipUpToDateStep.executeBecause(SkipUpToDateStep.java:96)
04-Sep-2019 08:18:05         at org.gradle.internal.execution.steps.SkipUpToDateStep.lambda$execute$0(SkipUpToDateStep.java:89)
04-Sep-2019 08:18:05         at org.gradle.internal.execution.steps.SkipUpToDateStep.execute(SkipUpToDateStep.java:54)
04-Sep-2019 08:18:05         at org.gradle.internal.execution.steps.SkipUpToDateStep.execute(SkipUpToDateStep.java:38)
04-Sep-2019 08:18:05         at org.gradle.internal.execution.steps.ResolveChangesStep.execute(ResolveChangesStep.java:76)
04-Sep-2019 08:18:05         at org.gradle.internal.execution.steps.ResolveChangesStep.execute(ResolveChangesStep.java:37)
04-Sep-2019 08:18:05         at org.gradle.internal.execution.steps.legacy.MarkSnapshottingInputsFinishedStep.execute(MarkSnapshottingInputsFinishedStep.java:36)
04-Sep-2019 08:18:05         at org.gradle.internal.execution.steps.legacy.MarkSnapshottingInputsFinishedStep.execute(MarkSnapshottingInputsFinishedStep.java:26)
04-Sep-2019 08:18:05         at org.gradle.internal.execution.steps.ResolveCachingStateStep.execute(ResolveCachingStateStep.java:90)
04-Sep-2019 08:18:05         at org.gradle.internal.execution.steps.ResolveCachingStateStep.execute(ResolveCachingStateStep.java:48)
04-Sep-2019 08:18:05         at org.gradle.internal.execution.steps.CaptureStateBeforeExecutionStep.execute(CaptureStateBeforeExecutionStep.java:69)
04-Sep-2019 08:18:05         at org.gradle.internal.execution.steps.CaptureStateBeforeExecutionStep.execute(CaptureStateBeforeExecutionStep.java:47)
04-Sep-2019 08:18:05         at org.gradle.internal.execution.impl.DefaultWorkExecutor.execute(DefaultWorkExecutor.java:33)
04-Sep-2019 08:18:05         at org.gradle.api.internal.tasks.execution.ExecuteActionsTaskExecuter.execute(ExecuteActionsTaskExecuter.java:140)
04-Sep-2019 08:18:05         ... 34 more
04-Sep-2019 08:18:05
04-Sep-2019 08:18:05
04-Sep-2019 08:18:05 * Get more help at https://help.gradle.org
04-Sep-2019 08:18:05
04-Sep-2019 08:18:05 BUILD FAILED in 4m 42s
04-Sep-2019 08:18:05
04-Sep-2019 08:18:05 Deprecated Gradle features were used in this build, making it incompatible with Gradle 6.0.
04-Sep-2019 08:18:05 Use '--warning-mode all' to show the individual deprecation warnings.
04-Sep-2019 08:18:05 See https://docs.gradle.org/5.6.1/userguide/command_line_interface.html#sec:command_line_warnings
04-Sep-2019 08:18:05 178 actionable tasks: 153 executed, 25 up-to-date
04-Sep-2019 08:18:05
04-Sep-2019 08:18:05 Failing task since return code of [./gradlew --refresh-dependencies --no-daemon -PtestGroups=ci -P BRANCH_NAME=master --stacktrace clean check build -DbuildInfoConfig.propertiesFile=/tmp/buildinfo1493097195724336751properties artifactoryPublish -Dartifactory.resolve.password=******** -Dartifactory.publish.password=********] was 1 while expected 0
04-Sep-2019 08:18:05 Parsing test results under /opt/bamboo-home/xml-data/build-dir/SPR-PUB-JOB1...
04-Sep-2019 08:18:06 Finished task 'Artifactory Gradle' with result: Failed
04-Sep-2019 08:18:06 Running post build plugin 'Docker Container Cleanup'
04-Sep-2019 08:18:06 Running post build plugin 'NCover Results Collector'
04-Sep-2019 08:18:06 Running post build plugin 'Artifactory Release Management Staging'
04-Sep-2019 08:18:06 Running post build plugin 'Artifactory Build Info Copier'
04-Sep-2019 08:18:06 Running post build plugin 'Artifactory Gradle Properties Info Copier'
04-Sep-2019 08:18:06 Running post build plugin 'Clover Results Collector'
04-Sep-2019 08:18:06 Running post build plugin 'npm Cache Cleanup'
04-Sep-2019 08:18:06 Running post build plugin 'Artifact Copier'
04-Sep-2019 08:18:07 Successfully removed working directory at '/opt/bamboo-home/xml-data/build-dir/SPR-PUB-JOB1'
04-Sep-2019 08:18:07 Finalising the build...
04-Sep-2019 08:18:07 Stopping timer.
04-Sep-2019 08:18:07 Build SPR-PUB-JOB1-7854 completed.
04-Sep-2019 08:18:07 Running on server: post build plugin 'NCover Results Collector'
04-Sep-2019 08:18:07 Running on server: post build plugin 'Build Hanging Detection Configuration'
04-Sep-2019 08:18:07 Running on server: post build plugin 'Bamboo project link creator'
04-Sep-2019 08:18:07 Running on server: post build plugin 'Clover Delta Calculator'
04-Sep-2019 08:18:07 Running on server: post build plugin 'Maven Dependencies Postprocessor'
04-Sep-2019 08:18:07 All post build plugins have finished
04-Sep-2019 08:18:07 Generating build results summary...
04-Sep-2019 08:18:15 Saving build results to disk...
04-Sep-2019 08:18:15 Logging substituted variables...
04-Sep-2019 08:18:15 Indexing build results...
04-Sep-2019 08:18:15 Finished building SPR-PUB-JOB1-7854.