Build #7,858

Build: #7858 failed

Job: Default Job failed

Stages & jobs

  1. Default Stage

Build log

The build generated 316 lines of output. Download or view full build log

04-Sep-2019 10:19:53 Build Spring Framework - Publication - Default Job #7858 (SPR-PUB-JOB1-7858) started building on agent bamboo-22.af.pivotal.io
04-Sep-2019 10:19:53 Remote agent on host bamboo-22.af.pivotal.io
04-Sep-2019 10:19:54 Build working directory is /opt/bamboo-home/xml-data/build-dir/SPR-PUB-JOB1
04-Sep-2019 10:19:54 Executing build Spring Framework - Publication - Default Job #7858 (SPR-PUB-JOB1-7858)
04-Sep-2019 10:19:54 Starting task 'Checkout Default Repository' of type 'com.atlassian.bamboo.plugins.vcs:task.vcs.checkout'
04-Sep-2019 10:19:54 Build always requires a clean checkout
04-Sep-2019 10:19:54 Cleaning build directory '/opt/bamboo-home/xml-data/build-dir/SPR-PUB-JOB1'
04-Sep-2019 10:19:54 Checking out into /opt/bamboo-home/xml-data/build-dir/SPR-PUB-JOB1
04-Sep-2019 10:19:54 Updating source code to revision: 48934cba1bc1ae6bc5ef6c03b41ca66d428901ab
04-Sep-2019 10:19:54 Creating local git repository in '/opt/bamboo-home/xml-data/build-dir/SPR-PUB-JOB1/.git'.
04-Sep-2019 10:19:54 Initialized empty Git repository in /opt/bamboo-home/xml-data/build-dir/SPR-PUB-JOB1/.git/
04-Sep-2019 10:19:54 Fetching 'refs/heads/master' from 'https://github.com/spring-projects/spring-framework.git'.
04-Sep-2019 10:20:05 From https://github.com/spring-projects/spring-framework
04-Sep-2019 10:20:05 * [new branch]      master     -> master
04-Sep-2019 10:20:06 * [new tag]               v3.1.0.RELEASE -> v3.1.0.RELEASE
04-Sep-2019 10:20:06 * [new tag]               v3.2.0.M1      -> v3.2.0.M1
04-Sep-2019 10:20:06 * [new tag]               v3.2.0.M2      -> v3.2.0.M2
04-Sep-2019 10:20:06 * [new tag]               v3.2.0.RC1     -> v3.2.0.RC1
04-Sep-2019 10:20:06 * [new tag]               v3.2.0.RC2-A   -> v3.2.0.RC2-A
04-Sep-2019 10:20:06 * [new tag]               v3.2.0.RELEASE -> v3.2.0.RELEASE
04-Sep-2019 10:20:06 * [new tag]               v3.2.1.RELEASE -> v3.2.1.RELEASE
04-Sep-2019 10:20:06 * [new tag]               v3.2.2.RELEASE -> v3.2.2.RELEASE
04-Sep-2019 10:20:06 * [new tag]               v4.0.0.M1      -> v4.0.0.M1
04-Sep-2019 10:20:06 * [new tag]               v4.0.0.M2      -> v4.0.0.M2
04-Sep-2019 10:20:06 * [new tag]               v4.0.0.M3      -> v4.0.0.M3
04-Sep-2019 10:20:06 * [new tag]               v4.0.0.RC1     -> v4.0.0.RC1
04-Sep-2019 10:20:06 * [new tag]               v4.0.0.RC2     -> v4.0.0.RC2
04-Sep-2019 10:20:06 Checking out revision 48934cba1bc1ae6bc5ef6c03b41ca66d428901ab.
04-Sep-2019 10:20:06 Already on 'master'
04-Sep-2019 10:20:06 Updated source code to revision: 48934cba1bc1ae6bc5ef6c03b41ca66d428901ab
04-Sep-2019 10:20:06 Finished task 'Checkout Default Repository' with result: Success
04-Sep-2019 10:20:06 Running pre-build action: Artifactory Release Staging
04-Sep-2019 10:20:06 Running pre-build action: VCS Version Collector
04-Sep-2019 10:20:06
Substituting variable: ${bamboo.spr.jdk.home} with /opt/jdk-8
04-Sep-2019 10:20:06
Substituting variable: ${bamboo.repository.branch.name} with master
04-Sep-2019 10:20:06 Starting task 'Artifactory Gradle' of type 'org.jfrog.bamboo.bamboo-artifactory-plugin:artifactoryGradleTask'
04-Sep-2019 10:20:06 Bamboo Artifactory Plugin version: 2.6.3
04-Sep-2019 10:20:06
Beginning to execute external process for build 'Spring Framework - Publication - Default Job #7858 (SPR-PUB-JOB1-7858)'
... running command line:
./gradlew --refresh-dependencies --no-daemon -PtestGroups=ci -P BRANCH_NAME=master --stacktrace clean check build -I /tmp/artifactory.init.script1893176305167044155gradle -DbuildInfoConfig.propertiesFile=/tmp/buildinfo3728292324441468656properties artifactoryPublish -Dartifactory.resolve.password=******** -Dartifactory.publish.password=********
... in: /opt/bamboo-home/xml-data/build-dir/SPR-PUB-JOB1
... using extra environment variables:
bamboo_planRepository_1_branch=master
bamboo_********_username_password=********
bamboo_signing_store_password=********
bamboo_planRepository_2_branch=master
bamboo_capability_system_builder_ant_Ant_1_9=/opt/ant-1.9
bamboo_repository_137199621_git_repositoryUrl=https://github.com/spring-projects/spring-framework.git
bamboo_capability_system_builder_ant_Ant_1_8=/opt/ant-1.8
bamboo_planRepository_1_branchDisplayName=master
bamboo_artifactory_override_resolve_repo=libs-milestone
bamboo_capability_system_builder_node_Node_js_10_16=/opt/node-10.16/bin/node
bamboo_repository_revision_number=48934cba1bc1ae6bc5ef6c03b41ca66d428901ab
bamboo_repository_262406229_git_repositoryUrl=https://github.com/spring-projects/spring-framework.git
bamboo_artifactory_task_override_jdk=true
bamboo_RIAK_BIN=/usr/sbin/riak
WRAPPER_BITS=32
bamboo_buildKey=SPR-PUB-JOB1
bamboo_repository_137199621_name=Plan Repository
bamboo_spr_jdk_home=/opt/jdk-8
bamboo_bintray_password=********
bamboo_sonar_token_password=********
PWD=/opt/bamboo-home/bin
bamboo_planRepository_2_branchDisplayName=master
bamboo_shortJobName=Default Job
bamboo_artifactory_override_resolver_password=********
bamboo_sonatype_token=RSJChaox
bamboo_capability_system_builder_gradle___gradlew=./gradlew
bamboo_buildResultsUrl=https://build.spring.io/browse/SPR-PUB-JOB1-7858
bamboo_capability_system_builder_mvn3_Maven_3_3=/opt/maven-3.3
bamboo_capability_system_builder_mvn3_Maven_3_2=/opt/maven-3.2
bamboo_capability_system_builder_mvn3_Maven_3_1=/opt/maven-3.1
bamboo_planRepository_repositoryUrl=https://github.com/spring-projects/spring-framework.git
bamboo_capability_system_builder_mvn3_Maven_3_6=/opt/maven-3.6
bamboo_agentId=286195714
bamboo_capability_system_builder_mvn3_Maven_3_5=/opt/maven-3.5
bamboo_capability_system_builder_mvn3_Maven_3_0=/opt/maven-3.0
bamboo_planRepository_revision=48934cba1bc1ae6bc5ef6c03b41ca66d428901ab
bamboo_planRepository_previousRevision=c8f430ee9188ad082bf76e5b05877d00bafe1a82
bamboo_repository_137199621_revision_number=48934cba1bc1ae6bc5ef6c03b41ca66d428901ab
bamboo_capability_remote_build=true
bamboo_repository_branch_name=master
bamboo_sonatype_token_password=********
bamboo_sonatype_user=springsource
SHLVL=1
bamboo_org_jfrog_bamboo_buildInfo_serverUrl=https://repo.spring.io
bamboo_scdf_acceptance_tests_password=********
bamboo_repository_262406229_branch_name=master
WRAPPER_OS=linux
JAVA_HOME=/opt/jdk-8/
TERM=linux
XDG_SESSION_ID=c1
bamboo_planRepository_branch=master
bamboo_org_jfrog_bamboo_release_activated=false
bamboo_planRepository_1_type=gitv2
bamboo_planRepository_branchName=master
bamboo_repository_137199621_git_username=spring-buildmaster
bamboo_capability_system_jdk_JDK_12=/opt/jdk-12
WRAPPER_FILE_SEPARATOR=/
_=/opt/bamboo-home/bin/bamboo-agent.sh
bamboo_capability_system_builder_gradlew_gradlew=./
bamboo_repository_262406229_revision_number=48934cba1bc1ae6bc5ef6c03b41ca66d428901ab
bamboo_capability_system_builder_ant_Ant_1_10=/opt/ant-1.10
WRAPPER_PATH_SEPARATOR=:
bamboo_sonar_password=********
bamboo_hg_cache_directory=/opt/bamboo-home/xml-data/build-dir/_hg-repositories-cache
bamboo_planRepository_1_username=spring-buildmaster
bamboo_planRepository_type=gitv2
bamboo_repository_262406229_git_branch=master
bamboo_git_cache_directory=/opt/bamboo-home/xml-data/build-dir/_git-repositories-cache
bamboo_planRepository_2_branchName=master
bamboo_artifactory_username=buildmaster
bamboo_tmp_directory=/opt/bamboo-home/temp
bamboo_planKey=SPR-PUB
bamboo_planRepository_username=spring-buildmaster
bamboo_JDK8_HOME=/opt/jdk-8
bamboo_snifftask=sniff
bamboo_planRepository_1_branchName=master
bamboo_sonar_version=5.6.3
bamboo_sonar_jdbc_password=********
bamboo_bintray_api_key_password=********
GRADLE_OPTS=-XX:MaxMetaspaceSize=1024m -Xmx1024m
bamboo_repository_262406229_git_username=spring-buildmaster
XDG_DATA_DIRS=/usr/local/share:/usr/share:/var/lib/snapd/desktop
bamboo_capability_system_jdk_JDK_1_11=/opt/jdk-11
bamboo_resultsUrl=https://build.spring.io/browse/SPR-PUB-JOB1-7858
bamboo_capability_system_jdk_JDK_1_10=/opt/jdk-10
bamboo_build_working_directory=/opt/bamboo-home/xml-data/build-dir/SPR-PUB-JOB1
bamboo_planRepository_1_name=Spring Framework
bamboo_capability_system_os=ubuntu1804
bamboo_nexusPush_stagingProfile=buildmaster
bamboo_shortPlanName=Publication
MAIL=/var/mail/bamboo
bamboo_planRepository_2_username=spring-buildmaster
bamboo_repository_137199621_branch_name=master
bamboo_planRepository_name=Spring Framework
LOGNAME=bamboo
bamboo_buildNumber=7858
bamboo_repository_137199621_git_branch=master
SHELL=/bin/bash
bamboo_planName=Spring Framework - Publication
bamboo_JDK7_HOME=/opt/jdk-7
bamboo_repository_137199621_previous_revision_number=c8f430ee9188ad082bf76e5b05877d00bafe1a82
bamboo_shortPlanKey=PUB
OLDPWD=/opt/users/bamboo
bamboo_shortJobKey=JOB1
bamboo_artifactory_password=********
bamboo_repository_262406229_name=Spring Framework
bamboo_planRepository_2_name=Plan Repository
bamboo_repository_262406229_previous_revision_number=c8f430ee9188ad082bf76e5b05877d00bafe1a82
bamboo_buildTimeStamp=2019-09-04T10:19:53.862Z
bamboo_repository_previous_revision_number=c8f430ee9188ad082bf76e5b05877d00bafe1a82
bamboo_sonar_username=buildmaster
bamboo_********_password=********
bamboo_repository_git_branch=master
bamboo_buildResultKey=SPR-PUB-JOB1-7858
bamboo_nexusPush_close=true
bamboo_artifactory_override_resolver_username=buildmaster
bamboo_buildPlanName=Spring Framework - Publication - Default Job
bamboo_planRepository_1_revision=48934cba1bc1ae6bc5ef6c03b41ca66d428901ab
bamboo_repository_name=Plan Repository
bamboo_signing_key_password=********
bamboo_planRepository_2_previousRevision=c8f430ee9188ad082bf76e5b05877d00bafe1a82
bamboo_capability_system_builder_groovy_Groovy_2_5=/opt/groovy-2.5
LANG=en_US.UTF-8
bamboo_buildFailed=false
bamboo_capability_system_docker_executable=/usr/bin/docker
DISPLAY=localhost:1.0
bamboo_capability_system_jdk_OpenJDK_7=/opt/jdk-7
bamboo_capability_system_builder_groovy_Groovy_2_4=/opt/groovy-2.4
bamboo_artifactory_override_deployer_username=buildmaster
bamboo_artifactory_password_mask_b=********
bamboo_capability_system_builder_command_Bash=/bin/bash
bamboo_artifactory_password_mask_a=********
bamboo_agentWorkingDirectory=/opt/bamboo-home/xml-data/build-dir
bamboo_planRepository_2_revision=48934cba1bc1ae6bc5ef6c03b41ca66d428901ab
bamboo_capability_system_git_executable=/usr/bin/git
bamboo_repository_git_username=spring-buildmaster
bamboo_planRepository_1_previousRevision=c8f430ee9188ad082bf76e5b05877d00bafe1a82
bamboo_capability_os_family=unix
bamboo_planRepository_branchDisplayName=master
bamboo_capability_system_builder_maven_Artifactory_Maven_3_6=/opt/maven-3.6
bamboo_capability_system_builder_maven_Artifactory_Maven_3_5=/opt/maven-3.5
GIT_SSL_NO_VERIFY=true
bamboo_capability_system_builder_maven_Artifactory_Maven_3_3=/opt/maven-3.3
bamboo_planRepository_2_type=gitv2
bamboo_capability_system_builder_maven_Artifactory_Maven_3_2=/opt/maven-3.2
bamboo_s3_properties=/home/bamboo/tools/s3.properties
bamboo_capability_system_builder_maven_Artifactory_Maven_3_1=/opt/maven-3.1
bamboo_artifactory_override_deploy_repo=libs-snapshot-local
bamboo_capability_system_builder_maven_Artifactory_Maven_3_0=/opt/maven-3.0
bamboo_plan_storageTag=SPR-PUB
bamboo_bintray_username_password=********
bamboo_planRepository_2_repositoryUrl=https://github.com/spring-projects/spring-framework.git
USER=bamboo
bamboo_repository_git_repositoryUrl=https://github.com/spring-projects/spring-framework.git
bamboo_working_directory=/opt/bamboo-home/xml-data/build-dir/SPR-PUB-JOB1
bamboo_org_jfrog_bamboo_buildInfo_activated=true
bamboo_planRepository_1_repositoryUrl=https://github.com/spring-projects/spring-framework.git
bamboo_capability_system_jdk_JDK_1_8=/opt/jdk-8
bamboo_artifactory_override_deployer_password=********
bamboo_capability_system_jdk_JDK_1_9=/opt/jdk-9
WRAPPER_ARCH=x86
bamboo_capability_system_jdk_JDK_1_6=/opt/jdk-6
bamboo_sonatype_password=********
bamboo_capability_system_jdk_JDK_1_7=/opt/jdk-7
bamboo_sonar_ip=10.194.6.9
XDG_RUNTIME_DIR=/run/user/1002
HOME=/home/bamboo
PATH=/bin:/home/bamboo/bin:/usr/local/sbin:/usr/local/bin:/usr/sbin:/usr/bin:/sbin:/bin:/usr/games:/usr/local/games:/snap/bin:/home/bamboo/bin:/usr/local/bin:/bin:/home/bamboo/bin:/usr/local/sbin:/usr/local/bin:/usr/sbin:/usr/bin:/sbin:/bin:/usr/games:/usr/local/games:/snap/bin:/home/bamboo/bin:/usr/local/bin
04-Sep-2019 10:20:12 > Task :buildSrc:compileJava
04-Sep-2019 10:20:12 > Task :buildSrc:compileGroovy NO-SOURCE
04-Sep-2019 10:20:12 > Task :buildSrc:pluginDescriptors
04-Sep-2019 10:20:13 > Task :buildSrc:processResources
04-Sep-2019 10:20:13 > Task :buildSrc:classes
04-Sep-2019 10:20:13 > Task :buildSrc:jar
04-Sep-2019 10:20:13 > Task :buildSrc:assemble
04-Sep-2019 10:20:13 > Task :buildSrc:pluginUnderTestMetadata
04-Sep-2019 10:20:13 > Task :buildSrc:compileTestJava NO-SOURCE
04-Sep-2019 10:20:13 > Task :buildSrc:compileTestGroovy NO-SOURCE
04-Sep-2019 10:20:13 > Task :buildSrc:processTestResources NO-SOURCE
04-Sep-2019 10:20:13 > Task :buildSrc:testClasses UP-TO-DATE
04-Sep-2019 10:20:13 > Task :buildSrc:test NO-SOURCE
04-Sep-2019 10:20:13 > Task :buildSrc:validateTaskProperties
04-Sep-2019 10:20:13 > Task :buildSrc:check
04-Sep-2019 10:20:13 > Task :buildSrc:build
04-Sep-2019 10:20:39
04-Sep-2019 10:20:39 FAILURE: Build failed with an exception.
04-Sep-2019 10:20:39
04-Sep-2019 10:20:39 * Where:
04-Sep-2019 10:20:39 Script '/opt/bamboo-home/xml-data/build-dir/SPR-PUB-JOB1/gradle/publications.gradle' line: 2
04-Sep-2019 10:20:39
04-Sep-2019 10:20:39 * What went wrong:
04-Sep-2019 10:20:39 A problem occurred evaluating script.
04-Sep-2019 10:20:39 > Failed to apply plugin [id 'com.jfrog.artifactory']
04-Sep-2019 10:20:39    > Cannot cast object 'org.[email protected]77eb607e' with class 'org.jfrog.gradle.plugin.artifactory.dsl.ArtifactoryPluginConvention' to class 'org.jfrog.gradle.plugin.artifactory.dsl.ArtifactoryPluginConvention'
04-Sep-2019 10:20:39
04-Sep-2019 10:20:39 * Try:
04-Sep-2019 10:20:39 Run with --info or --debug option to get more log output. Run with --scan to get full insights.
04-Sep-2019 10:20:39
04-Sep-2019 10:20:39 * Exception is:
04-Sep-2019 10:20:39 org.gradle.api.GradleScriptException: A problem occurred evaluating script.
04-Sep-2019 10:20:39         at org.gradle.groovy.scripts.internal.DefaultScriptRunnerFactory$ScriptRunnerImpl.run(DefaultScriptRunnerFactory.java:93)
04-Sep-2019 10:20:39         at org.gradle.configuration.DefaultScriptPluginFactory$ScriptPluginImpl$2.run(DefaultScriptPluginFactory.java:227)
04-Sep-2019 10:20:39         at org.gradle.configuration.DefaultScriptTarget.addConfiguration(DefaultScriptTarget.java:74)
04-Sep-2019 10:20:39         at org.gradle.configuration.DefaultScriptPluginFactory$ScriptPluginImpl.apply(DefaultScriptPluginFactory.java:232)
04-Sep-2019 10:20:39         at org.gradle.configuration.BuildOperationScriptPlugin$1$1.run(BuildOperationScriptPlugin.java:69)
04-Sep-2019 10:20:39         at org.gradle.internal.operations.DefaultBuildOperationExecutor$RunnableBuildOperationWorker.execute(DefaultBuildOperationExecutor.java:402)
04-Sep-2019 10:20:39         at org.gradle.internal.operations.DefaultBuildOperationExecutor$RunnableBuildOperationWorker.execute(DefaultBuildOperationExecutor.java:394)
04-Sep-2019 10:20:39         at org.gradle.internal.operations.DefaultBuildOperationExecutor$1.execute(DefaultBuildOperationExecutor.java:165)
04-Sep-2019 10:20:39         at org.gradle.internal.operations.DefaultBuildOperationExecutor.execute(DefaultBuildOperationExecutor.java:250)
04-Sep-2019 10:20:39         at org.gradle.internal.operations.DefaultBuildOperationExecutor.execute(DefaultBuildOperationExecutor.java:158)
04-Sep-2019 10:20:39         at org.gradle.internal.operations.DefaultBuildOperationExecutor.run(DefaultBuildOperationExecutor.java:92)
04-Sep-2019 10:20:39         at org.gradle.internal.operations.DelegatingBuildOperationExecutor.run(DelegatingBuildOperationExecutor.java:31)
04-Sep-2019 10:20:39         at org.gradle.configuration.BuildOperationScriptPlugin$1.execute(BuildOperationScriptPlugin.java:66)
04-Sep-2019 10:20:39         at org.gradle.configuration.BuildOperationScriptPlugin$1.execute(BuildOperationScriptPlugin.java:63)
04-Sep-2019 10:20:39         at org.gradle.configuration.internal.DefaultUserCodeApplicationContext.apply(DefaultUserCodeApplicationContext.java:49)
04-Sep-2019 10:20:39         at org.gradle.configuration.BuildOperationScriptPlugin.apply(BuildOperationScriptPlugin.java:63)
04-Sep-2019 10:20:39         at org.gradle.api.internal.plugins.DefaultObjectConfigurationAction.applyScript(DefaultObjectConfigurationAction.java:118)
04-Sep-2019 10:20:39         at org.gradle.api.internal.plugins.DefaultObjectConfigurationAction.access$000(DefaultObjectConfigurationAction.java:38)
04-Sep-2019 10:20:39         at org.gradle.api.internal.plugins.DefaultObjectConfigurationAction$1.run(DefaultObjectConfigurationAction.java:71)
04-Sep-2019 10:20:39         at org.gradle.api.internal.plugins.DefaultObjectConfigurationAction.execute(DefaultObjectConfigurationAction.java:152)
04-Sep-2019 10:20:39         at org.gradle.groovy.scripts.DefaultScript.apply(DefaultScript.java:140)
04-Sep-2019 10:20:39         at org.gradle.api.Script$apply$1.callCurrent(Unknown Source)
04-Sep-2019 10:20:39         at spring_module_9wrtd8ef9tndzl0arp34w0ejl.run(/opt/bamboo-home/xml-data/build-dir/SPR-PUB-JOB1/gradle/spring-module.gradle:4)
04-Sep-2019 10:20:39         at org.gradle.groovy.scripts.internal.DefaultScriptRunnerFactory$ScriptRunnerImpl.run(DefaultScriptRunnerFactory.java:91)
04-Sep-2019 10:20:39         at org.gradle.configuration.DefaultScriptPluginFactory$ScriptPluginImpl$2.run(DefaultScriptPluginFactory.java:227)
04-Sep-2019 10:20:39         at org.gradle.configuration.DefaultScriptTarget.addConfiguration(DefaultScriptTarget.java:74)
04-Sep-2019 10:20:39         at org.gradle.configuration.DefaultScriptPluginFactory$ScriptPluginImpl.apply(DefaultScriptPluginFactory.java:232)
04-Sep-2019 10:20:39         at org.gradle.configuration.BuildOperationScriptPlugin$1$1.run(BuildOperationScriptPlugin.java:69)
04-Sep-2019 10:20:39         at org.gradle.internal.operations.DefaultBuildOperationExecutor$RunnableBuildOperationWorker.execute(DefaultBuildOperationExecutor.java:402)
04-Sep-2019 10:20:39         at org.gradle.internal.operations.DefaultBuildOperationExecutor$RunnableBuildOperationWorker.execute(DefaultBuildOperationExecutor.java:394)
04-Sep-2019 10:20:39         at org.gradle.internal.operations.DefaultBuildOperationExecutor$1.execute(DefaultBuildOperationExecutor.java:165)
04-Sep-2019 10:20:39         at org.gradle.internal.operations.DefaultBuildOperationExecutor.execute(DefaultBuildOperationExecutor.java:250)
04-Sep-2019 10:20:39         at org.gradle.internal.operations.DefaultBuildOperationExecutor.execute(DefaultBuildOperationExecutor.java:158)
04-Sep-2019 10:20:39         at org.gradle.internal.operations.DefaultBuildOperationExecutor.run(DefaultBuildOperationExecutor.java:92)
04-Sep-2019 10:20:39         at org.gradle.internal.operations.DelegatingBuildOperationExecutor.run(DelegatingBuildOperationExecutor.java:31)
04-Sep-2019 10:20:39         at org.gradle.configuration.BuildOperationScriptPlugin$1.execute(BuildOperationScriptPlugin.java:66)
04-Sep-2019 10:20:39         at org.gradle.configuration.BuildOperationScriptPlugin$1.execute(BuildOperationScriptPlugin.java:63)
04-Sep-2019 10:20:39         at org.gradle.configuration.internal.DefaultUserCodeApplicationContext.apply(DefaultUserCodeApplicationContext.java:49)
04-Sep-2019 10:20:39         at org.gradle.configuration.BuildOperationScriptPlugin.apply(BuildOperationScriptPlugin.java:63)
04-Sep-2019 10:20:39         at org.gradle.api.internal.plugins.DefaultObjectConfigurationAction.applyScript(DefaultObjectConfigurationAction.java:118)
04-Sep-2019 10:20:39         at org.gradle.api.internal.plugins.DefaultObjectConfigurationAction.access$000(DefaultObjectConfigurationAction.java:38)
04-Sep-2019 10:20:39         at org.gradle.api.internal.plugins.DefaultObjectConfigurationAction$1.run(DefaultObjectConfigurationAction.java:71)
04-Sep-2019 10:20:39         at org.gradle.api.internal.plugins.DefaultObjectConfigurationAction.execute(DefaultObjectConfigurationAction.java:152)
04-Sep-2019 10:20:39         at org.gradle.api.internal.project.AbstractPluginAware.apply(AbstractPluginAware.java:49)
04-Sep-2019 10:20:39         at org.gradle.internal.metaobject.BeanDynamicObject$MetaClassAdapter.invokeMethod(BeanDynamicObject.java:479)
04-Sep-2019 10:20:39         at org.gradle.internal.metaobject.BeanDynamicObject.tryInvokeMethod(BeanDynamicObject.java:191)
04-Sep-2019 10:20:39         at org.gradle.internal.metaobject.CompositeDynamicObject.tryInvokeMethod(CompositeDynamicObject.java:98)
04-Sep-2019 10:20:39         at org.gradle.internal.extensibility.MixInClosurePropertiesAsMethodsDynamicObject.tryInvokeMethod(MixInClosurePropertiesAsMethodsDynamicObject.java:33)
04-Sep-2019 10:20:39         at org.gradle.internal.metaobject.ConfigureDelegate.invokeMethod(ConfigureDelegate.java:56)
04-Sep-2019 10:20:39         at build_4ekdydsa7fbknckwipingr78y$_run_closure4.doCall(/opt/bamboo-home/xml-data/build-dir/SPR-PUB-JOB1/build.gradle:376)
04-Sep-2019 10:20:39         at org.gradle.util.ClosureBackedAction.execute(ClosureBackedAction.java:71)
04-Sep-2019 10:20:39         at org.gradle.util.ConfigureUtil.configureTarget(ConfigureUtil.java:154)
04-Sep-2019 10:20:39         at org.gradle.util.ConfigureUtil.configure(ConfigureUtil.java:105)
04-Sep-2019 10:20:39         at org.gradle.api.internal.project.DefaultProject.configure(DefaultProject.java:1169)
04-Sep-2019 10:20:39         at org.gradle.api.internal.project.DefaultProject.configure(DefaultProject.java:1175)
04-Sep-2019 10:20:39         at org.gradle.internal.metaobject.BeanDynamicObject$MetaClassAdapter.invokeMethod(BeanDynamicObject.java:479)
04-Sep-2019 10:20:39         at org.gradle.internal.metaobject.BeanDynamicObject.tryInvokeMethod(BeanDynamicObject.java:191)
04-Sep-2019 10:20:39         at org.gradle.internal.metaobject.CompositeDynamicObject.tryInvokeMethod(CompositeDynamicObject.java:98)
04-Sep-2019 10:20:39         at org.gradle.internal.extensibility.MixInClosurePropertiesAsMethodsDynamicObject.tryInvokeMethod(MixInClosurePropertiesAsMethodsDynamicObject.java:33)
04-Sep-2019 10:20:39         at org.gradle.groovy.scripts.BasicScript$ScriptDynamicObject.tryInvokeMethod(BasicScript.java:134)
04-Sep-2019 10:20:39         at org.gradle.internal.metaobject.AbstractDynamicObject.invokeMethod(AbstractDynamicObject.java:162)
04-Sep-2019 10:20:39         at org.gradle.groovy.scripts.BasicScript.invokeMethod(BasicScript.java:83)
04-Sep-2019 10:20:39         at build_4ekdydsa7fbknckwipingr78y.run(/opt/bamboo-home/xml-data/build-dir/SPR-PUB-JOB1/build.gradle:375)
04-Sep-2019 10:20:39         at org.gradle.groovy.scripts.internal.DefaultScriptRunnerFactory$ScriptRunnerImpl.run(DefaultScriptRunnerFactory.java:91)
04-Sep-2019 10:20:39         at org.gradle.configuration.DefaultScriptPluginFactory$ScriptPluginImpl$2.run(DefaultScriptPluginFactory.java:227)
04-Sep-2019 10:20:39         at org.gradle.configuration.ProjectScriptTarget.addConfiguration(ProjectScriptTarget.java:77)
04-Sep-2019 10:20:39         at org.gradle.configuration.DefaultScriptPluginFactory$ScriptPluginImpl.apply(DefaultScriptPluginFactory.java:232)
04-Sep-2019 10:20:39         at org.gradle.configuration.BuildOperationScriptPlugin$1$1.run(BuildOperationScriptPlugin.java:69)
04-Sep-2019 10:20:39         at org.gradle.internal.operations.DefaultBuildOperationExecutor$RunnableBuildOperationWorker.execute(DefaultBuildOperationExecutor.java:402)
04-Sep-2019 10:20:39         at org.gradle.internal.operations.DefaultBuildOperationExecutor$RunnableBuildOperationWorker.execute(DefaultBuildOperationExecutor.java:394)
04-Sep-2019 10:20:39         at org.gradle.internal.operations.DefaultBuildOperationExecutor$1.execute(DefaultBuildOperationExecutor.java:165)
04-Sep-2019 10:20:39         at org.gradle.internal.operations.DefaultBuildOperationExecutor.execute(DefaultBuildOperationExecutor.java:250)
04-Sep-2019 10:20:39         at org.gradle.internal.operations.DefaultBuildOperationExecutor.execute(DefaultBuildOperationExecutor.java:158)
04-Sep-2019 10:20:39         at org.gradle.internal.operations.DefaultBuildOperationExecutor.run(DefaultBuildOperationExecutor.java:92)
04-Sep-2019 10:20:39         at org.gradle.internal.operations.DelegatingBuildOperationExecutor.run(DelegatingBuildOperationExecutor.java:31)
04-Sep-2019 10:20:39         at org.gradle.configuration.BuildOperationScriptPlugin$1.execute(BuildOperationScriptPlugin.java:66)
04-Sep-2019 10:20:39         at org.gradle.configuration.BuildOperationScriptPlugin$1.execute(BuildOperationScriptPlugin.java:63)
04-Sep-2019 10:20:39         at org.gradle.configuration.internal.DefaultUserCodeApplicationContext.apply(DefaultUserCodeApplicationContext.java:49)
04-Sep-2019 10:20:39         at org.gradle.configuration.BuildOperationScriptPlugin.apply(BuildOperationScriptPlugin.java:63)
04-Sep-2019 10:20:39         at org.gradle.configuration.project.BuildScriptProcessor$1.run(BuildScriptProcessor.java:45)
04-Sep-2019 10:20:39         at org.gradle.internal.Factories$1.create(Factories.java:26)
04-Sep-2019 10:20:39         at org.gradle.api.internal.project.DefaultProjectStateRegistry$ProjectStateImpl.withMutableState(DefaultProjectStateRegistry.java:201)
04-Sep-2019 10:20:39         at org.gradle.api.internal.project.DefaultProjectStateRegistry$ProjectStateImpl.withMutableState(DefaultProjectStateRegistry.java:187)
04-Sep-2019 10:20:39         at org.gradle.configuration.project.BuildScriptProcessor.execute(BuildScriptProcessor.java:42)
04-Sep-2019 10:20:39         at org.gradle.configuration.project.BuildScriptProcessor.execute(BuildScriptProcessor.java:26)
04-Sep-2019 10:20:39         at org.gradle.configuration.project.ConfigureActionsProjectEvaluator.evaluate(ConfigureActionsProjectEvaluator.java:35)
04-Sep-2019 10:20:39         at org.gradle.configuration.project.LifecycleProjectEvaluator$EvaluateProject$1.run(LifecycleProjectEvaluator.java:107)
04-Sep-2019 10:20:39         at org.gradle.internal.Factories$1.create(Factories.java:26)
04-Sep-2019 10:20:39         at org.gradle.internal.work.DefaultWorkerLeaseService.withLocks(DefaultWorkerLeaseService.java:189)
04-Sep-2019 10:20:39         at org.gradle.internal.work.StopShieldingWorkerLeaseService.withLocks(StopShieldingWorkerLeaseService.java:40)
04-Sep-2019 10:20:39         at org.gradle.api.internal.project.DefaultProjectStateRegistry$ProjectStateImpl.withProjectLock(DefaultProjectStateRegistry.java:227)
04-Sep-2019 10:20:39         at org.gradle.api.internal.project.DefaultProjectStateRegistry$ProjectStateImpl.withMutableState(DefaultProjectStateRegistry.java:221)
04-Sep-2019 10:20:39         at org.gradle.api.internal.project.DefaultProjectStateRegistry$ProjectStateImpl.withMutableState(DefaultProjectStateRegistry.java:187)
04-Sep-2019 10:20:39         at org.gradle.configuration.project.LifecycleProjectEvaluator$EvaluateProject.run(LifecycleProjectEvaluator.java:96)
04-Sep-2019 10:20:39         at org.gradle.internal.operations.DefaultBuildOperationExecutor$RunnableBuildOperationWorker.execute(DefaultBuildOperationExecutor.java:402)
04-Sep-2019 10:20:39         at org.gradle.internal.operations.DefaultBuildOperationExecutor$RunnableBuildOperationWorker.execute(DefaultBuildOperationExecutor.java:394)
04-Sep-2019 10:20:39         at org.gradle.internal.operations.DefaultBuildOperationExecutor$1.execute(DefaultBuildOperationExecutor.java:165)
04-Sep-2019 10:20:39         at org.gradle.internal.operations.DefaultBuildOperationExecutor.execute(DefaultBuildOperationExecutor.java:250)
04-Sep-2019 10:20:39         at org.gradle.internal.operations.DefaultBuildOperationExecutor.execute(DefaultBuildOperationExecutor.java:158)
04-Sep-2019 10:20:39         at org.gradle.internal.operations.DefaultBuildOperationExecutor.run(DefaultBuildOperationExecutor.java:92)
04-Sep-2019 10:20:39         at org.gradle.internal.operations.DelegatingBuildOperationExecutor.run(DelegatingBuildOperationExecutor.java:31)
04-Sep-2019 10:20:39         at org.gradle.configuration.project.LifecycleProjectEvaluator.evaluate(LifecycleProjectEvaluator.java:68)
04-Sep-2019 10:20:39         at org.gradle.api.internal.project.DefaultProject.evaluate(DefaultProject.java:693)
04-Sep-2019 10:20:39         at org.gradle.api.internal.project.DefaultProject.evaluate(DefaultProject.java:141)
04-Sep-2019 10:20:39         at org.gradle.execution.TaskPathProjectEvaluator.configure(TaskPathProjectEvaluator.java:36)
04-Sep-2019 10:20:39         at org.gradle.execution.TaskPathProjectEvaluator.configureHierarchy(TaskPathProjectEvaluator.java:62)
04-Sep-2019 10:20:39         at org.gradle.configuration.DefaultProjectsPreparer.prepareProjects(DefaultProjectsPreparer.java:55)
04-Sep-2019 10:20:39         at org.gradle.configuration.BuildOperatingFiringProjectsPreparer$ConfigureBuild.run(BuildOperatingFiringProjectsPreparer.java:52)
04-Sep-2019 10:20:39         at org.gradle.internal.operations.DefaultBuildOperationExecutor$RunnableBuildOperationWorker.execute(DefaultBuildOperationExecutor.java:402)
04-Sep-2019 10:20:39         at org.gradle.internal.operations.DefaultBuildOperationExecutor$RunnableBuildOperationWorker.execute(DefaultBuildOperationExecutor.java:394)
04-Sep-2019 10:20:39         at org.gradle.internal.operations.DefaultBuildOperationExecutor$1.execute(DefaultBuildOperationExecutor.java:165)
04-Sep-2019 10:20:39         at org.gradle.internal.operations.DefaultBuildOperationExecutor.execute(DefaultBuildOperationExecutor.java:250)
04-Sep-2019 10:20:39         at org.gradle.internal.operations.DefaultBuildOperationExecutor.execute(DefaultBuildOperationExecutor.java:158)
04-Sep-2019 10:20:39         at org.gradle.internal.operations.DefaultBuildOperationExecutor.run(DefaultBuildOperationExecutor.java:92)
04-Sep-2019 10:20:39         at org.gradle.internal.operations.DelegatingBuildOperationExecutor.run(DelegatingBuildOperationExecutor.java:31)
04-Sep-2019 10:20:39         at org.gradle.configuration.BuildOperatingFiringProjectsPreparer.prepareProjects(BuildOperatingFiringProjectsPreparer.java:40)
04-Sep-2019 10:20:39         at org.gradle.initialization.DefaultGradleLauncher.prepareProjects(DefaultGradleLauncher.java:198)
04-Sep-2019 10:20:39         at org.gradle.initialization.DefaultGradleLauncher.doClassicBuildStages(DefaultGradleLauncher.java:138)
04-Sep-2019 10:20:39         at org.gradle.initialization.DefaultGradleLauncher.doBuildStages(DefaultGradleLauncher.java:126)
04-Sep-2019 10:20:39         at org.gradle.initialization.DefaultGradleLauncher.executeTasks(DefaultGradleLauncher.java:106)
04-Sep-2019 10:20:39         at org.gradle.internal.invocation.GradleBuildController$1.execute(GradleBuildController.java:60)
04-Sep-2019 10:20:39         at org.gradle.internal.invocation.GradleBuildController$1.execute(GradleBuildController.java:57)
04-Sep-2019 10:20:39         at org.gradle.internal.invocation.GradleBuildController$3.create(GradleBuildController.java:85)
04-Sep-2019 10:20:39         at org.gradle.internal.invocation.GradleBuildController$3.create(GradleBuildController.java:78)
04-Sep-2019 10:20:39         at org.gradle.internal.work.DefaultWorkerLeaseService.withLocks(DefaultWorkerLeaseService.java:189)
04-Sep-2019 10:20:39         at org.gradle.internal.work.StopShieldingWorkerLeaseService.withLocks(StopShieldingWorkerLeaseService.java:40)
04-Sep-2019 10:20:39         at org.gradle.internal.invocation.GradleBuildController.doBuild(GradleBuildController.java:78)
04-Sep-2019 10:20:39         at org.gradle.internal.invocation.GradleBuildController.run(GradleBuildController.java:57)
04-Sep-2019 10:20:39         at org.gradle.tooling.internal.provider.ExecuteBuildActionRunner.run(ExecuteBuildActionRunner.java:31)
04-Sep-2019 10:20:39         at org.gradle.launcher.exec.ChainingBuildActionRunner.run(ChainingBuildActionRunner.java:35)
04-Sep-2019 10:20:39         at org.gradle.launcher.exec.BuildOutcomeReportingBuildActionRunner.run(BuildOutcomeReportingBuildActionRunner.java:63)
04-Sep-2019 10:20:39         at org.gradle.tooling.internal.provider.ValidatingBuildActionRunner.run(ValidatingBuildActionRunner.java:32)
04-Sep-2019 10:20:39         at org.gradle.launcher.exec.BuildCompletionNotifyingBuildActionRunner.run(BuildCompletionNotifyingBuildActionRunner.java:39)
04-Sep-2019 10:20:39         at org.gradle.launcher.exec.RunAsBuildOperationBuildActionRunner$3.call(RunAsBuildOperationBuildActionRunner.java:51)
04-Sep-2019 10:20:39         at org.gradle.launcher.exec.RunAsBuildOperationBuildActionRunner$3.call(RunAsBuildOperationBuildActionRunner.java:45)
04-Sep-2019 10:20:39         at org.gradle.internal.operations.DefaultBuildOperationExecutor$CallableBuildOperationWorker.execute(DefaultBuildOperationExecutor.java:416)
04-Sep-2019 10:20:39         at org.gradle.internal.operations.DefaultBuildOperationExecutor$CallableBuildOperationWorker.execute(DefaultBuildOperationExecutor.java:406)
04-Sep-2019 10:20:39         at org.gradle.internal.operations.DefaultBuildOperationExecutor$1.execute(DefaultBuildOperationExecutor.java:165)
04-Sep-2019 10:20:39         at org.gradle.internal.operations.DefaultBuildOperationExecutor.execute(DefaultBuildOperationExecutor.java:250)
04-Sep-2019 10:20:39         at org.gradle.internal.operations.DefaultBuildOperationExecutor.execute(DefaultBuildOperationExecutor.java:158)
04-Sep-2019 10:20:39         at org.gradle.internal.operations.DefaultBuildOperationExecutor.call(DefaultBuildOperationExecutor.java:102)
04-Sep-2019 10:20:39         at org.gradle.internal.operations.DelegatingBuildOperationExecutor.call(DelegatingBuildOperationExecutor.java:36)
04-Sep-2019 10:20:39         at org.gradle.launcher.exec.RunAsBuildOperationBuildActionRunner.run(RunAsBuildOperationBuildActionRunner.java:45)
04-Sep-2019 10:20:39         at org.gradle.launcher.exec.InProcessBuildActionExecuter$1.transform(InProcessBuildActionExecuter.java:50)
04-Sep-2019 10:20:39         at org.gradle.launcher.exec.InProcessBuildActionExecuter$1.transform(InProcessBuildActionExecuter.java:47)
04-Sep-2019 10:20:39         at org.gradle.composite.internal.DefaultRootBuildState.run(DefaultRootBuildState.java:78)
04-Sep-2019 10:20:39         at org.gradle.launcher.exec.InProcessBuildActionExecuter.execute(InProcessBuildActionExecuter.java:47)
04-Sep-2019 10:20:39         at org.gradle.launcher.exec.InProcessBuildActionExecuter.execute(InProcessBuildActionExecuter.java:31)
04-Sep-2019 10:20:39         at org.gradle.launcher.exec.BuildTreeScopeBuildActionExecuter.execute(BuildTreeScopeBuildActionExecuter.java:42)
04-Sep-2019 10:20:39         at org.gradle.launcher.exec.BuildTreeScopeBuildActionExecuter.execute(BuildTreeScopeBuildActionExecuter.java:28)
04-Sep-2019 10:20:39         at org.gradle.tooling.internal.provider.ContinuousBuildActionExecuter.execute(ContinuousBuildActionExecuter.java:78)
04-Sep-2019 10:20:39         at org.gradle.tooling.internal.provider.ContinuousBuildActionExecuter.execute(ContinuousBuildActionExecuter.java:52)
04-Sep-2019 10:20:39         at org.gradle.tooling.internal.provider.SubscribableBuildActionExecuter.execute(SubscribableBuildActionExecuter.java:59)
04-Sep-2019 10:20:39         at org.gradle.tooling.internal.provider.SubscribableBuildActionExecuter.execute(SubscribableBuildActionExecuter.java:36)
04-Sep-2019 10:20:39         at org.gradle.tooling.internal.provider.SessionScopeBuildActionExecuter.execute(SessionScopeBuildActionExecuter.java:68)
04-Sep-2019 10:20:39         at org.gradle.tooling.internal.provider.SessionScopeBuildActionExecuter.execute(SessionScopeBuildActionExecuter.java:38)
04-Sep-2019 10:20:39         at org.gradle.tooling.internal.provider.GradleThreadBuildActionExecuter.execute(GradleThreadBuildActionExecuter.java:37)
04-Sep-2019 10:20:39         at org.gradle.tooling.internal.provider.GradleThreadBuildActionExecuter.execute(GradleThreadBuildActionExecuter.java:26)
04-Sep-2019 10:20:39         at org.gradle.tooling.internal.provider.ParallelismConfigurationBuildActionExecuter.execute(ParallelismConfigurationBuildActionExecuter.java:43)
04-Sep-2019 10:20:39         at org.gradle.tooling.internal.provider.ParallelismConfigurationBuildActionExecuter.execute(ParallelismConfigurationBuildActionExecuter.java:29)
04-Sep-2019 10:20:39         at org.gradle.tooling.internal.provider.StartParamsValidatingActionExecuter.execute(StartParamsValidatingActionExecuter.java:60)
04-Sep-2019 10:20:39         at org.gradle.tooling.internal.provider.StartParamsValidatingActionExecuter.execute(StartParamsValidatingActionExecuter.java:32)
04-Sep-2019 10:20:39         at org.gradle.tooling.internal.provider.SessionFailureReportingActionExecuter.execute(SessionFailureReportingActionExecuter.java:55)
04-Sep-2019 10:20:39         at org.gradle.tooling.internal.provider.SessionFailureReportingActionExecuter.execute(SessionFailureReportingActionExecuter.java:41)
04-Sep-2019 10:20:39         at org.gradle.tooling.internal.provider.SetupLoggingActionExecuter.execute(SetupLoggingActionExecuter.java:48)
04-Sep-2019 10:20:39         at org.gradle.tooling.internal.provider.SetupLoggingActionExecuter.execute(SetupLoggingActionExecuter.java:32)
04-Sep-2019 10:20:39         at org.gradle.launcher.cli.RunBuildAction.run(RunBuildAction.java:56)
04-Sep-2019 10:20:39         at org.gradle.internal.Actions$RunnableActionAdapter.execute(Actions.java:212)
04-Sep-2019 10:20:39         at org.gradle.launcher.cli.DefaultCommandLineActionFactory$ParseAndBuildAction.execute(DefaultCommandLineActionFactory.java:404)
04-Sep-2019 10:20:39         at org.gradle.launcher.cli.DefaultCommandLineActionFactory$ParseAndBuildAction.execute(DefaultCommandLineActionFactory.java:376)
04-Sep-2019 10:20:39         at org.gradle.launcher.cli.ExceptionReportingAction.execute(ExceptionReportingAction.java:38)
04-Sep-2019 10:20:39         at org.gradle.launcher.cli.ExceptionReportingAction.execute(ExceptionReportingAction.java:23)
04-Sep-2019 10:20:39         at org.gradle.launcher.cli.DefaultCommandLineActionFactory$WithLogging.execute(DefaultCommandLineActionFactory.java:369)
04-Sep-2019 10:20:39         at org.gradle.launcher.Main.doAction(Main.java:35)
04-Sep-2019 10:20:39         at org.gradle.launcher.bootstrap.EntryPoint.run(EntryPoint.java:45)
04-Sep-2019 10:20:39         at org.gradle.launcher.bootstrap.ProcessBootstrap.runNoExit(ProcessBootstrap.java:60)
04-Sep-2019 10:20:39         at org.gradle.launcher.bootstrap.ProcessBootstrap.run(ProcessBootstrap.java:37)
04-Sep-2019 10:20:39         at org.gradle.launcher.GradleMain.main(GradleMain.java:31)
04-Sep-2019 10:20:39         at org.gradle.wrapper.BootstrapMainStarter.start(BootstrapMainStarter.java:31)
04-Sep-2019 10:20:39         at org.gradle.wrapper.WrapperExecutor.execute(WrapperExecutor.java:108)
04-Sep-2019 10:20:39         at org.gradle.wrapper.GradleWrapperMain.main(GradleWrapperMain.java:63)
04-Sep-2019 10:20:39 Caused by: org.gradle.api.internal.plugins.PluginApplicationException: Failed to apply plugin [id 'com.jfrog.artifactory']
04-Sep-2019 10:20:39         at org.gradle.api.internal.plugins.DefaultPluginManager.doApply(DefaultPluginManager.java:167)
04-Sep-2019 10:20:39         at org.gradle.api.internal.plugins.DefaultPluginManager.apply(DefaultPluginManager.java:136)
04-Sep-2019 10:20:39         at org.gradle.api.internal.plugins.DefaultObjectConfigurationAction.applyType(DefaultObjectConfigurationAction.java:129)
04-Sep-2019 10:20:39         at org.gradle.api.internal.plugins.DefaultObjectConfigurationAction.access$200(DefaultObjectConfigurationAction.java:38)
04-Sep-2019 10:20:39         at org.gradle.api.internal.plugins.DefaultObjectConfigurationAction$3.run(DefaultObjectConfigurationAction.java:93)
04-Sep-2019 10:20:39         at org.gradle.api.internal.plugins.DefaultObjectConfigurationAction.execute(DefaultObjectConfigurationAction.java:152)
04-Sep-2019 10:20:39         at org.gradle.groovy.scripts.DefaultScript.apply(DefaultScript.java:140)
04-Sep-2019 10:20:39         at org.gradle.api.Script$apply$1.callCurrent(Unknown Source)
04-Sep-2019 10:20:39         at publications_9ttkpsqnt0hp0e8peb3q82c3x.run(/opt/bamboo-home/xml-data/build-dir/SPR-PUB-JOB1/gradle/publications.gradle:2)
04-Sep-2019 10:20:39         at org.gradle.groovy.scripts.internal.DefaultScriptRunnerFactory$ScriptRunnerImpl.run(DefaultScriptRunnerFactory.java:91)
04-Sep-2019 10:20:39         ... 180 more
04-Sep-2019 10:20:39 Caused by: org.codehaus.groovy.runtime.typehandling.GroovyCastException: Cannot cast object 'org.[email protected]77eb607e' with class 'org.jfrog.gradle.plugin.artifactory.dsl.ArtifactoryPluginConvention' to class 'org.jfrog.gradle.plugin.artifactory.dsl.ArtifactoryPluginConvention'
04-Sep-2019 10:20:39         at org.jfrog.gradle.plugin.artifactory.ArtifactoryPluginBase.getArtifactoryPluginConvention(ArtifactoryPluginBase.groovy:73)
04-Sep-2019 10:20:39         at org.jfrog.gradle.plugin.artifactory.ArtifactoryPluginBase.apply(ArtifactoryPluginBase.groovy:41)
04-Sep-2019 10:20:39         at org.jfrog.gradle.plugin.artifactory.ArtifactoryPluginBase.apply(ArtifactoryPluginBase.groovy)
04-Sep-2019 10:20:39         at org.gradle.api.internal.plugins.ImperativeOnlyPluginTarget.applyImperative(ImperativeOnlyPluginTarget.java:43)
04-Sep-2019 10:20:39         at org.gradle.api.internal.plugins.RuleBasedPluginTarget.applyImperative(RuleBasedPluginTarget.java:51)
04-Sep-2019 10:20:39         at org.gradle.api.internal.plugins.DefaultPluginManager.addPlugin(DefaultPluginManager.java:181)
04-Sep-2019 10:20:39         at org.gradle.api.internal.plugins.DefaultPluginManager.access$300(DefaultPluginManager.java:51)
04-Sep-2019 10:20:39         at org.gradle.api.internal.plugins.DefaultPluginManager$AddPluginBuildOperation.run(DefaultPluginManager.java:276)
04-Sep-2019 10:20:39         at org.gradle.internal.operations.DefaultBuildOperationExecutor$RunnableBuildOperationWorker.execute(DefaultBuildOperationExecutor.java:402)
04-Sep-2019 10:20:39         at org.gradle.internal.operations.DefaultBuildOperationExecutor$RunnableBuildOperationWorker.execute(DefaultBuildOperationExecutor.java:394)
04-Sep-2019 10:20:39         at org.gradle.internal.operations.DefaultBuildOperationExecutor$1.execute(DefaultBuildOperationExecutor.java:165)
04-Sep-2019 10:20:39         at org.gradle.internal.operations.DefaultBuildOperationExecutor.execute(DefaultBuildOperationExecutor.java:250)
04-Sep-2019 10:20:39         at org.gradle.internal.operations.DefaultBuildOperationExecutor.execute(DefaultBuildOperationExecutor.java:158)
04-Sep-2019 10:20:39         at org.gradle.internal.operations.DefaultBuildOperationExecutor.run(DefaultBuildOperationExecutor.java:92)
04-Sep-2019 10:20:39         at org.gradle.internal.operations.DelegatingBuildOperationExecutor.run(DelegatingBuildOperationExecutor.java:31)
04-Sep-2019 10:20:39         at org.gradle.api.internal.plugins.DefaultPluginManager$2.execute(DefaultPluginManager.java:159)
04-Sep-2019 10:20:39         at org.gradle.api.internal.plugins.DefaultPluginManager$2.execute(DefaultPluginManager.java:156)
04-Sep-2019 10:20:39         at org.gradle.configuration.internal.DefaultUserCodeApplicationContext.apply(DefaultUserCodeApplicationContext.java:49)
04-Sep-2019 10:20:39         at org.gradle.api.internal.plugins.DefaultPluginManager.doApply(DefaultPluginManager.java:156)
04-Sep-2019 10:20:39         ... 189 more
04-Sep-2019 10:20:39
04-Sep-2019 10:20:39
04-Sep-2019 10:20:39 * Get more help at https://help.gradle.org
04-Sep-2019 10:20:39
04-Sep-2019 10:20:39 BUILD FAILED in 32s
04-Sep-2019 10:20:39
04-Sep-2019 10:20:39 Failing task since return code of [./gradlew --refresh-dependencies --no-daemon -PtestGroups=ci -P BRANCH_NAME=master --stacktrace clean check build -I /tmp/artifactory.init.script1893176305167044155gradle -DbuildInfoConfig.propertiesFile=/tmp/buildinfo3728292324441468656properties artifactoryPublish -Dartifactory.resolve.password=******** -Dartifactory.publish.password=********] was 1 while expected 0
04-Sep-2019 10:20:39 Parsing test results under /opt/bamboo-home/xml-data/build-dir/SPR-PUB-JOB1...
04-Sep-2019 10:20:39 Finished task 'Artifactory Gradle' with result: Failed
04-Sep-2019 10:20:39 Running post build plugin 'Docker Container Cleanup'
04-Sep-2019 10:20:39 Running post build plugin 'NCover Results Collector'
04-Sep-2019 10:20:39 Running post build plugin 'Artifactory Release Management Staging'
04-Sep-2019 10:20:39 Running post build plugin 'Artifactory Build Info Copier'
04-Sep-2019 10:20:39 Running post build plugin 'Artifactory Gradle Properties Info Copier'
04-Sep-2019 10:20:39 Running post build plugin 'Clover Results Collector'
04-Sep-2019 10:20:39 Running post build plugin 'npm Cache Cleanup'
04-Sep-2019 10:20:39 Running post build plugin 'Artifact Copier'
04-Sep-2019 10:20:39 Successfully removed working directory at '/opt/bamboo-home/xml-data/build-dir/SPR-PUB-JOB1'
04-Sep-2019 10:20:39 Finalising the build...
04-Sep-2019 10:20:39 Stopping timer.
04-Sep-2019 10:20:39 Build SPR-PUB-JOB1-7858 completed.
04-Sep-2019 10:20:39 Running on server: post build plugin 'NCover Results Collector'
04-Sep-2019 10:20:39 Running on server: post build plugin 'Build Hanging Detection Configuration'
04-Sep-2019 10:20:39 Running on server: post build plugin 'Bamboo project link creator'
04-Sep-2019 10:20:39 Running on server: post build plugin 'Clover Delta Calculator'
04-Sep-2019 10:20:39 Running on server: post build plugin 'Maven Dependencies Postprocessor'
04-Sep-2019 10:20:39 All post build plugins have finished
04-Sep-2019 10:20:39 Generating build results summary...
04-Sep-2019 10:20:39 Saving build results to disk...
04-Sep-2019 10:20:39 Logging substituted variables...
04-Sep-2019 10:20:39 Indexing build results...
04-Sep-2019 10:20:39 Finished building SPR-PUB-JOB1-7858.