Build #631

Build: #631 failed

Job: Default Job failed

Stages & jobs

  1. Default Stage

Build log

The build generated 4,445 lines of output.The output is too long and has been truncated to the last 1,000 lines. Download or view full build log

29-Mar-2019 15:03:59         at org.gradle.launcher.cli.CommandLineActionFactory$ParseAndBuildAction.execute(CommandLineActionFactory.java:237)
29-Mar-2019 15:03:59         at org.gradle.launcher.cli.CommandLineActionFactory$ParseAndBuildAction.execute(CommandLineActionFactory.java:210)
29-Mar-2019 15:03:59         at org.gradle.launcher.cli.JavaRuntimeValidationAction.execute(JavaRuntimeValidationAction.java:35)
29-Mar-2019 15:03:59         at org.gradle.launcher.cli.JavaRuntimeValidationAction.execute(JavaRuntimeValidationAction.java:24)
29-Mar-2019 15:03:59         at org.gradle.launcher.cli.CommandLineActionFactory$WithLogging.execute(CommandLineActionFactory.java:206)
29-Mar-2019 15:03:59         at org.gradle.launcher.cli.CommandLineActionFactory$WithLogging.execute(CommandLineActionFactory.java:169)
29-Mar-2019 15:03:59         at org.gradle.launcher.cli.ExceptionReportingAction.execute(ExceptionReportingAction.java:33)
29-Mar-2019 15:03:59         at org.gradle.launcher.cli.ExceptionReportingAction.execute(ExceptionReportingAction.java:22)
29-Mar-2019 15:03:59         at org.gradle.launcher.Main.doAction(Main.java:33)
29-Mar-2019 15:03:59         at org.gradle.launcher.bootstrap.EntryPoint.run(EntryPoint.java:45)
29-Mar-2019 15:03:59         at sun.reflect.NativeMethodAccessorImpl.invoke0(Native Method)
29-Mar-2019 15:03:59         at sun.reflect.NativeMethodAccessorImpl.invoke(NativeMethodAccessorImpl.java:57)
29-Mar-2019 15:03:59         at sun.reflect.DelegatingMethodAccessorImpl.invoke(DelegatingMethodAccessorImpl.java:43)
29-Mar-2019 15:03:59         at java.lang.reflect.Method.invoke(Method.java:606)
29-Mar-2019 15:03:59         at org.gradle.launcher.bootstrap.ProcessBootstrap.runNoExit(ProcessBootstrap.java:54)
29-Mar-2019 15:03:59         at org.gradle.launcher.bootstrap.ProcessBootstrap.run(ProcessBootstrap.java:35)
29-Mar-2019 15:03:59         at org.gradle.launcher.GradleMain.main(GradleMain.java:23)
29-Mar-2019 15:03:59         at sun.reflect.NativeMethodAccessorImpl.invoke0(Native Method)
29-Mar-2019 15:03:59         at sun.reflect.NativeMethodAccessorImpl.invoke(NativeMethodAccessorImpl.java:57)
29-Mar-2019 15:03:59         at sun.reflect.DelegatingMethodAccessorImpl.invoke(DelegatingMethodAccessorImpl.java:43)
29-Mar-2019 15:03:59         at java.lang.reflect.Method.invoke(Method.java:606)
29-Mar-2019 15:03:59         at org.gradle.wrapper.BootstrapMainStarter.start(BootstrapMainStarter.java:30)
29-Mar-2019 15:03:59         at org.gradle.wrapper.WrapperExecutor.execute(WrapperExecutor.java:127)
29-Mar-2019 15:03:59         at org.gradle.wrapper.GradleWrapperMain.main(GradleWrapperMain.java:55)
29-Mar-2019 15:03:59 Caused by: org.gradle.api.artifacts.ResolveException: Could not resolve all dependencies for configuration ':classpath'.
29-Mar-2019 15:03:59         at org.gradle.api.internal.artifacts.ivyservice.DefaultLenientConfiguration.rethrowFailure(DefaultLenientConfiguration.java:63)
29-Mar-2019 15:03:59         at org.gradle.api.internal.artifacts.ivyservice.DefaultResolvedConfiguration.rethrowFailure(DefaultResolvedConfiguration.java:36)
29-Mar-2019 15:03:59         at org.gradle.api.internal.artifacts.ivyservice.SelfResolvingDependencyResolver$FilesAggregatingResolvedConfiguration.rethrowFailure(SelfResolvingDependencyResolver.java:115)
29-Mar-2019 15:03:59         at org.gradle.api.internal.artifacts.ivyservice.ErrorHandlingArtifactDependencyResolver$ErrorHandlingResolvedConfiguration.rethrowFailure(ErrorHandlingArtifactDependencyResolver.java:191)
29-Mar-2019 15:03:59         at org.gradle.api.internal.artifacts.configurations.DefaultConfiguration$ConfigurationFileCollection.getFiles(DefaultConfiguration.java:674)
29-Mar-2019 15:03:59         at org.gradle.api.internal.artifacts.configurations.DefaultConfiguration.getFiles(DefaultConfiguration.java:284)
29-Mar-2019 15:03:59         at org.gradle.api.internal.artifacts.configurations.DefaultConfiguration_Decorated.getFiles(Unknown Source)
29-Mar-2019 15:03:59         at org.gradle.api.internal.initialization.DefaultScriptHandler.getScriptClassPath(DefaultScriptHandler.java:70)
29-Mar-2019 15:03:59         at org.gradle.plugin.use.internal.DefaultPluginRequestApplicator.defineScriptHandlerClassScope(DefaultPluginRequestApplicator.java:141)
29-Mar-2019 15:03:59         at org.gradle.plugin.use.internal.DefaultPluginRequestApplicator.applyPlugins(DefaultPluginRequestApplicator.java:54)
29-Mar-2019 15:03:59         at org.gradle.configuration.DefaultScriptPluginFactory$ScriptPluginImpl.apply(DefaultScriptPluginFactory.java:129)
29-Mar-2019 15:03:59         at org.gradle.configuration.project.BuildScriptProcessor.execute(BuildScriptProcessor.java:39)
29-Mar-2019 15:03:59         at org.gradle.configuration.project.BuildScriptProcessor.execute(BuildScriptProcessor.java:26)
29-Mar-2019 15:03:59         at org.gradle.configuration.project.ConfigureActionsProjectEvaluator.evaluate(ConfigureActionsProjectEvaluator.java:34)
29-Mar-2019 15:03:59         at org.gradle.configuration.project.LifecycleProjectEvaluator.evaluate(LifecycleProjectEvaluator.java:55)
29-Mar-2019 15:03:59         ... 52 more
29-Mar-2019 15:03:59 Caused by: org.gradle.internal.resolve.ModuleVersionResolveException: Could not resolve org.springframework.build.gradle:propdeps-plugin:0.0.7.
29-Mar-2019 15:03:59 Required by:
29-Mar-2019 15:03:59     :spring:3.2.19.BUILD-SNAPSHOT
29-Mar-2019 15:03:59         at org.gradle.api.internal.artifacts.ivyservice.ivyresolve.RepositoryChainComponentMetaDataResolver.resolveModule(RepositoryChainComponentMetaDataResolver.java:83)
29-Mar-2019 15:03:59         at org.gradle.api.internal.artifacts.ivyservice.ivyresolve.RepositoryChainComponentMetaDataResolver.resolve(RepositoryChainComponentMetaDataResolver.java:59)
29-Mar-2019 15:03:59         at org.gradle.api.internal.artifacts.ivyservice.clientmodule.ClientModuleResolver.resolve(ClientModuleResolver.java:44)
29-Mar-2019 15:03:59         at org.gradle.api.internal.artifacts.ivyservice.projectmodule.ProjectDependencyResolver.resolve(ProjectDependencyResolver.java:72)
29-Mar-2019 15:03:59         at org.gradle.api.internal.artifacts.ivyservice.resolveengine.graph.DependencyGraphBuilder$ModuleVersionResolveState.resolve(DependencyGraphBuilder.java:575)
29-Mar-2019 15:03:59         at org.gradle.api.internal.artifacts.ivyservice.resolveengine.graph.DependencyGraphBuilder$ModuleVersionResolveState.getMetaData(DependencyGraphBuilder.java:585)
29-Mar-2019 15:03:59         at org.gradle.api.internal.artifacts.ivyservice.resolveengine.graph.DependencyGraphBuilder$DependencyEdge.calculateTargetConfigurations(DependencyGraphBuilder.java:270)
29-Mar-2019 15:03:59         at org.gradle.api.internal.artifacts.ivyservice.resolveengine.graph.DependencyGraphBuilder$DependencyEdge.attachToTargetConfigurations(DependencyGraphBuilder.java:244)
29-Mar-2019 15:03:59         at org.gradle.api.internal.artifacts.ivyservice.resolveengine.graph.DependencyGraphBuilder.traverseGraph(DependencyGraphBuilder.java:156)
29-Mar-2019 15:03:59         at org.gradle.api.internal.artifacts.ivyservice.resolveengine.graph.DependencyGraphBuilder.resolveDependencyGraph(DependencyGraphBuilder.java:94)
29-Mar-2019 15:03:59         at org.gradle.api.internal.artifacts.ivyservice.resolveengine.graph.DependencyGraphBuilder.resolve(DependencyGraphBuilder.java:84)
29-Mar-2019 15:03:59         at org.gradle.api.internal.artifacts.ivyservice.resolveengine.DefaultDependencyResolver$1.execute(DefaultDependencyResolver.java:142)
29-Mar-2019 15:03:59         at org.gradle.api.internal.artifacts.ivyservice.resolveengine.DefaultDependencyResolver$1.execute(DefaultDependencyResolver.java:96)
29-Mar-2019 15:03:59         at org.gradle.internal.Transformers$4.transform(Transformers.java:137)
29-Mar-2019 15:03:59         at org.gradle.api.internal.artifacts.ivyservice.DefaultIvyContextManager.withIvy(DefaultIvyContextManager.java:61)
29-Mar-2019 15:03:59         at org.gradle.api.internal.artifacts.ivyservice.DefaultIvyContextManager.withIvy(DefaultIvyContextManager.java:39)
29-Mar-2019 15:03:59         at org.gradle.api.internal.artifacts.ivyservice.resolveengine.DefaultDependencyResolver.resolve(DefaultDependencyResolver.java:96)
29-Mar-2019 15:03:59         at org.gradle.api.internal.artifacts.ivyservice.CacheLockingArtifactDependencyResolver$1.run(CacheLockingArtifactDependencyResolver.java:42)
29-Mar-2019 15:03:59         at org.gradle.internal.Factories$1.create(Factories.java:22)
29-Mar-2019 15:03:59         at org.gradle.cache.internal.DefaultCacheAccess.useCache(DefaultCacheAccess.java:192)
29-Mar-2019 15:03:59         at org.gradle.cache.internal.DefaultCacheAccess.useCache(DefaultCacheAccess.java:175)
29-Mar-2019 15:03:59         at org.gradle.cache.internal.DefaultPersistentDirectoryStore.useCache(DefaultPersistentDirectoryStore.java:106)
29-Mar-2019 15:03:59         at org.gradle.cache.internal.DefaultCacheFactory$ReferenceTrackingCache.useCache(DefaultCacheFactory.java:187)
29-Mar-2019 15:03:59         at org.gradle.api.internal.artifacts.ivyservice.DefaultCacheLockingManager.useCache(DefaultCacheLockingManager.java:64)
29-Mar-2019 15:03:59         at org.gradle.api.internal.artifacts.ivyservice.CacheLockingArtifactDependencyResolver.resolve(CacheLockingArtifactDependencyResolver.java:40)
29-Mar-2019 15:03:59         at org.gradle.api.internal.artifacts.ivyservice.SelfResolvingDependencyResolver.resolve(SelfResolvingDependencyResolver.java:41)
29-Mar-2019 15:03:59         at org.gradle.api.internal.artifacts.ivyservice.ShortcircuitEmptyConfigsArtifactDependencyResolver.resolve(ShortcircuitEmptyConfigsArtifactDependencyResolver.java:56)
29-Mar-2019 15:03:59         at org.gradle.api.internal.artifacts.ivyservice.ErrorHandlingArtifactDependencyResolver.resolve(ErrorHandlingArtifactDependencyResolver.java:46)
29-Mar-2019 15:03:59         at org.gradle.api.internal.artifacts.ivyservice.DefaultConfigurationResolver.resolve(DefaultConfigurationResolver.java:45)
29-Mar-2019 15:03:59         at org.gradle.api.internal.artifacts.configurations.DefaultConfiguration.resolveGraphIfRequired(DefaultConfiguration.java:363)
29-Mar-2019 15:03:59         at org.gradle.api.internal.artifacts.configurations.DefaultConfiguration.resolveNow(DefaultConfiguration.java:338)
29-Mar-2019 15:03:59         at org.gradle.api.internal.artifacts.configurations.DefaultConfiguration.getResolvedConfiguration(DefaultConfiguration.java:331)
29-Mar-2019 15:03:59         at org.gradle.api.internal.artifacts.configurations.DefaultConfiguration_Decorated.getResolvedConfiguration(Unknown Source)
29-Mar-2019 15:03:59         at org.gradle.api.internal.artifacts.configurations.DefaultConfiguration$ConfigurationFileCollection.getFiles(DefaultConfiguration.java:672)
29-Mar-2019 15:03:59         ... 62 more
29-Mar-2019 15:03:59 Caused by: org.gradle.internal.resolve.ModuleVersionResolveException: Could not resolve org.springframework.build.gradle:propdeps-plugin:0.0.7.
29-Mar-2019 15:03:59         at org.gradle.api.internal.artifacts.ivyservice.ivyresolve.ErrorHandlingModuleComponentRepository$ErrorHandlingModuleComponentRepositoryAccess.resolveComponentMetaData(ErrorHandlingModuleComponentRepository.java:91)
29-Mar-2019 15:03:59         at org.gradle.api.internal.artifacts.ivyservice.ivyresolve.ComponentMetaDataResolveState.process(ComponentMetaDataResolveState.java:66)
29-Mar-2019 15:03:59         at org.gradle.api.internal.artifacts.ivyservice.ivyresolve.ComponentMetaDataResolveState.resolve(ComponentMetaDataResolveState.java:58)
29-Mar-2019 15:03:59         at org.gradle.api.internal.artifacts.ivyservice.ivyresolve.RepositoryChainComponentMetaDataResolver.findBestMatch(RepositoryChainComponentMetaDataResolver.java:116)
29-Mar-2019 15:03:59         at org.gradle.api.internal.artifacts.ivyservice.ivyresolve.RepositoryChainComponentMetaDataResolver.findBestMatch(RepositoryChainComponentMetaDataResolver.java:99)
29-Mar-2019 15:03:59         at org.gradle.api.internal.artifacts.ivyservice.ivyresolve.RepositoryChainComponentMetaDataResolver.resolveModule(RepositoryChainComponentMetaDataResolver.java:72)
29-Mar-2019 15:03:59         ... 95 more
29-Mar-2019 15:03:59 Caused by: org.gradle.internal.resource.ResourceException: Could not get resource 'https://repo.spring.io/plugins-release/org/springframework/build/gradle/propdeps-plugin/0.0.7/propdeps-plugin-0.0.7.pom'.
29-Mar-2019 15:03:59         at org.gradle.internal.resource.ResourceException.failure(ResourceException.java:61)
29-Mar-2019 15:03:59         at org.gradle.api.internal.artifacts.repositories.resolver.DefaultExternalResourceArtifactResolver.downloadStaticResource(DefaultExternalResourceArtifactResolver.java:99)
29-Mar-2019 15:03:59         at org.gradle.api.internal.artifacts.repositories.resolver.DefaultExternalResourceArtifactResolver.resolveMetaDataArtifact(DefaultExternalResourceArtifactResolver.java:56)
29-Mar-2019 15:03:59         at org.gradle.api.internal.artifacts.repositories.resolver.ExternalResourceResolver.parseMetaDataFromArtifact(ExternalResourceResolver.java:168)
29-Mar-2019 15:03:59         at org.gradle.api.internal.artifacts.repositories.resolver.ExternalResourceResolver.resolveStaticDependency(ExternalResourceResolver.java:147)
29-Mar-2019 15:03:59         at org.gradle.api.internal.artifacts.repositories.resolver.MavenResolver.doResolveComponentMetaData(MavenResolver.java:93)
29-Mar-2019 15:03:59         at org.gradle.api.internal.artifacts.repositories.resolver.ExternalResourceResolver$RemoteRepositoryAccess.resolveComponentMetaData(ExternalResourceResolver.java:412)
29-Mar-2019 15:03:59         at org.gradle.api.internal.artifacts.ivyservice.ivyresolve.CacheLockReleasingModuleComponentsRepository$LockReleasingRepositoryAccess$2.run(CacheLockReleasingModuleComponentsRepository.java:71)
29-Mar-2019 15:03:59         at org.gradle.internal.Factories$1.create(Factories.java:22)
29-Mar-2019 15:03:59         at org.gradle.cache.internal.DefaultCacheAccess.longRunningOperation(DefaultCacheAccess.java:242)
29-Mar-2019 15:03:59         at org.gradle.cache.internal.DefaultCacheAccess.longRunningOperation(DefaultCacheAccess.java:313)
29-Mar-2019 15:03:59         at org.gradle.cache.internal.DefaultPersistentDirectoryStore.longRunningOperation(DefaultPersistentDirectoryStore.java:114)
29-Mar-2019 15:03:59         at org.gradle.cache.internal.DefaultCacheFactory$ReferenceTrackingCache.longRunningOperation(DefaultCacheFactory.java:179)
29-Mar-2019 15:03:59         at org.gradle.api.internal.artifacts.ivyservice.DefaultCacheLockingManager.longRunningOperation(DefaultCacheLockingManager.java:56)
29-Mar-2019 15:03:59         at org.gradle.api.internal.artifacts.ivyservice.ivyresolve.CacheLockReleasingModuleComponentsRepository$LockReleasingRepositoryAccess.resolveComponentMetaData(CacheLockReleasingModuleComponentsRepository.java:69)
29-Mar-2019 15:03:59         at org.gradle.api.internal.artifacts.ivyservice.ivyresolve.CachingModuleComponentRepository$ResolveAndCacheRepositoryAccess.resolveComponentMetaData(CachingModuleComponentRepository.java:297)
29-Mar-2019 15:03:59         at org.gradle.api.internal.artifacts.ivyservice.ivyresolve.BaseModuleComponentRepositoryAccess.resolveComponentMetaData(BaseModuleComponentRepositoryAccess.java:42)
29-Mar-2019 15:03:59         at org.gradle.api.internal.artifacts.ivyservice.ivyresolve.memcache.InMemoryCachedModuleComponentRepository$CachedAccess.resolveComponentMetaData(InMemoryCachedModuleComponentRepository.java:76)
29-Mar-2019 15:03:59         at org.gradle.api.internal.artifacts.ivyservice.ivyresolve.ErrorHandlingModuleComponentRepository$ErrorHandlingModuleComponentRepositoryAccess.resolveComponentMetaData(ErrorHandlingModuleComponentRepository.java:89)
29-Mar-2019 15:03:59         ... 100 more
29-Mar-2019 15:03:59 Caused by: org.gradle.internal.resource.transport.http.HttpRequestException: Could not HEAD 'https://repo.spring.io/plugins-release/org/springframework/build/gradle/propdeps-plugin/0.0.7/propdeps-plugin-0.0.7.pom'.
29-Mar-2019 15:03:59         at org.gradle.internal.resource.transport.http.HttpClientHelper.performRequest(HttpClientHelper.java:83)
29-Mar-2019 15:03:59         at org.gradle.internal.resource.transport.http.HttpClientHelper.performRawHead(HttpClientHelper.java:61)
29-Mar-2019 15:03:59         at org.gradle.internal.resource.transport.http.HttpClientHelper.performHead(HttpClientHelper.java:65)
29-Mar-2019 15:03:59         at org.gradle.internal.resource.transport.http.HttpResourceAccessor.getMetaData(HttpResourceAccessor.java:85)
29-Mar-2019 15:03:59         at org.gradle.internal.resource.transfer.DefaultExternalResourceConnector.getMetaData(DefaultExternalResourceConnector.java:47)
29-Mar-2019 15:03:59         at org.gradle.internal.resource.transport.DefaultExternalResourceRepository.getResourceMetaData(DefaultExternalResourceRepository.java:68)
29-Mar-2019 15:03:59         at org.gradle.internal.resource.transfer.DefaultCacheAwareExternalResourceAccessor.getResource(DefaultCacheAwareExternalResourceAccessor.java:84)
29-Mar-2019 15:03:59         at org.gradle.api.internal.artifacts.repositories.resolver.DefaultExternalResourceArtifactResolver.downloadStaticResource(DefaultExternalResourceArtifactResolver.java:90)
29-Mar-2019 15:03:59         ... 117 more
29-Mar-2019 15:03:59 Caused by: javax.net.ssl.SSLPeerUnverifiedException: peer not authenticated
29-Mar-2019 15:03:59         at sun.security.ssl.SSLSessionImpl.getPeerCertificates(SSLSessionImpl.java:421)
29-Mar-2019 15:03:59         at org.apache.http.conn.ssl.AbstractVerifier.verify(AbstractVerifier.java:128)
29-Mar-2019 15:03:59         at org.apache.http.conn.ssl.SSLSocketFactory.connectSocket(SSLSocketFactory.java:572)
29-Mar-2019 15:03:59         at org.apache.http.impl.conn.DefaultClientConnectionOperator.openConnection(DefaultClientConnectionOperator.java:180)
29-Mar-2019 15:03:59         at org.apache.http.impl.conn.ManagedClientConnectionImpl.open(ManagedClientConnectionImpl.java:294)
29-Mar-2019 15:03:59         at org.apache.http.impl.client.DefaultRequestDirector.tryConnect(DefaultRequestDirector.java:640)
29-Mar-2019 15:03:59         at org.apache.http.impl.client.DefaultRequestDirector.execute(DefaultRequestDirector.java:479)
29-Mar-2019 15:03:59         at org.apache.http.impl.client.AbstractHttpClient.execute(AbstractHttpClient.java:906)
29-Mar-2019 15:03:59         at org.apache.http.impl.client.DecompressingHttpClient.execute(DecompressingHttpClient.java:137)
29-Mar-2019 15:03:59         at org.apache.http.impl.client.DecompressingHttpClient.execute(DecompressingHttpClient.java:118)
29-Mar-2019 15:03:59         at org.gradle.internal.resource.transport.http.HttpClientHelper.performHttpRequest(HttpClientHelper.java:113)
29-Mar-2019 15:03:59         at org.gradle.internal.resource.transport.http.HttpClientHelper.executeGetOrHead(HttpClientHelper.java:90)
29-Mar-2019 15:03:59         at org.gradle.internal.resource.transport.http.HttpClientHelper.performRequest(HttpClientHelper.java:81)
29-Mar-2019 15:03:59         ... 124 more
29-Mar-2019 15:03:59 Cause 22: org.gradle.api.ProjectConfigurationException: A problem occurred configuring root project 'spring'.
29-Mar-2019 15:03:59         at org.gradle.configuration.project.LifecycleProjectEvaluator.addConfigurationFailure(LifecycleProjectEvaluator.java:79)
29-Mar-2019 15:03:59         at org.gradle.configuration.project.LifecycleProjectEvaluator.evaluate(LifecycleProjectEvaluator.java:57)
29-Mar-2019 15:03:59         at org.gradle.api.internal.project.AbstractProject.evaluate(AbstractProject.java:488)
29-Mar-2019 15:03:59         at org.gradle.api.internal.project.AbstractProject.evaluate(AbstractProject.java:86)
29-Mar-2019 15:03:59         at org.gradle.execution.TaskPathProjectEvaluator.configureHierarchy(TaskPathProjectEvaluator.java:42)
29-Mar-2019 15:03:59         at org.gradle.configuration.DefaultBuildConfigurer.configure(DefaultBuildConfigurer.java:35)
29-Mar-2019 15:03:59         at org.gradle.initialization.DefaultGradleLauncher$4.run(DefaultGradleLauncher.java:143)
29-Mar-2019 15:03:59         at org.gradle.internal.Factories$1.create(Factories.java:22)
29-Mar-2019 15:03:59         at org.gradle.internal.progress.DefaultBuildOperationExecutor.run(DefaultBuildOperationExecutor.java:62)
29-Mar-2019 15:03:59         at org.gradle.internal.progress.DefaultBuildOperationExecutor.run(DefaultBuildOperationExecutor.java:47)
29-Mar-2019 15:03:59         at org.gradle.initialization.DefaultGradleLauncher.runBuildOperation(DefaultGradleLauncher.java:189)
29-Mar-2019 15:03:59         at org.gradle.initialization.DefaultGradleLauncher.doBuildStages(DefaultGradleLauncher.java:140)
29-Mar-2019 15:03:59         at org.gradle.initialization.DefaultGradleLauncher.access$200(DefaultGradleLauncher.java:35)
29-Mar-2019 15:03:59         at org.gradle.initialization.DefaultGradleLauncher$1.create(DefaultGradleLauncher.java:104)
29-Mar-2019 15:03:59         at org.gradle.initialization.DefaultGradleLauncher$1.create(DefaultGradleLauncher.java:97)
29-Mar-2019 15:03:59         at org.gradle.internal.progress.DefaultBuildOperationExecutor.run(DefaultBuildOperationExecutor.java:62)
29-Mar-2019 15:03:59         at org.gradle.initialization.DefaultGradleLauncher.runRootBuildOperation(DefaultGradleLauncher.java:184)
29-Mar-2019 15:03:59         at org.gradle.initialization.DefaultGradleLauncher.doBuild(DefaultGradleLauncher.java:97)
29-Mar-2019 15:03:59         at org.gradle.initialization.DefaultGradleLauncher.run(DefaultGradleLauncher.java:86)
29-Mar-2019 15:03:59         at org.gradle.launcher.exec.InProcessBuildActionExecuter$DefaultBuildController.run(InProcessBuildActionExecuter.java:93)
29-Mar-2019 15:03:59         at org.gradle.tooling.internal.provider.ExecuteBuildActionRunner.run(ExecuteBuildActionRunner.java:28)
29-Mar-2019 15:03:59         at org.gradle.launcher.exec.ChainingBuildActionRunner.run(ChainingBuildActionRunner.java:35)
29-Mar-2019 15:03:59         at org.gradle.launcher.exec.InProcessBuildActionExecuter.execute(InProcessBuildActionExecuter.java:43)
29-Mar-2019 15:03:59         at org.gradle.launcher.exec.InProcessBuildActionExecuter.execute(InProcessBuildActionExecuter.java:27)
29-Mar-2019 15:03:59         at org.gradle.launcher.exec.ContinuousBuildActionExecuter.execute(ContinuousBuildActionExecuter.java:72)
29-Mar-2019 15:03:59         at org.gradle.launcher.exec.ContinuousBuildActionExecuter.execute(ContinuousBuildActionExecuter.java:44)
29-Mar-2019 15:03:59         at org.gradle.launcher.exec.DaemonUsageSuggestingBuildActionExecuter.execute(DaemonUsageSuggestingBuildActionExecuter.java:50)
29-Mar-2019 15:03:59         at org.gradle.launcher.exec.DaemonUsageSuggestingBuildActionExecuter.execute(DaemonUsageSuggestingBuildActionExecuter.java:27)
29-Mar-2019 15:03:59         at org.gradle.launcher.cli.RunBuildAction.run(RunBuildAction.java:40)
29-Mar-2019 15:03:59         at org.gradle.internal.Actions$RunnableActionAdapter.execute(Actions.java:170)
29-Mar-2019 15:03:59         at org.gradle.launcher.cli.CommandLineActionFactory$ParseAndBuildAction.execute(CommandLineActionFactory.java:237)
29-Mar-2019 15:03:59         at org.gradle.launcher.cli.CommandLineActionFactory$ParseAndBuildAction.execute(CommandLineActionFactory.java:210)
29-Mar-2019 15:03:59         at org.gradle.launcher.cli.JavaRuntimeValidationAction.execute(JavaRuntimeValidationAction.java:35)
29-Mar-2019 15:03:59         at org.gradle.launcher.cli.JavaRuntimeValidationAction.execute(JavaRuntimeValidationAction.java:24)
29-Mar-2019 15:03:59         at org.gradle.launcher.cli.CommandLineActionFactory$WithLogging.execute(CommandLineActionFactory.java:206)
29-Mar-2019 15:03:59         at org.gradle.launcher.cli.CommandLineActionFactory$WithLogging.execute(CommandLineActionFactory.java:169)
29-Mar-2019 15:03:59         at org.gradle.launcher.cli.ExceptionReportingAction.execute(ExceptionReportingAction.java:33)
29-Mar-2019 15:03:59         at org.gradle.launcher.cli.ExceptionReportingAction.execute(ExceptionReportingAction.java:22)
29-Mar-2019 15:03:59         at org.gradle.launcher.Main.doAction(Main.java:33)
29-Mar-2019 15:03:59         at org.gradle.launcher.bootstrap.EntryPoint.run(EntryPoint.java:45)
29-Mar-2019 15:03:59         at sun.reflect.NativeMethodAccessorImpl.invoke0(Native Method)
29-Mar-2019 15:03:59         at sun.reflect.NativeMethodAccessorImpl.invoke(NativeMethodAccessorImpl.java:57)
29-Mar-2019 15:03:59         at sun.reflect.DelegatingMethodAccessorImpl.invoke(DelegatingMethodAccessorImpl.java:43)
29-Mar-2019 15:03:59         at java.lang.reflect.Method.invoke(Method.java:606)
29-Mar-2019 15:03:59         at org.gradle.launcher.bootstrap.ProcessBootstrap.runNoExit(ProcessBootstrap.java:54)
29-Mar-2019 15:03:59         at org.gradle.launcher.bootstrap.ProcessBootstrap.run(ProcessBootstrap.java:35)
29-Mar-2019 15:03:59         at org.gradle.launcher.GradleMain.main(GradleMain.java:23)
29-Mar-2019 15:03:59         at sun.reflect.NativeMethodAccessorImpl.invoke0(Native Method)
29-Mar-2019 15:03:59         at sun.reflect.NativeMethodAccessorImpl.invoke(NativeMethodAccessorImpl.java:57)
29-Mar-2019 15:03:59         at sun.reflect.DelegatingMethodAccessorImpl.invoke(DelegatingMethodAccessorImpl.java:43)
29-Mar-2019 15:03:59         at java.lang.reflect.Method.invoke(Method.java:606)
29-Mar-2019 15:03:59         at org.gradle.wrapper.BootstrapMainStarter.start(BootstrapMainStarter.java:30)
29-Mar-2019 15:03:59         at org.gradle.wrapper.WrapperExecutor.execute(WrapperExecutor.java:127)
29-Mar-2019 15:03:59         at org.gradle.wrapper.GradleWrapperMain.main(GradleWrapperMain.java:55)
29-Mar-2019 15:03:59 Caused by: org.gradle.api.artifacts.ResolveException: Could not resolve all dependencies for configuration ':classpath'.
29-Mar-2019 15:03:59         at org.gradle.api.internal.artifacts.ivyservice.DefaultLenientConfiguration.rethrowFailure(DefaultLenientConfiguration.java:63)
29-Mar-2019 15:03:59         at org.gradle.api.internal.artifacts.ivyservice.DefaultResolvedConfiguration.rethrowFailure(DefaultResolvedConfiguration.java:36)
29-Mar-2019 15:03:59         at org.gradle.api.internal.artifacts.ivyservice.SelfResolvingDependencyResolver$FilesAggregatingResolvedConfiguration.rethrowFailure(SelfResolvingDependencyResolver.java:115)
29-Mar-2019 15:03:59         at org.gradle.api.internal.artifacts.ivyservice.ErrorHandlingArtifactDependencyResolver$ErrorHandlingResolvedConfiguration.rethrowFailure(ErrorHandlingArtifactDependencyResolver.java:191)
29-Mar-2019 15:03:59         at org.gradle.api.internal.artifacts.configurations.DefaultConfiguration$ConfigurationFileCollection.getFiles(DefaultConfiguration.java:674)
29-Mar-2019 15:03:59         at org.gradle.api.internal.artifacts.configurations.DefaultConfiguration.getFiles(DefaultConfiguration.java:284)
29-Mar-2019 15:03:59         at org.gradle.api.internal.artifacts.configurations.DefaultConfiguration_Decorated.getFiles(Unknown Source)
29-Mar-2019 15:03:59         at org.gradle.api.internal.initialization.DefaultScriptHandler.getScriptClassPath(DefaultScriptHandler.java:70)
29-Mar-2019 15:03:59         at org.gradle.plugin.use.internal.DefaultPluginRequestApplicator.defineScriptHandlerClassScope(DefaultPluginRequestApplicator.java:141)
29-Mar-2019 15:03:59         at org.gradle.plugin.use.internal.DefaultPluginRequestApplicator.applyPlugins(DefaultPluginRequestApplicator.java:54)
29-Mar-2019 15:03:59         at org.gradle.configuration.DefaultScriptPluginFactory$ScriptPluginImpl.apply(DefaultScriptPluginFactory.java:129)
29-Mar-2019 15:03:59         at org.gradle.configuration.project.BuildScriptProcessor.execute(BuildScriptProcessor.java:39)
29-Mar-2019 15:03:59         at org.gradle.configuration.project.BuildScriptProcessor.execute(BuildScriptProcessor.java:26)
29-Mar-2019 15:03:59         at org.gradle.configuration.project.ConfigureActionsProjectEvaluator.evaluate(ConfigureActionsProjectEvaluator.java:34)
29-Mar-2019 15:03:59         at org.gradle.configuration.project.LifecycleProjectEvaluator.evaluate(LifecycleProjectEvaluator.java:55)
29-Mar-2019 15:03:59         ... 52 more
29-Mar-2019 15:03:59 Caused by: org.gradle.internal.resolve.ModuleVersionResolveException: Could not resolve org.springframework.build.gradle:propdeps-plugin:0.0.7.
29-Mar-2019 15:03:59 Required by:
29-Mar-2019 15:03:59     :spring:3.2.19.BUILD-SNAPSHOT
29-Mar-2019 15:03:59         at org.gradle.api.internal.artifacts.ivyservice.ivyresolve.RepositoryChainComponentMetaDataResolver.resolveModule(RepositoryChainComponentMetaDataResolver.java:83)
29-Mar-2019 15:03:59         at org.gradle.api.internal.artifacts.ivyservice.ivyresolve.RepositoryChainComponentMetaDataResolver.resolve(RepositoryChainComponentMetaDataResolver.java:59)
29-Mar-2019 15:03:59         at org.gradle.api.internal.artifacts.ivyservice.clientmodule.ClientModuleResolver.resolve(ClientModuleResolver.java:44)
29-Mar-2019 15:03:59         at org.gradle.api.internal.artifacts.ivyservice.projectmodule.ProjectDependencyResolver.resolve(ProjectDependencyResolver.java:72)
29-Mar-2019 15:03:59         at org.gradle.api.internal.artifacts.ivyservice.resolveengine.graph.DependencyGraphBuilder$ModuleVersionResolveState.resolve(DependencyGraphBuilder.java:575)
29-Mar-2019 15:03:59         at org.gradle.api.internal.artifacts.ivyservice.resolveengine.graph.DependencyGraphBuilder$ModuleVersionResolveState.getMetaData(DependencyGraphBuilder.java:585)
29-Mar-2019 15:03:59         at org.gradle.api.internal.artifacts.ivyservice.resolveengine.graph.DependencyGraphBuilder$DependencyEdge.calculateTargetConfigurations(DependencyGraphBuilder.java:270)
29-Mar-2019 15:03:59         at org.gradle.api.internal.artifacts.ivyservice.resolveengine.graph.DependencyGraphBuilder$DependencyEdge.attachToTargetConfigurations(DependencyGraphBuilder.java:244)
29-Mar-2019 15:03:59         at org.gradle.api.internal.artifacts.ivyservice.resolveengine.graph.DependencyGraphBuilder.traverseGraph(DependencyGraphBuilder.java:156)
29-Mar-2019 15:03:59         at org.gradle.api.internal.artifacts.ivyservice.resolveengine.graph.DependencyGraphBuilder.resolveDependencyGraph(DependencyGraphBuilder.java:94)
29-Mar-2019 15:03:59         at org.gradle.api.internal.artifacts.ivyservice.resolveengine.graph.DependencyGraphBuilder.resolve(DependencyGraphBuilder.java:84)
29-Mar-2019 15:03:59         at org.gradle.api.internal.artifacts.ivyservice.resolveengine.DefaultDependencyResolver$1.execute(DefaultDependencyResolver.java:142)
29-Mar-2019 15:03:59         at org.gradle.api.internal.artifacts.ivyservice.resolveengine.DefaultDependencyResolver$1.execute(DefaultDependencyResolver.java:96)
29-Mar-2019 15:03:59         at org.gradle.internal.Transformers$4.transform(Transformers.java:137)
29-Mar-2019 15:03:59         at org.gradle.api.internal.artifacts.ivyservice.DefaultIvyContextManager.withIvy(DefaultIvyContextManager.java:61)
29-Mar-2019 15:03:59         at org.gradle.api.internal.artifacts.ivyservice.DefaultIvyContextManager.withIvy(DefaultIvyContextManager.java:39)
29-Mar-2019 15:03:59         at org.gradle.api.internal.artifacts.ivyservice.resolveengine.DefaultDependencyResolver.resolve(DefaultDependencyResolver.java:96)
29-Mar-2019 15:03:59         at org.gradle.api.internal.artifacts.ivyservice.CacheLockingArtifactDependencyResolver$1.run(CacheLockingArtifactDependencyResolver.java:42)
29-Mar-2019 15:03:59         at org.gradle.internal.Factories$1.create(Factories.java:22)
29-Mar-2019 15:03:59         at org.gradle.cache.internal.DefaultCacheAccess.useCache(DefaultCacheAccess.java:192)
29-Mar-2019 15:03:59         at org.gradle.cache.internal.DefaultCacheAccess.useCache(DefaultCacheAccess.java:175)
29-Mar-2019 15:03:59         at org.gradle.cache.internal.DefaultPersistentDirectoryStore.useCache(DefaultPersistentDirectoryStore.java:106)
29-Mar-2019 15:03:59         at org.gradle.cache.internal.DefaultCacheFactory$ReferenceTrackingCache.useCache(DefaultCacheFactory.java:187)
29-Mar-2019 15:03:59         at org.gradle.api.internal.artifacts.ivyservice.DefaultCacheLockingManager.useCache(DefaultCacheLockingManager.java:64)
29-Mar-2019 15:03:59         at org.gradle.api.internal.artifacts.ivyservice.CacheLockingArtifactDependencyResolver.resolve(CacheLockingArtifactDependencyResolver.java:40)
29-Mar-2019 15:03:59         at org.gradle.api.internal.artifacts.ivyservice.SelfResolvingDependencyResolver.resolve(SelfResolvingDependencyResolver.java:41)
29-Mar-2019 15:03:59         at org.gradle.api.internal.artifacts.ivyservice.ShortcircuitEmptyConfigsArtifactDependencyResolver.resolve(ShortcircuitEmptyConfigsArtifactDependencyResolver.java:56)
29-Mar-2019 15:03:59         at org.gradle.api.internal.artifacts.ivyservice.ErrorHandlingArtifactDependencyResolver.resolve(ErrorHandlingArtifactDependencyResolver.java:46)
29-Mar-2019 15:03:59         at org.gradle.api.internal.artifacts.ivyservice.DefaultConfigurationResolver.resolve(DefaultConfigurationResolver.java:45)
29-Mar-2019 15:03:59         at org.gradle.api.internal.artifacts.configurations.DefaultConfiguration.resolveGraphIfRequired(DefaultConfiguration.java:363)
29-Mar-2019 15:03:59         at org.gradle.api.internal.artifacts.configurations.DefaultConfiguration.resolveNow(DefaultConfiguration.java:338)
29-Mar-2019 15:03:59         at org.gradle.api.internal.artifacts.configurations.DefaultConfiguration.getResolvedConfiguration(DefaultConfiguration.java:331)
29-Mar-2019 15:03:59         at org.gradle.api.internal.artifacts.configurations.DefaultConfiguration_Decorated.getResolvedConfiguration(Unknown Source)
29-Mar-2019 15:03:59         at org.gradle.api.internal.artifacts.configurations.DefaultConfiguration$ConfigurationFileCollection.getFiles(DefaultConfiguration.java:672)
29-Mar-2019 15:03:59         ... 62 more
29-Mar-2019 15:03:59 Caused by: org.gradle.internal.resolve.ModuleVersionResolveException: Could not resolve org.springframework.build.gradle:propdeps-plugin:0.0.7.
29-Mar-2019 15:03:59         at org.gradle.api.internal.artifacts.ivyservice.ivyresolve.ErrorHandlingModuleComponentRepository$ErrorHandlingModuleComponentRepositoryAccess.resolveComponentMetaData(ErrorHandlingModuleComponentRepository.java:91)
29-Mar-2019 15:03:59         at org.gradle.api.internal.artifacts.ivyservice.ivyresolve.ComponentMetaDataResolveState.process(ComponentMetaDataResolveState.java:66)
29-Mar-2019 15:03:59         at org.gradle.api.internal.artifacts.ivyservice.ivyresolve.ComponentMetaDataResolveState.resolve(ComponentMetaDataResolveState.java:58)
29-Mar-2019 15:03:59         at org.gradle.api.internal.artifacts.ivyservice.ivyresolve.RepositoryChainComponentMetaDataResolver.findBestMatch(RepositoryChainComponentMetaDataResolver.java:116)
29-Mar-2019 15:03:59         at org.gradle.api.internal.artifacts.ivyservice.ivyresolve.RepositoryChainComponentMetaDataResolver.findBestMatch(RepositoryChainComponentMetaDataResolver.java:99)
29-Mar-2019 15:03:59         at org.gradle.api.internal.artifacts.ivyservice.ivyresolve.RepositoryChainComponentMetaDataResolver.resolveModule(RepositoryChainComponentMetaDataResolver.java:72)
29-Mar-2019 15:03:59         ... 95 more
29-Mar-2019 15:03:59 Caused by: org.gradle.internal.resource.ResourceException: Could not get resource 'https://repo.spring.io/plugins-release/org/springframework/build/gradle/propdeps-plugin/0.0.7/propdeps-plugin-0.0.7.pom'.
29-Mar-2019 15:03:59         at org.gradle.internal.resource.ResourceException.failure(ResourceException.java:61)
29-Mar-2019 15:03:59         at org.gradle.api.internal.artifacts.repositories.resolver.DefaultExternalResourceArtifactResolver.downloadStaticResource(DefaultExternalResourceArtifactResolver.java:99)
29-Mar-2019 15:03:59         at org.gradle.api.internal.artifacts.repositories.resolver.DefaultExternalResourceArtifactResolver.resolveMetaDataArtifact(DefaultExternalResourceArtifactResolver.java:56)
29-Mar-2019 15:03:59         at org.gradle.api.internal.artifacts.repositories.resolver.ExternalResourceResolver.parseMetaDataFromArtifact(ExternalResourceResolver.java:168)
29-Mar-2019 15:03:59         at org.gradle.api.internal.artifacts.repositories.resolver.ExternalResourceResolver.resolveStaticDependency(ExternalResourceResolver.java:147)
29-Mar-2019 15:03:59         at org.gradle.api.internal.artifacts.repositories.resolver.MavenResolver.doResolveComponentMetaData(MavenResolver.java:93)
29-Mar-2019 15:03:59         at org.gradle.api.internal.artifacts.repositories.resolver.ExternalResourceResolver$RemoteRepositoryAccess.resolveComponentMetaData(ExternalResourceResolver.java:412)
29-Mar-2019 15:03:59         at org.gradle.api.internal.artifacts.ivyservice.ivyresolve.CacheLockReleasingModuleComponentsRepository$LockReleasingRepositoryAccess$2.run(CacheLockReleasingModuleComponentsRepository.java:71)
29-Mar-2019 15:03:59         at org.gradle.internal.Factories$1.create(Factories.java:22)
29-Mar-2019 15:03:59         at org.gradle.cache.internal.DefaultCacheAccess.longRunningOperation(DefaultCacheAccess.java:242)
29-Mar-2019 15:03:59         at org.gradle.cache.internal.DefaultCacheAccess.longRunningOperation(DefaultCacheAccess.java:313)
29-Mar-2019 15:03:59         at org.gradle.cache.internal.DefaultPersistentDirectoryStore.longRunningOperation(DefaultPersistentDirectoryStore.java:114)
29-Mar-2019 15:03:59         at org.gradle.cache.internal.DefaultCacheFactory$ReferenceTrackingCache.longRunningOperation(DefaultCacheFactory.java:179)
29-Mar-2019 15:03:59         at org.gradle.api.internal.artifacts.ivyservice.DefaultCacheLockingManager.longRunningOperation(DefaultCacheLockingManager.java:56)
29-Mar-2019 15:03:59         at org.gradle.api.internal.artifacts.ivyservice.ivyresolve.CacheLockReleasingModuleComponentsRepository$LockReleasingRepositoryAccess.resolveComponentMetaData(CacheLockReleasingModuleComponentsRepository.java:69)
29-Mar-2019 15:03:59         at org.gradle.api.internal.artifacts.ivyservice.ivyresolve.CachingModuleComponentRepository$ResolveAndCacheRepositoryAccess.resolveComponentMetaData(CachingModuleComponentRepository.java:297)
29-Mar-2019 15:03:59         at org.gradle.api.internal.artifacts.ivyservice.ivyresolve.BaseModuleComponentRepositoryAccess.resolveComponentMetaData(BaseModuleComponentRepositoryAccess.java:42)
29-Mar-2019 15:03:59         at org.gradle.api.internal.artifacts.ivyservice.ivyresolve.memcache.InMemoryCachedModuleComponentRepository$CachedAccess.resolveComponentMetaData(InMemoryCachedModuleComponentRepository.java:76)
29-Mar-2019 15:03:59         at org.gradle.api.internal.artifacts.ivyservice.ivyresolve.ErrorHandlingModuleComponentRepository$ErrorHandlingModuleComponentRepositoryAccess.resolveComponentMetaData(ErrorHandlingModuleComponentRepository.java:89)
29-Mar-2019 15:03:59         ... 100 more
29-Mar-2019 15:03:59 Caused by: org.gradle.internal.resource.transport.http.HttpRequestException: Could not HEAD 'https://repo.spring.io/plugins-release/org/springframework/build/gradle/propdeps-plugin/0.0.7/propdeps-plugin-0.0.7.pom'.
29-Mar-2019 15:03:59         at org.gradle.internal.resource.transport.http.HttpClientHelper.performRequest(HttpClientHelper.java:83)
29-Mar-2019 15:03:59         at org.gradle.internal.resource.transport.http.HttpClientHelper.performRawHead(HttpClientHelper.java:61)
29-Mar-2019 15:03:59         at org.gradle.internal.resource.transport.http.HttpClientHelper.performHead(HttpClientHelper.java:65)
29-Mar-2019 15:03:59         at org.gradle.internal.resource.transport.http.HttpResourceAccessor.getMetaData(HttpResourceAccessor.java:85)
29-Mar-2019 15:03:59         at org.gradle.internal.resource.transfer.DefaultExternalResourceConnector.getMetaData(DefaultExternalResourceConnector.java:47)
29-Mar-2019 15:03:59         at org.gradle.internal.resource.transport.DefaultExternalResourceRepository.getResourceMetaData(DefaultExternalResourceRepository.java:68)
29-Mar-2019 15:03:59         at org.gradle.internal.resource.transfer.DefaultCacheAwareExternalResourceAccessor.getResource(DefaultCacheAwareExternalResourceAccessor.java:84)
29-Mar-2019 15:03:59         at org.gradle.api.internal.artifacts.repositories.resolver.DefaultExternalResourceArtifactResolver.downloadStaticResource(DefaultExternalResourceArtifactResolver.java:90)
29-Mar-2019 15:03:59         ... 117 more
29-Mar-2019 15:03:59 Caused by: javax.net.ssl.SSLPeerUnverifiedException: peer not authenticated
29-Mar-2019 15:03:59         at sun.security.ssl.SSLSessionImpl.getPeerCertificates(SSLSessionImpl.java:421)
29-Mar-2019 15:03:59         at org.apache.http.conn.ssl.AbstractVerifier.verify(AbstractVerifier.java:128)
29-Mar-2019 15:03:59         at org.apache.http.conn.ssl.SSLSocketFactory.connectSocket(SSLSocketFactory.java:572)
29-Mar-2019 15:03:59         at org.apache.http.impl.conn.DefaultClientConnectionOperator.openConnection(DefaultClientConnectionOperator.java:180)
29-Mar-2019 15:03:59         at org.apache.http.impl.conn.ManagedClientConnectionImpl.open(ManagedClientConnectionImpl.java:294)
29-Mar-2019 15:03:59         at org.apache.http.impl.client.DefaultRequestDirector.tryConnect(DefaultRequestDirector.java:640)
29-Mar-2019 15:03:59         at org.apache.http.impl.client.DefaultRequestDirector.execute(DefaultRequestDirector.java:479)
29-Mar-2019 15:03:59         at org.apache.http.impl.client.AbstractHttpClient.execute(AbstractHttpClient.java:906)
29-Mar-2019 15:03:59         at org.apache.http.impl.client.DecompressingHttpClient.execute(DecompressingHttpClient.java:137)
29-Mar-2019 15:03:59         at org.apache.http.impl.client.DecompressingHttpClient.execute(DecompressingHttpClient.java:118)
29-Mar-2019 15:03:59         at org.gradle.internal.resource.transport.http.HttpClientHelper.performHttpRequest(HttpClientHelper.java:113)
29-Mar-2019 15:03:59         at org.gradle.internal.resource.transport.http.HttpClientHelper.executeGetOrHead(HttpClientHelper.java:90)
29-Mar-2019 15:03:59         at org.gradle.internal.resource.transport.http.HttpClientHelper.performRequest(HttpClientHelper.java:81)
29-Mar-2019 15:03:59         ... 124 more
29-Mar-2019 15:03:59 Cause 23: org.gradle.api.ProjectConfigurationException: A problem occurred configuring root project 'spring'.
29-Mar-2019 15:03:59         at org.gradle.configuration.project.LifecycleProjectEvaluator.addConfigurationFailure(LifecycleProjectEvaluator.java:79)
29-Mar-2019 15:03:59         at org.gradle.configuration.project.LifecycleProjectEvaluator.evaluate(LifecycleProjectEvaluator.java:57)
29-Mar-2019 15:03:59         at org.gradle.api.internal.project.AbstractProject.evaluate(AbstractProject.java:488)
29-Mar-2019 15:03:59         at org.gradle.api.internal.project.AbstractProject.evaluate(AbstractProject.java:86)
29-Mar-2019 15:03:59         at org.gradle.execution.TaskPathProjectEvaluator.configureHierarchy(TaskPathProjectEvaluator.java:42)
29-Mar-2019 15:03:59         at org.gradle.configuration.DefaultBuildConfigurer.configure(DefaultBuildConfigurer.java:35)
29-Mar-2019 15:03:59         at org.gradle.initialization.DefaultGradleLauncher$4.run(DefaultGradleLauncher.java:143)
29-Mar-2019 15:03:59         at org.gradle.internal.Factories$1.create(Factories.java:22)
29-Mar-2019 15:03:59         at org.gradle.internal.progress.DefaultBuildOperationExecutor.run(DefaultBuildOperationExecutor.java:62)
29-Mar-2019 15:03:59         at org.gradle.internal.progress.DefaultBuildOperationExecutor.run(DefaultBuildOperationExecutor.java:47)
29-Mar-2019 15:03:59         at org.gradle.initialization.DefaultGradleLauncher.runBuildOperation(DefaultGradleLauncher.java:189)
29-Mar-2019 15:03:59         at org.gradle.initialization.DefaultGradleLauncher.doBuildStages(DefaultGradleLauncher.java:140)
29-Mar-2019 15:03:59         at org.gradle.initialization.DefaultGradleLauncher.access$200(DefaultGradleLauncher.java:35)
29-Mar-2019 15:03:59         at org.gradle.initialization.DefaultGradleLauncher$1.create(DefaultGradleLauncher.java:104)
29-Mar-2019 15:03:59         at org.gradle.initialization.DefaultGradleLauncher$1.create(DefaultGradleLauncher.java:97)
29-Mar-2019 15:03:59         at org.gradle.internal.progress.DefaultBuildOperationExecutor.run(DefaultBuildOperationExecutor.java:62)
29-Mar-2019 15:03:59         at org.gradle.initialization.DefaultGradleLauncher.runRootBuildOperation(DefaultGradleLauncher.java:184)
29-Mar-2019 15:03:59         at org.gradle.initialization.DefaultGradleLauncher.doBuild(DefaultGradleLauncher.java:97)
29-Mar-2019 15:03:59         at org.gradle.initialization.DefaultGradleLauncher.run(DefaultGradleLauncher.java:86)
29-Mar-2019 15:03:59         at org.gradle.launcher.exec.InProcessBuildActionExecuter$DefaultBuildController.run(InProcessBuildActionExecuter.java:93)
29-Mar-2019 15:03:59         at org.gradle.tooling.internal.provider.ExecuteBuildActionRunner.run(ExecuteBuildActionRunner.java:28)
29-Mar-2019 15:03:59         at org.gradle.launcher.exec.ChainingBuildActionRunner.run(ChainingBuildActionRunner.java:35)
29-Mar-2019 15:03:59         at org.gradle.launcher.exec.InProcessBuildActionExecuter.execute(InProcessBuildActionExecuter.java:43)
29-Mar-2019 15:03:59         at org.gradle.launcher.exec.InProcessBuildActionExecuter.execute(InProcessBuildActionExecuter.java:27)
29-Mar-2019 15:03:59         at org.gradle.launcher.exec.ContinuousBuildActionExecuter.execute(ContinuousBuildActionExecuter.java:72)
29-Mar-2019 15:03:59         at org.gradle.launcher.exec.ContinuousBuildActionExecuter.execute(ContinuousBuildActionExecuter.java:44)
29-Mar-2019 15:03:59         at org.gradle.launcher.exec.DaemonUsageSuggestingBuildActionExecuter.execute(DaemonUsageSuggestingBuildActionExecuter.java:50)
29-Mar-2019 15:03:59         at org.gradle.launcher.exec.DaemonUsageSuggestingBuildActionExecuter.execute(DaemonUsageSuggestingBuildActionExecuter.java:27)
29-Mar-2019 15:03:59         at org.gradle.launcher.cli.RunBuildAction.run(RunBuildAction.java:40)
29-Mar-2019 15:03:59         at org.gradle.internal.Actions$RunnableActionAdapter.execute(Actions.java:170)
29-Mar-2019 15:03:59         at org.gradle.launcher.cli.CommandLineActionFactory$ParseAndBuildAction.execute(CommandLineActionFactory.java:237)
29-Mar-2019 15:03:59         at org.gradle.launcher.cli.CommandLineActionFactory$ParseAndBuildAction.execute(CommandLineActionFactory.java:210)
29-Mar-2019 15:03:59         at org.gradle.launcher.cli.JavaRuntimeValidationAction.execute(JavaRuntimeValidationAction.java:35)
29-Mar-2019 15:03:59         at org.gradle.launcher.cli.JavaRuntimeValidationAction.execute(JavaRuntimeValidationAction.java:24)
29-Mar-2019 15:03:59         at org.gradle.launcher.cli.CommandLineActionFactory$WithLogging.execute(CommandLineActionFactory.java:206)
29-Mar-2019 15:03:59         at org.gradle.launcher.cli.CommandLineActionFactory$WithLogging.execute(CommandLineActionFactory.java:169)
29-Mar-2019 15:03:59         at org.gradle.launcher.cli.ExceptionReportingAction.execute(ExceptionReportingAction.java:33)
29-Mar-2019 15:03:59         at org.gradle.launcher.cli.ExceptionReportingAction.execute(ExceptionReportingAction.java:22)
29-Mar-2019 15:03:59         at org.gradle.launcher.Main.doAction(Main.java:33)
29-Mar-2019 15:03:59         at org.gradle.launcher.bootstrap.EntryPoint.run(EntryPoint.java:45)
29-Mar-2019 15:03:59         at sun.reflect.NativeMethodAccessorImpl.invoke0(Native Method)
29-Mar-2019 15:03:59         at sun.reflect.NativeMethodAccessorImpl.invoke(NativeMethodAccessorImpl.java:57)
29-Mar-2019 15:03:59         at sun.reflect.DelegatingMethodAccessorImpl.invoke(DelegatingMethodAccessorImpl.java:43)
29-Mar-2019 15:03:59         at java.lang.reflect.Method.invoke(Method.java:606)
29-Mar-2019 15:03:59         at org.gradle.launcher.bootstrap.ProcessBootstrap.runNoExit(ProcessBootstrap.java:54)
29-Mar-2019 15:03:59         at org.gradle.launcher.bootstrap.ProcessBootstrap.run(ProcessBootstrap.java:35)
29-Mar-2019 15:03:59         at org.gradle.launcher.GradleMain.main(GradleMain.java:23)
29-Mar-2019 15:03:59         at sun.reflect.NativeMethodAccessorImpl.invoke0(Native Method)
29-Mar-2019 15:03:59         at sun.reflect.NativeMethodAccessorImpl.invoke(NativeMethodAccessorImpl.java:57)
29-Mar-2019 15:03:59         at sun.reflect.DelegatingMethodAccessorImpl.invoke(DelegatingMethodAccessorImpl.java:43)
29-Mar-2019 15:03:59         at java.lang.reflect.Method.invoke(Method.java:606)
29-Mar-2019 15:03:59         at org.gradle.wrapper.BootstrapMainStarter.start(BootstrapMainStarter.java:30)
29-Mar-2019 15:03:59         at org.gradle.wrapper.WrapperExecutor.execute(WrapperExecutor.java:127)
29-Mar-2019 15:03:59         at org.gradle.wrapper.GradleWrapperMain.main(GradleWrapperMain.java:55)
29-Mar-2019 15:03:59 Caused by: org.gradle.api.artifacts.ResolveException: Could not resolve all dependencies for configuration ':classpath'.
29-Mar-2019 15:03:59         at org.gradle.api.internal.artifacts.ivyservice.DefaultLenientConfiguration.rethrowFailure(DefaultLenientConfiguration.java:63)
29-Mar-2019 15:03:59         at org.gradle.api.internal.artifacts.ivyservice.DefaultResolvedConfiguration.rethrowFailure(DefaultResolvedConfiguration.java:36)
29-Mar-2019 15:03:59         at org.gradle.api.internal.artifacts.ivyservice.SelfResolvingDependencyResolver$FilesAggregatingResolvedConfiguration.rethrowFailure(SelfResolvingDependencyResolver.java:115)
29-Mar-2019 15:03:59         at org.gradle.api.internal.artifacts.ivyservice.ErrorHandlingArtifactDependencyResolver$ErrorHandlingResolvedConfiguration.rethrowFailure(ErrorHandlingArtifactDependencyResolver.java:191)
29-Mar-2019 15:03:59         at org.gradle.api.internal.artifacts.configurations.DefaultConfiguration$ConfigurationFileCollection.getFiles(DefaultConfiguration.java:674)
29-Mar-2019 15:03:59         at org.gradle.api.internal.artifacts.configurations.DefaultConfiguration.getFiles(DefaultConfiguration.java:284)
29-Mar-2019 15:03:59         at org.gradle.api.internal.artifacts.configurations.DefaultConfiguration_Decorated.getFiles(Unknown Source)
29-Mar-2019 15:03:59         at org.gradle.api.internal.initialization.DefaultScriptHandler.getScriptClassPath(DefaultScriptHandler.java:70)
29-Mar-2019 15:03:59         at org.gradle.plugin.use.internal.DefaultPluginRequestApplicator.defineScriptHandlerClassScope(DefaultPluginRequestApplicator.java:141)
29-Mar-2019 15:03:59         at org.gradle.plugin.use.internal.DefaultPluginRequestApplicator.applyPlugins(DefaultPluginRequestApplicator.java:54)
29-Mar-2019 15:03:59         at org.gradle.configuration.DefaultScriptPluginFactory$ScriptPluginImpl.apply(DefaultScriptPluginFactory.java:129)
29-Mar-2019 15:03:59         at org.gradle.configuration.project.BuildScriptProcessor.execute(BuildScriptProcessor.java:39)
29-Mar-2019 15:03:59         at org.gradle.configuration.project.BuildScriptProcessor.execute(BuildScriptProcessor.java:26)
29-Mar-2019 15:03:59         at org.gradle.configuration.project.ConfigureActionsProjectEvaluator.evaluate(ConfigureActionsProjectEvaluator.java:34)
29-Mar-2019 15:03:59         at org.gradle.configuration.project.LifecycleProjectEvaluator.evaluate(LifecycleProjectEvaluator.java:55)
29-Mar-2019 15:03:59         ... 52 more
29-Mar-2019 15:03:59 Caused by: org.gradle.internal.resolve.ModuleVersionResolveException: Could not resolve org.springframework.build.gradle:propdeps-plugin:0.0.7.
29-Mar-2019 15:03:59 Required by:
29-Mar-2019 15:03:59     :spring:3.2.19.BUILD-SNAPSHOT
29-Mar-2019 15:03:59         at org.gradle.api.internal.artifacts.ivyservice.ivyresolve.RepositoryChainComponentMetaDataResolver.resolveModule(RepositoryChainComponentMetaDataResolver.java:83)
29-Mar-2019 15:03:59         at org.gradle.api.internal.artifacts.ivyservice.ivyresolve.RepositoryChainComponentMetaDataResolver.resolve(RepositoryChainComponentMetaDataResolver.java:59)
29-Mar-2019 15:03:59         at org.gradle.api.internal.artifacts.ivyservice.clientmodule.ClientModuleResolver.resolve(ClientModuleResolver.java:44)
29-Mar-2019 15:03:59         at org.gradle.api.internal.artifacts.ivyservice.projectmodule.ProjectDependencyResolver.resolve(ProjectDependencyResolver.java:72)
29-Mar-2019 15:03:59         at org.gradle.api.internal.artifacts.ivyservice.resolveengine.graph.DependencyGraphBuilder$ModuleVersionResolveState.resolve(DependencyGraphBuilder.java:575)
29-Mar-2019 15:03:59         at org.gradle.api.internal.artifacts.ivyservice.resolveengine.graph.DependencyGraphBuilder$ModuleVersionResolveState.getMetaData(DependencyGraphBuilder.java:585)
29-Mar-2019 15:03:59         at org.gradle.api.internal.artifacts.ivyservice.resolveengine.graph.DependencyGraphBuilder$DependencyEdge.calculateTargetConfigurations(DependencyGraphBuilder.java:270)
29-Mar-2019 15:03:59         at org.gradle.api.internal.artifacts.ivyservice.resolveengine.graph.DependencyGraphBuilder$DependencyEdge.attachToTargetConfigurations(DependencyGraphBuilder.java:244)
29-Mar-2019 15:03:59         at org.gradle.api.internal.artifacts.ivyservice.resolveengine.graph.DependencyGraphBuilder.traverseGraph(DependencyGraphBuilder.java:156)
29-Mar-2019 15:03:59         at org.gradle.api.internal.artifacts.ivyservice.resolveengine.graph.DependencyGraphBuilder.resolveDependencyGraph(DependencyGraphBuilder.java:94)
29-Mar-2019 15:03:59         at org.gradle.api.internal.artifacts.ivyservice.resolveengine.graph.DependencyGraphBuilder.resolve(DependencyGraphBuilder.java:84)
29-Mar-2019 15:03:59         at org.gradle.api.internal.artifacts.ivyservice.resolveengine.DefaultDependencyResolver$1.execute(DefaultDependencyResolver.java:142)
29-Mar-2019 15:03:59         at org.gradle.api.internal.artifacts.ivyservice.resolveengine.DefaultDependencyResolver$1.execute(DefaultDependencyResolver.java:96)
29-Mar-2019 15:03:59         at org.gradle.internal.Transformers$4.transform(Transformers.java:137)
29-Mar-2019 15:03:59         at org.gradle.api.internal.artifacts.ivyservice.DefaultIvyContextManager.withIvy(DefaultIvyContextManager.java:61)
29-Mar-2019 15:03:59         at org.gradle.api.internal.artifacts.ivyservice.DefaultIvyContextManager.withIvy(DefaultIvyContextManager.java:39)
29-Mar-2019 15:03:59         at org.gradle.api.internal.artifacts.ivyservice.resolveengine.DefaultDependencyResolver.resolve(DefaultDependencyResolver.java:96)
29-Mar-2019 15:03:59         at org.gradle.api.internal.artifacts.ivyservice.CacheLockingArtifactDependencyResolver$1.run(CacheLockingArtifactDependencyResolver.java:42)
29-Mar-2019 15:03:59         at org.gradle.internal.Factories$1.create(Factories.java:22)
29-Mar-2019 15:03:59         at org.gradle.cache.internal.DefaultCacheAccess.useCache(DefaultCacheAccess.java:192)
29-Mar-2019 15:03:59         at org.gradle.cache.internal.DefaultCacheAccess.useCache(DefaultCacheAccess.java:175)
29-Mar-2019 15:03:59         at org.gradle.cache.internal.DefaultPersistentDirectoryStore.useCache(DefaultPersistentDirectoryStore.java:106)
29-Mar-2019 15:03:59         at org.gradle.cache.internal.DefaultCacheFactory$ReferenceTrackingCache.useCache(DefaultCacheFactory.java:187)
29-Mar-2019 15:03:59         at org.gradle.api.internal.artifacts.ivyservice.DefaultCacheLockingManager.useCache(DefaultCacheLockingManager.java:64)
29-Mar-2019 15:03:59         at org.gradle.api.internal.artifacts.ivyservice.CacheLockingArtifactDependencyResolver.resolve(CacheLockingArtifactDependencyResolver.java:40)
29-Mar-2019 15:03:59         at org.gradle.api.internal.artifacts.ivyservice.SelfResolvingDependencyResolver.resolve(SelfResolvingDependencyResolver.java:41)
29-Mar-2019 15:03:59         at org.gradle.api.internal.artifacts.ivyservice.ShortcircuitEmptyConfigsArtifactDependencyResolver.resolve(ShortcircuitEmptyConfigsArtifactDependencyResolver.java:56)
29-Mar-2019 15:03:59         at org.gradle.api.internal.artifacts.ivyservice.ErrorHandlingArtifactDependencyResolver.resolve(ErrorHandlingArtifactDependencyResolver.java:46)
29-Mar-2019 15:03:59         at org.gradle.api.internal.artifacts.ivyservice.DefaultConfigurationResolver.resolve(DefaultConfigurationResolver.java:45)
29-Mar-2019 15:03:59         at org.gradle.api.internal.artifacts.configurations.DefaultConfiguration.resolveGraphIfRequired(DefaultConfiguration.java:363)
29-Mar-2019 15:03:59         at org.gradle.api.internal.artifacts.configurations.DefaultConfiguration.resolveNow(DefaultConfiguration.java:338)
29-Mar-2019 15:03:59         at org.gradle.api.internal.artifacts.configurations.DefaultConfiguration.getResolvedConfiguration(DefaultConfiguration.java:331)
29-Mar-2019 15:03:59         at org.gradle.api.internal.artifacts.configurations.DefaultConfiguration_Decorated.getResolvedConfiguration(Unknown Source)
29-Mar-2019 15:03:59         at org.gradle.api.internal.artifacts.configurations.DefaultConfiguration$ConfigurationFileCollection.getFiles(DefaultConfiguration.java:672)
29-Mar-2019 15:03:59         ... 62 more
29-Mar-2019 15:03:59 Caused by: org.gradle.internal.resolve.ModuleVersionResolveException: Could not resolve org.springframework.build.gradle:propdeps-plugin:0.0.7.
29-Mar-2019 15:03:59         at org.gradle.api.internal.artifacts.ivyservice.ivyresolve.ErrorHandlingModuleComponentRepository$ErrorHandlingModuleComponentRepositoryAccess.resolveComponentMetaData(ErrorHandlingModuleComponentRepository.java:91)
29-Mar-2019 15:03:59         at org.gradle.api.internal.artifacts.ivyservice.ivyresolve.ComponentMetaDataResolveState.process(ComponentMetaDataResolveState.java:66)
29-Mar-2019 15:03:59         at org.gradle.api.internal.artifacts.ivyservice.ivyresolve.ComponentMetaDataResolveState.resolve(ComponentMetaDataResolveState.java:58)
29-Mar-2019 15:03:59         at org.gradle.api.internal.artifacts.ivyservice.ivyresolve.RepositoryChainComponentMetaDataResolver.findBestMatch(RepositoryChainComponentMetaDataResolver.java:116)
29-Mar-2019 15:03:59         at org.gradle.api.internal.artifacts.ivyservice.ivyresolve.RepositoryChainComponentMetaDataResolver.findBestMatch(RepositoryChainComponentMetaDataResolver.java:99)
29-Mar-2019 15:03:59         at org.gradle.api.internal.artifacts.ivyservice.ivyresolve.RepositoryChainComponentMetaDataResolver.resolveModule(RepositoryChainComponentMetaDataResolver.java:72)
29-Mar-2019 15:03:59         ... 95 more
29-Mar-2019 15:03:59 Caused by: org.gradle.internal.resource.ResourceException: Could not get resource 'https://repo.spring.io/plugins-release/org/springframework/build/gradle/propdeps-plugin/0.0.7/propdeps-plugin-0.0.7.pom'.
29-Mar-2019 15:03:59         at org.gradle.internal.resource.ResourceException.failure(ResourceException.java:61)
29-Mar-2019 15:03:59         at org.gradle.api.internal.artifacts.repositories.resolver.DefaultExternalResourceArtifactResolver.downloadStaticResource(DefaultExternalResourceArtifactResolver.java:99)
29-Mar-2019 15:03:59         at org.gradle.api.internal.artifacts.repositories.resolver.DefaultExternalResourceArtifactResolver.resolveMetaDataArtifact(DefaultExternalResourceArtifactResolver.java:56)
29-Mar-2019 15:03:59         at org.gradle.api.internal.artifacts.repositories.resolver.ExternalResourceResolver.parseMetaDataFromArtifact(ExternalResourceResolver.java:168)
29-Mar-2019 15:03:59         at org.gradle.api.internal.artifacts.repositories.resolver.ExternalResourceResolver.resolveStaticDependency(ExternalResourceResolver.java:147)
29-Mar-2019 15:03:59         at org.gradle.api.internal.artifacts.repositories.resolver.MavenResolver.doResolveComponentMetaData(MavenResolver.java:93)
29-Mar-2019 15:03:59         at org.gradle.api.internal.artifacts.repositories.resolver.ExternalResourceResolver$RemoteRepositoryAccess.resolveComponentMetaData(ExternalResourceResolver.java:412)
29-Mar-2019 15:03:59         at org.gradle.api.internal.artifacts.ivyservice.ivyresolve.CacheLockReleasingModuleComponentsRepository$LockReleasingRepositoryAccess$2.run(CacheLockReleasingModuleComponentsRepository.java:71)
29-Mar-2019 15:03:59         at org.gradle.internal.Factories$1.create(Factories.java:22)
29-Mar-2019 15:03:59         at org.gradle.cache.internal.DefaultCacheAccess.longRunningOperation(DefaultCacheAccess.java:242)
29-Mar-2019 15:03:59         at org.gradle.cache.internal.DefaultCacheAccess.longRunningOperation(DefaultCacheAccess.java:313)
29-Mar-2019 15:03:59         at org.gradle.cache.internal.DefaultPersistentDirectoryStore.longRunningOperation(DefaultPersistentDirectoryStore.java:114)
29-Mar-2019 15:03:59         at org.gradle.cache.internal.DefaultCacheFactory$ReferenceTrackingCache.longRunningOperation(DefaultCacheFactory.java:179)
29-Mar-2019 15:03:59         at org.gradle.api.internal.artifacts.ivyservice.DefaultCacheLockingManager.longRunningOperation(DefaultCacheLockingManager.java:56)
29-Mar-2019 15:03:59         at org.gradle.api.internal.artifacts.ivyservice.ivyresolve.CacheLockReleasingModuleComponentsRepository$LockReleasingRepositoryAccess.resolveComponentMetaData(CacheLockReleasingModuleComponentsRepository.java:69)
29-Mar-2019 15:03:59         at org.gradle.api.internal.artifacts.ivyservice.ivyresolve.CachingModuleComponentRepository$ResolveAndCacheRepositoryAccess.resolveComponentMetaData(CachingModuleComponentRepository.java:297)
29-Mar-2019 15:03:59         at org.gradle.api.internal.artifacts.ivyservice.ivyresolve.BaseModuleComponentRepositoryAccess.resolveComponentMetaData(BaseModuleComponentRepositoryAccess.java:42)
29-Mar-2019 15:03:59         at org.gradle.api.internal.artifacts.ivyservice.ivyresolve.memcache.InMemoryCachedModuleComponentRepository$CachedAccess.resolveComponentMetaData(InMemoryCachedModuleComponentRepository.java:76)
29-Mar-2019 15:03:59         at org.gradle.api.internal.artifacts.ivyservice.ivyresolve.ErrorHandlingModuleComponentRepository$ErrorHandlingModuleComponentRepositoryAccess.resolveComponentMetaData(ErrorHandlingModuleComponentRepository.java:89)
29-Mar-2019 15:03:59         ... 100 more
29-Mar-2019 15:03:59 Caused by: org.gradle.internal.resource.transport.http.HttpRequestException: Could not HEAD 'https://repo.spring.io/plugins-release/org/springframework/build/gradle/propdeps-plugin/0.0.7/propdeps-plugin-0.0.7.pom'.
29-Mar-2019 15:03:59         at org.gradle.internal.resource.transport.http.HttpClientHelper.performRequest(HttpClientHelper.java:83)
29-Mar-2019 15:03:59         at org.gradle.internal.resource.transport.http.HttpClientHelper.performRawHead(HttpClientHelper.java:61)
29-Mar-2019 15:03:59         at org.gradle.internal.resource.transport.http.HttpClientHelper.performHead(HttpClientHelper.java:65)
29-Mar-2019 15:03:59         at org.gradle.internal.resource.transport.http.HttpResourceAccessor.getMetaData(HttpResourceAccessor.java:85)
29-Mar-2019 15:03:59         at org.gradle.internal.resource.transfer.DefaultExternalResourceConnector.getMetaData(DefaultExternalResourceConnector.java:47)
29-Mar-2019 15:03:59         at org.gradle.internal.resource.transport.DefaultExternalResourceRepository.getResourceMetaData(DefaultExternalResourceRepository.java:68)
29-Mar-2019 15:03:59         at org.gradle.internal.resource.transfer.DefaultCacheAwareExternalResourceAccessor.getResource(DefaultCacheAwareExternalResourceAccessor.java:84)
29-Mar-2019 15:03:59         at org.gradle.api.internal.artifacts.repositories.resolver.DefaultExternalResourceArtifactResolver.downloadStaticResource(DefaultExternalResourceArtifactResolver.java:90)
29-Mar-2019 15:03:59         ... 117 more
29-Mar-2019 15:03:59 Caused by: javax.net.ssl.SSLPeerUnverifiedException: peer not authenticated
29-Mar-2019 15:03:59         at sun.security.ssl.SSLSessionImpl.getPeerCertificates(SSLSessionImpl.java:421)
29-Mar-2019 15:03:59         at org.apache.http.conn.ssl.AbstractVerifier.verify(AbstractVerifier.java:128)
29-Mar-2019 15:03:59         at org.apache.http.conn.ssl.SSLSocketFactory.connectSocket(SSLSocketFactory.java:572)
29-Mar-2019 15:03:59         at org.apache.http.impl.conn.DefaultClientConnectionOperator.openConnection(DefaultClientConnectionOperator.java:180)
29-Mar-2019 15:03:59         at org.apache.http.impl.conn.ManagedClientConnectionImpl.open(ManagedClientConnectionImpl.java:294)
29-Mar-2019 15:03:59         at org.apache.http.impl.client.DefaultRequestDirector.tryConnect(DefaultRequestDirector.java:640)
29-Mar-2019 15:03:59         at org.apache.http.impl.client.DefaultRequestDirector.execute(DefaultRequestDirector.java:479)
29-Mar-2019 15:03:59         at org.apache.http.impl.client.AbstractHttpClient.execute(AbstractHttpClient.java:906)
29-Mar-2019 15:03:59         at org.apache.http.impl.client.DecompressingHttpClient.execute(DecompressingHttpClient.java:137)
29-Mar-2019 15:03:59         at org.apache.http.impl.client.DecompressingHttpClient.execute(DecompressingHttpClient.java:118)
29-Mar-2019 15:03:59         at org.gradle.internal.resource.transport.http.HttpClientHelper.performHttpRequest(HttpClientHelper.java:113)
29-Mar-2019 15:03:59         at org.gradle.internal.resource.transport.http.HttpClientHelper.executeGetOrHead(HttpClientHelper.java:90)
29-Mar-2019 15:03:59         at org.gradle.internal.resource.transport.http.HttpClientHelper.performRequest(HttpClientHelper.java:81)
29-Mar-2019 15:03:59         ... 124 more
29-Mar-2019 15:03:59 Cause 24: org.gradle.api.ProjectConfigurationException: A problem occurred configuring root project 'spring'.
29-Mar-2019 15:03:59         at org.gradle.configuration.project.LifecycleProjectEvaluator.addConfigurationFailure(LifecycleProjectEvaluator.java:79)
29-Mar-2019 15:03:59         at org.gradle.configuration.project.LifecycleProjectEvaluator.evaluate(LifecycleProjectEvaluator.java:57)
29-Mar-2019 15:03:59         at org.gradle.api.internal.project.AbstractProject.evaluate(AbstractProject.java:488)
29-Mar-2019 15:03:59         at org.gradle.api.internal.project.AbstractProject.evaluate(AbstractProject.java:86)
29-Mar-2019 15:03:59         at org.gradle.execution.TaskPathProjectEvaluator.configureHierarchy(TaskPathProjectEvaluator.java:42)
29-Mar-2019 15:03:59         at org.gradle.configuration.DefaultBuildConfigurer.configure(DefaultBuildConfigurer.java:35)
29-Mar-2019 15:03:59         at org.gradle.initialization.DefaultGradleLauncher$4.run(DefaultGradleLauncher.java:143)
29-Mar-2019 15:03:59         at org.gradle.internal.Factories$1.create(Factories.java:22)
29-Mar-2019 15:03:59         at org.gradle.internal.progress.DefaultBuildOperationExecutor.run(DefaultBuildOperationExecutor.java:62)
29-Mar-2019 15:03:59         at org.gradle.internal.progress.DefaultBuildOperationExecutor.run(DefaultBuildOperationExecutor.java:47)
29-Mar-2019 15:03:59         at org.gradle.initialization.DefaultGradleLauncher.runBuildOperation(DefaultGradleLauncher.java:189)
29-Mar-2019 15:03:59         at org.gradle.initialization.DefaultGradleLauncher.doBuildStages(DefaultGradleLauncher.java:140)
29-Mar-2019 15:03:59         at org.gradle.initialization.DefaultGradleLauncher.access$200(DefaultGradleLauncher.java:35)
29-Mar-2019 15:03:59         at org.gradle.initialization.DefaultGradleLauncher$1.create(DefaultGradleLauncher.java:104)
29-Mar-2019 15:03:59         at org.gradle.initialization.DefaultGradleLauncher$1.create(DefaultGradleLauncher.java:97)
29-Mar-2019 15:03:59         at org.gradle.internal.progress.DefaultBuildOperationExecutor.run(DefaultBuildOperationExecutor.java:62)
29-Mar-2019 15:03:59         at org.gradle.initialization.DefaultGradleLauncher.runRootBuildOperation(DefaultGradleLauncher.java:184)
29-Mar-2019 15:03:59         at org.gradle.initialization.DefaultGradleLauncher.doBuild(DefaultGradleLauncher.java:97)
29-Mar-2019 15:03:59         at org.gradle.initialization.DefaultGradleLauncher.run(DefaultGradleLauncher.java:86)
29-Mar-2019 15:03:59         at org.gradle.launcher.exec.InProcessBuildActionExecuter$DefaultBuildController.run(InProcessBuildActionExecuter.java:93)
29-Mar-2019 15:03:59         at org.gradle.tooling.internal.provider.ExecuteBuildActionRunner.run(ExecuteBuildActionRunner.java:28)
29-Mar-2019 15:03:59         at org.gradle.launcher.exec.ChainingBuildActionRunner.run(ChainingBuildActionRunner.java:35)
29-Mar-2019 15:03:59         at org.gradle.launcher.exec.InProcessBuildActionExecuter.execute(InProcessBuildActionExecuter.java:43)
29-Mar-2019 15:03:59         at org.gradle.launcher.exec.InProcessBuildActionExecuter.execute(InProcessBuildActionExecuter.java:27)
29-Mar-2019 15:03:59         at org.gradle.launcher.exec.ContinuousBuildActionExecuter.execute(ContinuousBuildActionExecuter.java:72)
29-Mar-2019 15:03:59         at org.gradle.launcher.exec.ContinuousBuildActionExecuter.execute(ContinuousBuildActionExecuter.java:44)
29-Mar-2019 15:03:59         at org.gradle.launcher.exec.DaemonUsageSuggestingBuildActionExecuter.execute(DaemonUsageSuggestingBuildActionExecuter.java:50)
29-Mar-2019 15:03:59         at org.gradle.launcher.exec.DaemonUsageSuggestingBuildActionExecuter.execute(DaemonUsageSuggestingBuildActionExecuter.java:27)
29-Mar-2019 15:03:59         at org.gradle.launcher.cli.RunBuildAction.run(RunBuildAction.java:40)
29-Mar-2019 15:03:59         at org.gradle.internal.Actions$RunnableActionAdapter.execute(Actions.java:170)
29-Mar-2019 15:03:59         at org.gradle.launcher.cli.CommandLineActionFactory$ParseAndBuildAction.execute(CommandLineActionFactory.java:237)
29-Mar-2019 15:03:59         at org.gradle.launcher.cli.CommandLineActionFactory$ParseAndBuildAction.execute(CommandLineActionFactory.java:210)
29-Mar-2019 15:03:59         at org.gradle.launcher.cli.JavaRuntimeValidationAction.execute(JavaRuntimeValidationAction.java:35)
29-Mar-2019 15:03:59         at org.gradle.launcher.cli.JavaRuntimeValidationAction.execute(JavaRuntimeValidationAction.java:24)
29-Mar-2019 15:03:59         at org.gradle.launcher.cli.CommandLineActionFactory$WithLogging.execute(CommandLineActionFactory.java:206)
29-Mar-2019 15:03:59         at org.gradle.launcher.cli.CommandLineActionFactory$WithLogging.execute(CommandLineActionFactory.java:169)
29-Mar-2019 15:03:59         at org.gradle.launcher.cli.ExceptionReportingAction.execute(ExceptionReportingAction.java:33)
29-Mar-2019 15:03:59         at org.gradle.launcher.cli.ExceptionReportingAction.execute(ExceptionReportingAction.java:22)
29-Mar-2019 15:03:59         at org.gradle.launcher.Main.doAction(Main.java:33)
29-Mar-2019 15:03:59         at org.gradle.launcher.bootstrap.EntryPoint.run(EntryPoint.java:45)
29-Mar-2019 15:03:59         at sun.reflect.NativeMethodAccessorImpl.invoke0(Native Method)
29-Mar-2019 15:03:59         at sun.reflect.NativeMethodAccessorImpl.invoke(NativeMethodAccessorImpl.java:57)
29-Mar-2019 15:03:59         at sun.reflect.DelegatingMethodAccessorImpl.invoke(DelegatingMethodAccessorImpl.java:43)
29-Mar-2019 15:03:59         at java.lang.reflect.Method.invoke(Method.java:606)
29-Mar-2019 15:03:59         at org.gradle.launcher.bootstrap.ProcessBootstrap.runNoExit(ProcessBootstrap.java:54)
29-Mar-2019 15:03:59         at org.gradle.launcher.bootstrap.ProcessBootstrap.run(ProcessBootstrap.java:35)
29-Mar-2019 15:03:59         at org.gradle.launcher.GradleMain.main(GradleMain.java:23)
29-Mar-2019 15:03:59         at sun.reflect.NativeMethodAccessorImpl.invoke0(Native Method)
29-Mar-2019 15:03:59         at sun.reflect.NativeMethodAccessorImpl.invoke(NativeMethodAccessorImpl.java:57)
29-Mar-2019 15:03:59         at sun.reflect.DelegatingMethodAccessorImpl.invoke(DelegatingMethodAccessorImpl.java:43)
29-Mar-2019 15:03:59         at java.lang.reflect.Method.invoke(Method.java:606)
29-Mar-2019 15:03:59         at org.gradle.wrapper.BootstrapMainStarter.start(BootstrapMainStarter.java:30)
29-Mar-2019 15:03:59         at org.gradle.wrapper.WrapperExecutor.execute(WrapperExecutor.java:127)
29-Mar-2019 15:03:59         at org.gradle.wrapper.GradleWrapperMain.main(GradleWrapperMain.java:55)
29-Mar-2019 15:03:59 Caused by: org.gradle.api.artifacts.ResolveException: Could not resolve all dependencies for configuration ':classpath'.
29-Mar-2019 15:03:59         at org.gradle.api.internal.artifacts.ivyservice.DefaultLenientConfiguration.rethrowFailure(DefaultLenientConfiguration.java:63)
29-Mar-2019 15:03:59         at org.gradle.api.internal.artifacts.ivyservice.DefaultResolvedConfiguration.rethrowFailure(DefaultResolvedConfiguration.java:36)
29-Mar-2019 15:03:59         at org.gradle.api.internal.artifacts.ivyservice.SelfResolvingDependencyResolver$FilesAggregatingResolvedConfiguration.rethrowFailure(SelfResolvingDependencyResolver.java:115)
29-Mar-2019 15:03:59         at org.gradle.api.internal.artifacts.ivyservice.ErrorHandlingArtifactDependencyResolver$ErrorHandlingResolvedConfiguration.rethrowFailure(ErrorHandlingArtifactDependencyResolver.java:191)
29-Mar-2019 15:03:59         at org.gradle.api.internal.artifacts.configurations.DefaultConfiguration$ConfigurationFileCollection.getFiles(DefaultConfiguration.java:674)
29-Mar-2019 15:03:59         at org.gradle.api.internal.artifacts.configurations.DefaultConfiguration.getFiles(DefaultConfiguration.java:284)
29-Mar-2019 15:03:59         at org.gradle.api.internal.artifacts.configurations.DefaultConfiguration_Decorated.getFiles(Unknown Source)
29-Mar-2019 15:03:59         at org.gradle.api.internal.initialization.DefaultScriptHandler.getScriptClassPath(DefaultScriptHandler.java:70)
29-Mar-2019 15:03:59         at org.gradle.plugin.use.internal.DefaultPluginRequestApplicator.defineScriptHandlerClassScope(DefaultPluginRequestApplicator.java:141)
29-Mar-2019 15:03:59         at org.gradle.plugin.use.internal.DefaultPluginRequestApplicator.applyPlugins(DefaultPluginRequestApplicator.java:54)
29-Mar-2019 15:03:59         at org.gradle.configuration.DefaultScriptPluginFactory$ScriptPluginImpl.apply(DefaultScriptPluginFactory.java:129)
29-Mar-2019 15:03:59         at org.gradle.configuration.project.BuildScriptProcessor.execute(BuildScriptProcessor.java:39)
29-Mar-2019 15:03:59         at org.gradle.configuration.project.BuildScriptProcessor.execute(BuildScriptProcessor.java:26)
29-Mar-2019 15:03:59         at org.gradle.configuration.project.ConfigureActionsProjectEvaluator.evaluate(ConfigureActionsProjectEvaluator.java:34)
29-Mar-2019 15:03:59         at org.gradle.configuration.project.LifecycleProjectEvaluator.evaluate(LifecycleProjectEvaluator.java:55)
29-Mar-2019 15:03:59         ... 52 more
29-Mar-2019 15:03:59 Caused by: org.gradle.internal.resolve.ModuleVersionResolveException: Could not resolve org.springframework.build.gradle:propdeps-plugin:0.0.7.
29-Mar-2019 15:03:59 Required by:
29-Mar-2019 15:03:59     :spring:3.2.19.BUILD-SNAPSHOT
29-Mar-2019 15:03:59         at org.gradle.api.internal.artifacts.ivyservice.ivyresolve.RepositoryChainComponentMetaDataResolver.resolveModule(RepositoryChainComponentMetaDataResolver.java:83)
29-Mar-2019 15:03:59         at org.gradle.api.internal.artifacts.ivyservice.ivyresolve.RepositoryChainComponentMetaDataResolver.resolve(RepositoryChainComponentMetaDataResolver.java:59)
29-Mar-2019 15:03:59         at org.gradle.api.internal.artifacts.ivyservice.clientmodule.ClientModuleResolver.resolve(ClientModuleResolver.java:44)
29-Mar-2019 15:03:59         at org.gradle.api.internal.artifacts.ivyservice.projectmodule.ProjectDependencyResolver.resolve(ProjectDependencyResolver.java:72)
29-Mar-2019 15:03:59         at org.gradle.api.internal.artifacts.ivyservice.resolveengine.graph.DependencyGraphBuilder$ModuleVersionResolveState.resolve(DependencyGraphBuilder.java:575)
29-Mar-2019 15:03:59         at org.gradle.api.internal.artifacts.ivyservice.resolveengine.graph.DependencyGraphBuilder$ModuleVersionResolveState.getMetaData(DependencyGraphBuilder.java:585)
29-Mar-2019 15:03:59         at org.gradle.api.internal.artifacts.ivyservice.resolveengine.graph.DependencyGraphBuilder$DependencyEdge.calculateTargetConfigurations(DependencyGraphBuilder.java:270)
29-Mar-2019 15:03:59         at org.gradle.api.internal.artifacts.ivyservice.resolveengine.graph.DependencyGraphBuilder$DependencyEdge.attachToTargetConfigurations(DependencyGraphBuilder.java:244)
29-Mar-2019 15:03:59         at org.gradle.api.internal.artifacts.ivyservice.resolveengine.graph.DependencyGraphBuilder.traverseGraph(DependencyGraphBuilder.java:156)
29-Mar-2019 15:03:59         at org.gradle.api.internal.artifacts.ivyservice.resolveengine.graph.DependencyGraphBuilder.resolveDependencyGraph(DependencyGraphBuilder.java:94)
29-Mar-2019 15:03:59         at org.gradle.api.internal.artifacts.ivyservice.resolveengine.graph.DependencyGraphBuilder.resolve(DependencyGraphBuilder.java:84)
29-Mar-2019 15:03:59         at org.gradle.api.internal.artifacts.ivyservice.resolveengine.DefaultDependencyResolver$1.execute(DefaultDependencyResolver.java:142)
29-Mar-2019 15:03:59         at org.gradle.api.internal.artifacts.ivyservice.resolveengine.DefaultDependencyResolver$1.execute(DefaultDependencyResolver.java:96)
29-Mar-2019 15:03:59         at org.gradle.internal.Transformers$4.transform(Transformers.java:137)
29-Mar-2019 15:03:59         at org.gradle.api.internal.artifacts.ivyservice.DefaultIvyContextManager.withIvy(DefaultIvyContextManager.java:61)
29-Mar-2019 15:03:59         at org.gradle.api.internal.artifacts.ivyservice.DefaultIvyContextManager.withIvy(DefaultIvyContextManager.java:39)
29-Mar-2019 15:03:59         at org.gradle.api.internal.artifacts.ivyservice.resolveengine.DefaultDependencyResolver.resolve(DefaultDependencyResolver.java:96)
29-Mar-2019 15:03:59         at org.gradle.api.internal.artifacts.ivyservice.CacheLockingArtifactDependencyResolver$1.run(CacheLockingArtifactDependencyResolver.java:42)
29-Mar-2019 15:03:59         at org.gradle.internal.Factories$1.create(Factories.java:22)
29-Mar-2019 15:03:59         at org.gradle.cache.internal.DefaultCacheAccess.useCache(DefaultCacheAccess.java:192)
29-Mar-2019 15:03:59         at org.gradle.cache.internal.DefaultCacheAccess.useCache(DefaultCacheAccess.java:175)
29-Mar-2019 15:03:59         at org.gradle.cache.internal.DefaultPersistentDirectoryStore.useCache(DefaultPersistentDirectoryStore.java:106)
29-Mar-2019 15:03:59         at org.gradle.cache.internal.DefaultCacheFactory$ReferenceTrackingCache.useCache(DefaultCacheFactory.java:187)
29-Mar-2019 15:03:59         at org.gradle.api.internal.artifacts.ivyservice.DefaultCacheLockingManager.useCache(DefaultCacheLockingManager.java:64)
29-Mar-2019 15:03:59         at org.gradle.api.internal.artifacts.ivyservice.CacheLockingArtifactDependencyResolver.resolve(CacheLockingArtifactDependencyResolver.java:40)
29-Mar-2019 15:03:59         at org.gradle.api.internal.artifacts.ivyservice.SelfResolvingDependencyResolver.resolve(SelfResolvingDependencyResolver.java:41)
29-Mar-2019 15:03:59         at org.gradle.api.internal.artifacts.ivyservice.ShortcircuitEmptyConfigsArtifactDependencyResolver.resolve(ShortcircuitEmptyConfigsArtifactDependencyResolver.java:56)
29-Mar-2019 15:03:59         at org.gradle.api.internal.artifacts.ivyservice.ErrorHandlingArtifactDependencyResolver.resolve(ErrorHandlingArtifactDependencyResolver.java:46)
29-Mar-2019 15:03:59         at org.gradle.api.internal.artifacts.ivyservice.DefaultConfigurationResolver.resolve(DefaultConfigurationResolver.java:45)
29-Mar-2019 15:03:59         at org.gradle.api.internal.artifacts.configurations.DefaultConfiguration.resolveGraphIfRequired(DefaultConfiguration.java:363)
29-Mar-2019 15:03:59         at org.gradle.api.internal.artifacts.configurations.DefaultConfiguration.resolveNow(DefaultConfiguration.java:338)
29-Mar-2019 15:03:59         at org.gradle.api.internal.artifacts.configurations.DefaultConfiguration.getResolvedConfiguration(DefaultConfiguration.java:331)
29-Mar-2019 15:03:59         at org.gradle.api.internal.artifacts.configurations.DefaultConfiguration_Decorated.getResolvedConfiguration(Unknown Source)
29-Mar-2019 15:03:59         at org.gradle.api.internal.artifacts.configurations.DefaultConfiguration$ConfigurationFileCollection.getFiles(DefaultConfiguration.java:672)
29-Mar-2019 15:03:59         ... 62 more
29-Mar-2019 15:03:59 Caused by: org.gradle.internal.resolve.ModuleVersionResolveException: Could not resolve org.springframework.build.gradle:propdeps-plugin:0.0.7.
29-Mar-2019 15:03:59         at org.gradle.api.internal.artifacts.ivyservice.ivyresolve.ErrorHandlingModuleComponentRepository$ErrorHandlingModuleComponentRepositoryAccess.resolveComponentMetaData(ErrorHandlingModuleComponentRepository.java:91)
29-Mar-2019 15:03:59         at org.gradle.api.internal.artifacts.ivyservice.ivyresolve.ComponentMetaDataResolveState.process(ComponentMetaDataResolveState.java:66)
29-Mar-2019 15:03:59         at org.gradle.api.internal.artifacts.ivyservice.ivyresolve.ComponentMetaDataResolveState.resolve(ComponentMetaDataResolveState.java:58)
29-Mar-2019 15:03:59         at org.gradle.api.internal.artifacts.ivyservice.ivyresolve.RepositoryChainComponentMetaDataResolver.findBestMatch(RepositoryChainComponentMetaDataResolver.java:116)
29-Mar-2019 15:03:59         at org.gradle.api.internal.artifacts.ivyservice.ivyresolve.RepositoryChainComponentMetaDataResolver.findBestMatch(RepositoryChainComponentMetaDataResolver.java:99)
29-Mar-2019 15:03:59         at org.gradle.api.internal.artifacts.ivyservice.ivyresolve.RepositoryChainComponentMetaDataResolver.resolveModule(RepositoryChainComponentMetaDataResolver.java:72)
29-Mar-2019 15:03:59         ... 95 more
29-Mar-2019 15:03:59 Caused by: org.gradle.internal.resource.ResourceException: Could not get resource 'https://repo.spring.io/plugins-release/org/springframework/build/gradle/propdeps-plugin/0.0.7/propdeps-plugin-0.0.7.pom'.
29-Mar-2019 15:03:59         at org.gradle.internal.resource.ResourceException.failure(ResourceException.java:61)
29-Mar-2019 15:03:59         at org.gradle.api.internal.artifacts.repositories.resolver.DefaultExternalResourceArtifactResolver.downloadStaticResource(DefaultExternalResourceArtifactResolver.java:99)
29-Mar-2019 15:03:59         at org.gradle.api.internal.artifacts.repositories.resolver.DefaultExternalResourceArtifactResolver.resolveMetaDataArtifact(DefaultExternalResourceArtifactResolver.java:56)
29-Mar-2019 15:03:59         at org.gradle.api.internal.artifacts.repositories.resolver.ExternalResourceResolver.parseMetaDataFromArtifact(ExternalResourceResolver.java:168)
29-Mar-2019 15:03:59         at org.gradle.api.internal.artifacts.repositories.resolver.ExternalResourceResolver.resolveStaticDependency(ExternalResourceResolver.java:147)
29-Mar-2019 15:03:59         at org.gradle.api.internal.artifacts.repositories.resolver.MavenResolver.doResolveComponentMetaData(MavenResolver.java:93)
29-Mar-2019 15:03:59         at org.gradle.api.internal.artifacts.repositories.resolver.ExternalResourceResolver$RemoteRepositoryAccess.resolveComponentMetaData(ExternalResourceResolver.java:412)
29-Mar-2019 15:03:59         at org.gradle.api.internal.artifacts.ivyservice.ivyresolve.CacheLockReleasingModuleComponentsRepository$LockReleasingRepositoryAccess$2.run(CacheLockReleasingModuleComponentsRepository.java:71)
29-Mar-2019 15:03:59         at org.gradle.internal.Factories$1.create(Factories.java:22)
29-Mar-2019 15:03:59         at org.gradle.cache.internal.DefaultCacheAccess.longRunningOperation(DefaultCacheAccess.java:242)
29-Mar-2019 15:03:59         at org.gradle.cache.internal.DefaultCacheAccess.longRunningOperation(DefaultCacheAccess.java:313)
29-Mar-2019 15:03:59         at org.gradle.cache.internal.DefaultPersistentDirectoryStore.longRunningOperation(DefaultPersistentDirectoryStore.java:114)
29-Mar-2019 15:03:59         at org.gradle.cache.internal.DefaultCacheFactory$ReferenceTrackingCache.longRunningOperation(DefaultCacheFactory.java:179)
29-Mar-2019 15:03:59         at org.gradle.api.internal.artifacts.ivyservice.DefaultCacheLockingManager.longRunningOperation(DefaultCacheLockingManager.java:56)
29-Mar-2019 15:03:59         at org.gradle.api.internal.artifacts.ivyservice.ivyresolve.CacheLockReleasingModuleComponentsRepository$LockReleasingRepositoryAccess.resolveComponentMetaData(CacheLockReleasingModuleComponentsRepository.java:69)
29-Mar-2019 15:03:59         at org.gradle.api.internal.artifacts.ivyservice.ivyresolve.CachingModuleComponentRepository$ResolveAndCacheRepositoryAccess.resolveComponentMetaData(CachingModuleComponentRepository.java:297)
29-Mar-2019 15:03:59         at org.gradle.api.internal.artifacts.ivyservice.ivyresolve.BaseModuleComponentRepositoryAccess.resolveComponentMetaData(BaseModuleComponentRepositoryAccess.java:42)
29-Mar-2019 15:03:59         at org.gradle.api.internal.artifacts.ivyservice.ivyresolve.memcache.InMemoryCachedModuleComponentRepository$CachedAccess.resolveComponentMetaData(InMemoryCachedModuleComponentRepository.java:76)
29-Mar-2019 15:03:59         at org.gradle.api.internal.artifacts.ivyservice.ivyresolve.ErrorHandlingModuleComponentRepository$ErrorHandlingModuleComponentRepositoryAccess.resolveComponentMetaData(ErrorHandlingModuleComponentRepository.java:89)
29-Mar-2019 15:03:59         ... 100 more
29-Mar-2019 15:03:59 Caused by: org.gradle.internal.resource.transport.http.HttpRequestException: Could not HEAD 'https://repo.spring.io/plugins-release/org/springframework/build/gradle/propdeps-plugin/0.0.7/propdeps-plugin-0.0.7.pom'.
29-Mar-2019 15:03:59         at org.gradle.internal.resource.transport.http.HttpClientHelper.performRequest(HttpClientHelper.java:83)
29-Mar-2019 15:03:59         at org.gradle.internal.resource.transport.http.HttpClientHelper.performRawHead(HttpClientHelper.java:61)
29-Mar-2019 15:03:59         at org.gradle.internal.resource.transport.http.HttpClientHelper.performHead(HttpClientHelper.java:65)
29-Mar-2019 15:03:59         at org.gradle.internal.resource.transport.http.HttpResourceAccessor.getMetaData(HttpResourceAccessor.java:85)
29-Mar-2019 15:03:59         at org.gradle.internal.resource.transfer.DefaultExternalResourceConnector.getMetaData(DefaultExternalResourceConnector.java:47)
29-Mar-2019 15:03:59         at org.gradle.internal.resource.transport.DefaultExternalResourceRepository.getResourceMetaData(DefaultExternalResourceRepository.java:68)
29-Mar-2019 15:03:59         at org.gradle.internal.resource.transfer.DefaultCacheAwareExternalResourceAccessor.getResource(DefaultCacheAwareExternalResourceAccessor.java:84)
29-Mar-2019 15:03:59         at org.gradle.api.internal.artifacts.repositories.resolver.DefaultExternalResourceArtifactResolver.downloadStaticResource(DefaultExternalResourceArtifactResolver.java:90)
29-Mar-2019 15:03:59         ... 117 more
29-Mar-2019 15:03:59 Caused by: javax.net.ssl.SSLPeerUnverifiedException: peer not authenticated
29-Mar-2019 15:03:59         at sun.security.ssl.SSLSessionImpl.getPeerCertificates(SSLSessionImpl.java:421)
29-Mar-2019 15:03:59         at org.apache.http.conn.ssl.AbstractVerifier.verify(AbstractVerifier.java:128)
29-Mar-2019 15:03:59         at org.apache.http.conn.ssl.SSLSocketFactory.connectSocket(SSLSocketFactory.java:572)
29-Mar-2019 15:03:59         at org.apache.http.impl.conn.DefaultClientConnectionOperator.openConnection(DefaultClientConnectionOperator.java:180)
29-Mar-2019 15:03:59         at org.apache.http.impl.conn.ManagedClientConnectionImpl.open(ManagedClientConnectionImpl.java:294)
29-Mar-2019 15:03:59         at org.apache.http.impl.client.DefaultRequestDirector.tryConnect(DefaultRequestDirector.java:640)
29-Mar-2019 15:03:59         at org.apache.http.impl.client.DefaultRequestDirector.execute(DefaultRequestDirector.java:479)
29-Mar-2019 15:03:59         at org.apache.http.impl.client.AbstractHttpClient.execute(AbstractHttpClient.java:906)
29-Mar-2019 15:03:59         at org.apache.http.impl.client.DecompressingHttpClient.execute(DecompressingHttpClient.java:137)
29-Mar-2019 15:03:59         at org.apache.http.impl.client.DecompressingHttpClient.execute(DecompressingHttpClient.java:118)
29-Mar-2019 15:03:59         at org.gradle.internal.resource.transport.http.HttpClientHelper.performHttpRequest(HttpClientHelper.java:113)
29-Mar-2019 15:03:59         at org.gradle.internal.resource.transport.http.HttpClientHelper.executeGetOrHead(HttpClientHelper.java:90)
29-Mar-2019 15:03:59         at org.gradle.internal.resource.transport.http.HttpClientHelper.performRequest(HttpClientHelper.java:81)
29-Mar-2019 15:03:59         ... 124 more
29-Mar-2019 15:03:59 Cause 25: org.gradle.api.ProjectConfigurationException: A problem occurred configuring root project 'spring'.
29-Mar-2019 15:03:59         at org.gradle.configuration.project.LifecycleProjectEvaluator.addConfigurationFailure(LifecycleProjectEvaluator.java:79)
29-Mar-2019 15:03:59         at org.gradle.configuration.project.LifecycleProjectEvaluator.evaluate(LifecycleProjectEvaluator.java:57)
29-Mar-2019 15:03:59         at org.gradle.api.internal.project.AbstractProject.evaluate(AbstractProject.java:488)
29-Mar-2019 15:03:59         at org.gradle.api.internal.project.AbstractProject.evaluate(AbstractProject.java:86)
29-Mar-2019 15:03:59         at org.gradle.execution.TaskPathProjectEvaluator.configureHierarchy(TaskPathProjectEvaluator.java:42)
29-Mar-2019 15:03:59         at org.gradle.configuration.DefaultBuildConfigurer.configure(DefaultBuildConfigurer.java:35)
29-Mar-2019 15:03:59         at org.gradle.initialization.DefaultGradleLauncher$4.run(DefaultGradleLauncher.java:143)
29-Mar-2019 15:03:59         at org.gradle.internal.Factories$1.create(Factories.java:22)
29-Mar-2019 15:03:59         at org.gradle.internal.progress.DefaultBuildOperationExecutor.run(DefaultBuildOperationExecutor.java:62)
29-Mar-2019 15:03:59         at org.gradle.internal.progress.DefaultBuildOperationExecutor.run(DefaultBuildOperationExecutor.java:47)
29-Mar-2019 15:03:59         at org.gradle.initialization.DefaultGradleLauncher.runBuildOperation(DefaultGradleLauncher.java:189)
29-Mar-2019 15:03:59         at org.gradle.initialization.DefaultGradleLauncher.doBuildStages(DefaultGradleLauncher.java:140)
29-Mar-2019 15:03:59         at org.gradle.initialization.DefaultGradleLauncher.access$200(DefaultGradleLauncher.java:35)
29-Mar-2019 15:03:59         at org.gradle.initialization.DefaultGradleLauncher$1.create(DefaultGradleLauncher.java:104)
29-Mar-2019 15:03:59         at org.gradle.initialization.DefaultGradleLauncher$1.create(DefaultGradleLauncher.java:97)
29-Mar-2019 15:03:59         at org.gradle.internal.progress.DefaultBuildOperationExecutor.run(DefaultBuildOperationExecutor.java:62)
29-Mar-2019 15:03:59         at org.gradle.initialization.DefaultGradleLauncher.runRootBuildOperation(DefaultGradleLauncher.java:184)
29-Mar-2019 15:03:59         at org.gradle.initialization.DefaultGradleLauncher.doBuild(DefaultGradleLauncher.java:97)
29-Mar-2019 15:03:59         at org.gradle.initialization.DefaultGradleLauncher.run(DefaultGradleLauncher.java:86)
29-Mar-2019 15:03:59         at org.gradle.launcher.exec.InProcessBuildActionExecuter$DefaultBuildController.run(InProcessBuildActionExecuter.java:93)
29-Mar-2019 15:03:59         at org.gradle.tooling.internal.provider.ExecuteBuildActionRunner.run(ExecuteBuildActionRunner.java:28)
29-Mar-2019 15:03:59         at org.gradle.launcher.exec.ChainingBuildActionRunner.run(ChainingBuildActionRunner.java:35)
29-Mar-2019 15:03:59         at org.gradle.launcher.exec.InProcessBuildActionExecuter.execute(InProcessBuildActionExecuter.java:43)
29-Mar-2019 15:03:59         at org.gradle.launcher.exec.InProcessBuildActionExecuter.execute(InProcessBuildActionExecuter.java:27)
29-Mar-2019 15:03:59         at org.gradle.launcher.exec.ContinuousBuildActionExecuter.execute(ContinuousBuildActionExecuter.java:72)
29-Mar-2019 15:03:59         at org.gradle.launcher.exec.ContinuousBuildActionExecuter.execute(ContinuousBuildActionExecuter.java:44)
29-Mar-2019 15:03:59         at org.gradle.launcher.exec.DaemonUsageSuggestingBuildActionExecuter.execute(DaemonUsageSuggestingBuildActionExecuter.java:50)
29-Mar-2019 15:03:59         at org.gradle.launcher.exec.DaemonUsageSuggestingBuildActionExecuter.execute(DaemonUsageSuggestingBuildActionExecuter.java:27)
29-Mar-2019 15:03:59         at org.gradle.launcher.cli.RunBuildAction.run(RunBuildAction.java:40)
29-Mar-2019 15:03:59         at org.gradle.internal.Actions$RunnableActionAdapter.execute(Actions.java:170)
29-Mar-2019 15:03:59         at org.gradle.launcher.cli.CommandLineActionFactory$ParseAndBuildAction.execute(CommandLineActionFactory.java:237)
29-Mar-2019 15:03:59         at org.gradle.launcher.cli.CommandLineActionFactory$ParseAndBuildAction.execute(CommandLineActionFactory.java:210)
29-Mar-2019 15:03:59         at org.gradle.launcher.cli.JavaRuntimeValidationAction.execute(JavaRuntimeValidationAction.java:35)
29-Mar-2019 15:03:59         at org.gradle.launcher.cli.JavaRuntimeValidationAction.execute(JavaRuntimeValidationAction.java:24)
29-Mar-2019 15:03:59         at org.gradle.launcher.cli.CommandLineActionFactory$WithLogging.execute(CommandLineActionFactory.java:206)
29-Mar-2019 15:03:59         at org.gradle.launcher.cli.CommandLineActionFactory$WithLogging.execute(CommandLineActionFactory.java:169)
29-Mar-2019 15:03:59         at org.gradle.launcher.cli.ExceptionReportingAction.execute(ExceptionReportingAction.java:33)
29-Mar-2019 15:03:59         at org.gradle.launcher.cli.ExceptionReportingAction.execute(ExceptionReportingAction.java:22)
29-Mar-2019 15:03:59         at org.gradle.launcher.Main.doAction(Main.java:33)
29-Mar-2019 15:03:59         at org.gradle.launcher.bootstrap.EntryPoint.run(EntryPoint.java:45)
29-Mar-2019 15:03:59         at sun.reflect.NativeMethodAccessorImpl.invoke0(Native Method)
29-Mar-2019 15:03:59         at sun.reflect.NativeMethodAccessorImpl.invoke(NativeMethodAccessorImpl.java:57)
29-Mar-2019 15:03:59         at sun.reflect.DelegatingMethodAccessorImpl.invoke(DelegatingMethodAccessorImpl.java:43)
29-Mar-2019 15:03:59         at java.lang.reflect.Method.invoke(Method.java:606)
29-Mar-2019 15:03:59         at org.gradle.launcher.bootstrap.ProcessBootstrap.runNoExit(ProcessBootstrap.java:54)
29-Mar-2019 15:03:59         at org.gradle.launcher.bootstrap.ProcessBootstrap.run(ProcessBootstrap.java:35)
29-Mar-2019 15:03:59         at org.gradle.launcher.GradleMain.main(GradleMain.java:23)
29-Mar-2019 15:03:59         at sun.reflect.NativeMethodAccessorImpl.invoke0(Native Method)
29-Mar-2019 15:03:59         at sun.reflect.NativeMethodAccessorImpl.invoke(NativeMethodAccessorImpl.java:57)
29-Mar-2019 15:03:59         at sun.reflect.DelegatingMethodAccessorImpl.invoke(DelegatingMethodAccessorImpl.java:43)
29-Mar-2019 15:03:59         at java.lang.reflect.Method.invoke(Method.java:606)
29-Mar-2019 15:03:59         at org.gradle.wrapper.BootstrapMainStarter.start(BootstrapMainStarter.java:30)
29-Mar-2019 15:03:59         at org.gradle.wrapper.WrapperExecutor.execute(WrapperExecutor.java:127)
29-Mar-2019 15:03:59         at org.gradle.wrapper.GradleWrapperMain.main(GradleWrapperMain.java:55)
29-Mar-2019 15:03:59 Caused by: org.gradle.api.artifacts.ResolveException: Could not resolve all dependencies for configuration ':classpath'.
29-Mar-2019 15:03:59         at org.gradle.api.internal.artifacts.ivyservice.DefaultLenientConfiguration.rethrowFailure(DefaultLenientConfiguration.java:63)
29-Mar-2019 15:03:59         at org.gradle.api.internal.artifacts.ivyservice.DefaultResolvedConfiguration.rethrowFailure(DefaultResolvedConfiguration.java:36)
29-Mar-2019 15:03:59         at org.gradle.api.internal.artifacts.ivyservice.SelfResolvingDependencyResolver$FilesAggregatingResolvedConfiguration.rethrowFailure(SelfResolvingDependencyResolver.java:115)
29-Mar-2019 15:03:59         at org.gradle.api.internal.artifacts.ivyservice.ErrorHandlingArtifactDependencyResolver$ErrorHandlingResolvedConfiguration.rethrowFailure(ErrorHandlingArtifactDependencyResolver.java:191)
29-Mar-2019 15:03:59         at org.gradle.api.internal.artifacts.configurations.DefaultConfiguration$ConfigurationFileCollection.getFiles(DefaultConfiguration.java:674)
29-Mar-2019 15:03:59         at org.gradle.api.internal.artifacts.configurations.DefaultConfiguration.getFiles(DefaultConfiguration.java:284)
29-Mar-2019 15:03:59         at org.gradle.api.internal.artifacts.configurations.DefaultConfiguration_Decorated.getFiles(Unknown Source)
29-Mar-2019 15:03:59         at org.gradle.api.internal.initialization.DefaultScriptHandler.getScriptClassPath(DefaultScriptHandler.java:70)
29-Mar-2019 15:03:59         at org.gradle.plugin.use.internal.DefaultPluginRequestApplicator.defineScriptHandlerClassScope(DefaultPluginRequestApplicator.java:141)
29-Mar-2019 15:03:59         at org.gradle.plugin.use.internal.DefaultPluginRequestApplicator.applyPlugins(DefaultPluginRequestApplicator.java:54)
29-Mar-2019 15:03:59         at org.gradle.configuration.DefaultScriptPluginFactory$ScriptPluginImpl.apply(DefaultScriptPluginFactory.java:129)
29-Mar-2019 15:03:59         at org.gradle.configuration.project.BuildScriptProcessor.execute(BuildScriptProcessor.java:39)
29-Mar-2019 15:03:59         at org.gradle.configuration.project.BuildScriptProcessor.execute(BuildScriptProcessor.java:26)
29-Mar-2019 15:03:59         at org.gradle.configuration.project.ConfigureActionsProjectEvaluator.evaluate(ConfigureActionsProjectEvaluator.java:34)
29-Mar-2019 15:03:59         at org.gradle.configuration.project.LifecycleProjectEvaluator.evaluate(LifecycleProjectEvaluator.java:55)
29-Mar-2019 15:03:59         ... 52 more
29-Mar-2019 15:03:59 Caused by: org.gradle.internal.resolve.ModuleVersionResolveException: Could not resolve org.springframework.build.gradle:propdeps-plugin:0.0.7.
29-Mar-2019 15:03:59 Required by:
29-Mar-2019 15:03:59     :spring:3.2.19.BUILD-SNAPSHOT
29-Mar-2019 15:03:59         at org.gradle.api.internal.artifacts.ivyservice.ivyresolve.RepositoryChainComponentMetaDataResolver.resolveModule(RepositoryChainComponentMetaDataResolver.java:83)
29-Mar-2019 15:03:59         at org.gradle.api.internal.artifacts.ivyservice.ivyresolve.RepositoryChainComponentMetaDataResolver.resolve(RepositoryChainComponentMetaDataResolver.java:59)
29-Mar-2019 15:03:59         at org.gradle.api.internal.artifacts.ivyservice.clientmodule.ClientModuleResolver.resolve(ClientModuleResolver.java:44)
29-Mar-2019 15:03:59         at org.gradle.api.internal.artifacts.ivyservice.projectmodule.ProjectDependencyResolver.resolve(ProjectDependencyResolver.java:72)
29-Mar-2019 15:03:59         at org.gradle.api.internal.artifacts.ivyservice.resolveengine.graph.DependencyGraphBuilder$ModuleVersionResolveState.resolve(DependencyGraphBuilder.java:575)
29-Mar-2019 15:03:59         at org.gradle.api.internal.artifacts.ivyservice.resolveengine.graph.DependencyGraphBuilder$ModuleVersionResolveState.getMetaData(DependencyGraphBuilder.java:585)
29-Mar-2019 15:03:59         at org.gradle.api.internal.artifacts.ivyservice.resolveengine.graph.DependencyGraphBuilder$DependencyEdge.calculateTargetConfigurations(DependencyGraphBuilder.java:270)
29-Mar-2019 15:03:59         at org.gradle.api.internal.artifacts.ivyservice.resolveengine.graph.DependencyGraphBuilder$DependencyEdge.attachToTargetConfigurations(DependencyGraphBuilder.java:244)
29-Mar-2019 15:03:59         at org.gradle.api.internal.artifacts.ivyservice.resolveengine.graph.DependencyGraphBuilder.traverseGraph(DependencyGraphBuilder.java:156)
29-Mar-2019 15:03:59         at org.gradle.api.internal.artifacts.ivyservice.resolveengine.graph.DependencyGraphBuilder.resolveDependencyGraph(DependencyGraphBuilder.java:94)
29-Mar-2019 15:03:59         at org.gradle.api.internal.artifacts.ivyservice.resolveengine.graph.DependencyGraphBuilder.resolve(DependencyGraphBuilder.java:84)
29-Mar-2019 15:03:59         at org.gradle.api.internal.artifacts.ivyservice.resolveengine.DefaultDependencyResolver$1.execute(DefaultDependencyResolver.java:142)
29-Mar-2019 15:03:59         at org.gradle.api.internal.artifacts.ivyservice.resolveengine.DefaultDependencyResolver$1.execute(DefaultDependencyResolver.java:96)
29-Mar-2019 15:03:59         at org.gradle.internal.Transformers$4.transform(Transformers.java:137)
29-Mar-2019 15:03:59         at org.gradle.api.internal.artifacts.ivyservice.DefaultIvyContextManager.withIvy(DefaultIvyContextManager.java:61)
29-Mar-2019 15:03:59         at org.gradle.api.internal.artifacts.ivyservice.DefaultIvyContextManager.withIvy(DefaultIvyContextManager.java:39)
29-Mar-2019 15:03:59         at org.gradle.api.internal.artifacts.ivyservice.resolveengine.DefaultDependencyResolver.resolve(DefaultDependencyResolver.java:96)
29-Mar-2019 15:03:59         at org.gradle.api.internal.artifacts.ivyservice.CacheLockingArtifactDependencyResolver$1.run(CacheLockingArtifactDependencyResolver.java:42)
29-Mar-2019 15:03:59         at org.gradle.internal.Factories$1.create(Factories.java:22)
29-Mar-2019 15:03:59         at org.gradle.cache.internal.DefaultCacheAccess.useCache(DefaultCacheAccess.java:192)
29-Mar-2019 15:03:59         at org.gradle.cache.internal.DefaultCacheAccess.useCache(DefaultCacheAccess.java:175)
29-Mar-2019 15:03:59         at org.gradle.cache.internal.DefaultPersistentDirectoryStore.useCache(DefaultPersistentDirectoryStore.java:106)
29-Mar-2019 15:03:59         at org.gradle.cache.internal.DefaultCacheFactory$ReferenceTrackingCache.useCache(DefaultCacheFactory.java:187)
29-Mar-2019 15:03:59         at org.gradle.api.internal.artifacts.ivyservice.DefaultCacheLockingManager.useCache(DefaultCacheLockingManager.java:64)
29-Mar-2019 15:03:59         at org.gradle.api.internal.artifacts.ivyservice.CacheLockingArtifactDependencyResolver.resolve(CacheLockingArtifactDependencyResolver.java:40)
29-Mar-2019 15:03:59         at org.gradle.api.internal.artifacts.ivyservice.SelfResolvingDependencyResolver.resolve(SelfResolvingDependencyResolver.java:41)
29-Mar-2019 15:03:59         at org.gradle.api.internal.artifacts.ivyservice.ShortcircuitEmptyConfigsArtifactDependencyResolver.resolve(ShortcircuitEmptyConfigsArtifactDependencyResolver.java:56)
29-Mar-2019 15:03:59         at org.gradle.api.internal.artifacts.ivyservice.ErrorHandlingArtifactDependencyResolver.resolve(ErrorHandlingArtifactDependencyResolver.java:46)
29-Mar-2019 15:03:59         at org.gradle.api.internal.artifacts.ivyservice.DefaultConfigurationResolver.resolve(DefaultConfigurationResolver.java:45)
29-Mar-2019 15:03:59         at org.gradle.api.internal.artifacts.configurations.DefaultConfiguration.resolveGraphIfRequired(DefaultConfiguration.java:363)
29-Mar-2019 15:03:59         at org.gradle.api.internal.artifacts.configurations.DefaultConfiguration.resolveNow(DefaultConfiguration.java:338)
29-Mar-2019 15:03:59         at org.gradle.api.internal.artifacts.configurations.DefaultConfiguration.getResolvedConfiguration(DefaultConfiguration.java:331)
29-Mar-2019 15:03:59         at org.gradle.api.internal.artifacts.configurations.DefaultConfiguration_Decorated.getResolvedConfiguration(Unknown Source)
29-Mar-2019 15:03:59         at org.gradle.api.internal.artifacts.configurations.DefaultConfiguration$ConfigurationFileCollection.getFiles(DefaultConfiguration.java:672)
29-Mar-2019 15:03:59         ... 62 more
29-Mar-2019 15:03:59 Caused by: org.gradle.internal.resolve.ModuleVersionResolveException: Could not resolve org.springframework.build.gradle:propdeps-plugin:0.0.7.
29-Mar-2019 15:03:59         at org.gradle.api.internal.artifacts.ivyservice.ivyresolve.ErrorHandlingModuleComponentRepository$ErrorHandlingModuleComponentRepositoryAccess.resolveComponentMetaData(ErrorHandlingModuleComponentRepository.java:91)
29-Mar-2019 15:03:59         at org.gradle.api.internal.artifacts.ivyservice.ivyresolve.ComponentMetaDataResolveState.process(ComponentMetaDataResolveState.java:66)
29-Mar-2019 15:03:59         at org.gradle.api.internal.artifacts.ivyservice.ivyresolve.ComponentMetaDataResolveState.resolve(ComponentMetaDataResolveState.java:58)
29-Mar-2019 15:03:59         at org.gradle.api.internal.artifacts.ivyservice.ivyresolve.RepositoryChainComponentMetaDataResolver.findBestMatch(RepositoryChainComponentMetaDataResolver.java:116)
29-Mar-2019 15:03:59         at org.gradle.api.internal.artifacts.ivyservice.ivyresolve.RepositoryChainComponentMetaDataResolver.findBestMatch(RepositoryChainComponentMetaDataResolver.java:99)
29-Mar-2019 15:03:59         at org.gradle.api.internal.artifacts.ivyservice.ivyresolve.RepositoryChainComponentMetaDataResolver.resolveModule(RepositoryChainComponentMetaDataResolver.java:72)
29-Mar-2019 15:03:59         ... 95 more
29-Mar-2019 15:03:59 Caused by: org.gradle.internal.resource.ResourceException: Could not get resource 'https://repo.spring.io/plugins-release/org/springframework/build/gradle/propdeps-plugin/0.0.7/propdeps-plugin-0.0.7.pom'.
29-Mar-2019 15:03:59         at org.gradle.internal.resource.ResourceException.failure(ResourceException.java:61)
29-Mar-2019 15:03:59         at org.gradle.api.internal.artifacts.repositories.resolver.DefaultExternalResourceArtifactResolver.downloadStaticResource(DefaultExternalResourceArtifactResolver.java:99)
29-Mar-2019 15:03:59         at org.gradle.api.internal.artifacts.repositories.resolver.DefaultExternalResourceArtifactResolver.resolveMetaDataArtifact(DefaultExternalResourceArtifactResolver.java:56)
29-Mar-2019 15:03:59         at org.gradle.api.internal.artifacts.repositories.resolver.ExternalResourceResolver.parseMetaDataFromArtifact(ExternalResourceResolver.java:168)
29-Mar-2019 15:03:59         at org.gradle.api.internal.artifacts.repositories.resolver.ExternalResourceResolver.resolveStaticDependency(ExternalResourceResolver.java:147)
29-Mar-2019 15:03:59         at org.gradle.api.internal.artifacts.repositories.resolver.MavenResolver.doResolveComponentMetaData(MavenResolver.java:93)
29-Mar-2019 15:03:59         at org.gradle.api.internal.artifacts.repositories.resolver.ExternalResourceResolver$RemoteRepositoryAccess.resolveComponentMetaData(ExternalResourceResolver.java:412)
29-Mar-2019 15:03:59         at org.gradle.api.internal.artifacts.ivyservice.ivyresolve.CacheLockReleasingModuleComponentsRepository$LockReleasingRepositoryAccess$2.run(CacheLockReleasingModuleComponentsRepository.java:71)
29-Mar-2019 15:03:59         at org.gradle.internal.Factories$1.create(Factories.java:22)
29-Mar-2019 15:03:59         at org.gradle.cache.internal.DefaultCacheAccess.longRunningOperation(DefaultCacheAccess.java:242)
29-Mar-2019 15:03:59         at org.gradle.cache.internal.DefaultCacheAccess.longRunningOperation(DefaultCacheAccess.java:313)
29-Mar-2019 15:03:59         at org.gradle.cache.internal.DefaultPersistentDirectoryStore.longRunningOperation(DefaultPersistentDirectoryStore.java:114)
29-Mar-2019 15:03:59         at org.gradle.cache.internal.DefaultCacheFactory$ReferenceTrackingCache.longRunningOperation(DefaultCacheFactory.java:179)
29-Mar-2019 15:03:59         at org.gradle.api.internal.artifacts.ivyservice.DefaultCacheLockingManager.longRunningOperation(DefaultCacheLockingManager.java:56)
29-Mar-2019 15:03:59         at org.gradle.api.internal.artifacts.ivyservice.ivyresolve.CacheLockReleasingModuleComponentsRepository$LockReleasingRepositoryAccess.resolveComponentMetaData(CacheLockReleasingModuleComponentsRepository.java:69)
29-Mar-2019 15:03:59         at org.gradle.api.internal.artifacts.ivyservice.ivyresolve.CachingModuleComponentRepository$ResolveAndCacheRepositoryAccess.resolveComponentMetaData(CachingModuleComponentRepository.java:297)
29-Mar-2019 15:03:59         at org.gradle.api.internal.artifacts.ivyservice.ivyresolve.BaseModuleComponentRepositoryAccess.resolveComponentMetaData(BaseModuleComponentRepositoryAccess.java:42)
29-Mar-2019 15:03:59         at org.gradle.api.internal.artifacts.ivyservice.ivyresolve.memcache.InMemoryCachedModuleComponentRepository$CachedAccess.resolveComponentMetaData(InMemoryCachedModuleComponentRepository.java:76)
29-Mar-2019 15:03:59         at org.gradle.api.internal.artifacts.ivyservice.ivyresolve.ErrorHandlingModuleComponentRepository$ErrorHandlingModuleComponentRepositoryAccess.resolveComponentMetaData(ErrorHandlingModuleComponentRepository.java:89)
29-Mar-2019 15:03:59         ... 100 more
29-Mar-2019 15:03:59 Caused by: org.gradle.internal.resource.transport.http.HttpRequestException: Could not HEAD 'https://repo.spring.io/plugins-release/org/springframework/build/gradle/propdeps-plugin/0.0.7/propdeps-plugin-0.0.7.pom'.
29-Mar-2019 15:03:59         at org.gradle.internal.resource.transport.http.HttpClientHelper.performRequest(HttpClientHelper.java:83)
29-Mar-2019 15:03:59         at org.gradle.internal.resource.transport.http.HttpClientHelper.performRawHead(HttpClientHelper.java:61)
29-Mar-2019 15:03:59         at org.gradle.internal.resource.transport.http.HttpClientHelper.performHead(HttpClientHelper.java:65)
29-Mar-2019 15:03:59         at org.gradle.internal.resource.transport.http.HttpResourceAccessor.getMetaData(HttpResourceAccessor.java:85)
29-Mar-2019 15:03:59         at org.gradle.internal.resource.transfer.DefaultExternalResourceConnector.getMetaData(DefaultExternalResourceConnector.java:47)
29-Mar-2019 15:03:59         at org.gradle.internal.resource.transport.DefaultExternalResourceRepository.getResourceMetaData(DefaultExternalResourceRepository.java:68)
29-Mar-2019 15:03:59         at org.gradle.internal.resource.transfer.DefaultCacheAwareExternalResourceAccessor.getResource(DefaultCacheAwareExternalResourceAccessor.java:84)
29-Mar-2019 15:03:59         at org.gradle.api.internal.artifacts.repositories.resolver.DefaultExternalResourceArtifactResolver.downloadStaticResource(DefaultExternalResourceArtifactResolver.java:90)
29-Mar-2019 15:03:59         ... 117 more
29-Mar-2019 15:03:59 Caused by: javax.net.ssl.SSLPeerUnverifiedException: peer not authenticated
29-Mar-2019 15:03:59         at sun.security.ssl.SSLSessionImpl.getPeerCertificates(SSLSessionImpl.java:421)
29-Mar-2019 15:03:59         at org.apache.http.conn.ssl.AbstractVerifier.verify(AbstractVerifier.java:128)
29-Mar-2019 15:03:59         at org.apache.http.conn.ssl.SSLSocketFactory.connectSocket(SSLSocketFactory.java:572)
29-Mar-2019 15:03:59         at org.apache.http.impl.conn.DefaultClientConnectionOperator.openConnection(DefaultClientConnectionOperator.java:180)
29-Mar-2019 15:03:59         at org.apache.http.impl.conn.ManagedClientConnectionImpl.open(ManagedClientConnectionImpl.java:294)
29-Mar-2019 15:03:59         at org.apache.http.impl.client.DefaultRequestDirector.tryConnect(DefaultRequestDirector.java:640)
29-Mar-2019 15:03:59         at org.apache.http.impl.client.DefaultRequestDirector.execute(DefaultRequestDirector.java:479)
29-Mar-2019 15:03:59         at org.apache.http.impl.client.AbstractHttpClient.execute(AbstractHttpClient.java:906)
29-Mar-2019 15:03:59         at org.apache.http.impl.client.DecompressingHttpClient.execute(DecompressingHttpClient.java:137)
29-Mar-2019 15:03:59         at org.apache.http.impl.client.DecompressingHttpClient.execute(DecompressingHttpClient.java:118)
29-Mar-2019 15:03:59         at org.gradle.internal.resource.transport.http.HttpClientHelper.performHttpRequest(HttpClientHelper.java:113)
29-Mar-2019 15:03:59         at org.gradle.internal.resource.transport.http.HttpClientHelper.executeGetOrHead(HttpClientHelper.java:90)
29-Mar-2019 15:03:59         at org.gradle.internal.resource.transport.http.HttpClientHelper.performRequest(HttpClientHelper.java:81)
29-Mar-2019 15:03:59         ... 124 more
29-Mar-2019 15:03:59
29-Mar-2019 15:03:59 FAILURE: Build failed with an exception.
29-Mar-2019 15:03:59
29-Mar-2019 15:03:59 * What went wrong:
29-Mar-2019 15:03:59 A problem occurred configuring root project 'spring'.
29-Mar-2019 15:03:59 > Could not resolve all dependencies for configuration ':classpath'.
29-Mar-2019 15:03:59    > Could not resolve org.springframework.build.gradle:propdeps-plugin:0.0.7.
29-Mar-2019 15:03:59      Required by:
29-Mar-2019 15:03:59          :spring:3.2.19.BUILD-SNAPSHOT
29-Mar-2019 15:03:59       > Could not resolve org.springframework.build.gradle:propdeps-plugin:0.0.7.
29-Mar-2019 15:03:59          > Could not get resource 'https://repo.spring.io/plugins-release/org/springframework/build/gradle/propdeps-plugin/0.0.7/propdeps-plugin-0.0.7.pom'.
29-Mar-2019 15:03:59             > Could not HEAD 'https://repo.spring.io/plugins-release/org/springframework/build/gradle/propdeps-plugin/0.0.7/propdeps-plugin-0.0.7.pom'.
29-Mar-2019 15:03:59                > peer not authenticated
29-Mar-2019 15:03:59    > Could not resolve io.spring.gradle:docbook-reference-plugin:0.3.1.
29-Mar-2019 15:03:59      Required by:
29-Mar-2019 15:03:59          :spring:3.2.19.BUILD-SNAPSHOT
29-Mar-2019 15:03:59       > Could not resolve io.spring.gradle:docbook-reference-plugin:0.3.1.
29-Mar-2019 15:03:59          > Could not get resource 'https://repo.spring.io/plugins-release/io/spring/gradle/docbook-reference-plugin/0.3.1/docbook-reference-plugin-0.3.1.pom'.
29-Mar-2019 15:03:59             > Could not HEAD 'https://repo.spring.io/plugins-release/io/spring/gradle/docbook-reference-plugin/0.3.1/docbook-reference-plugin-0.3.1.pom'.
29-Mar-2019 15:03:59                > peer not authenticated
29-Mar-2019 15:03:59
29-Mar-2019 15:03:59 * Try:
29-Mar-2019 15:03:59 Run with --info or --debug option to get more log output.
29-Mar-2019 15:03:59
29-Mar-2019 15:03:59 * Exception is:
29-Mar-2019 15:03:59 org.gradle.api.ProjectConfigurationException: A problem occurred configuring root project 'spring'.
29-Mar-2019 15:03:59         at org.gradle.configuration.project.LifecycleProjectEvaluator.addConfigurationFailure(LifecycleProjectEvaluator.java:79)
29-Mar-2019 15:03:59         at org.gradle.configuration.project.LifecycleProjectEvaluator.evaluate(LifecycleProjectEvaluator.java:57)
29-Mar-2019 15:03:59         at org.gradle.api.internal.project.AbstractProject.evaluate(AbstractProject.java:488)
29-Mar-2019 15:03:59         at org.gradle.api.internal.project.AbstractProject.evaluate(AbstractProject.java:86)
29-Mar-2019 15:03:59         at org.gradle.execution.TaskPathProjectEvaluator.configureHierarchy(TaskPathProjectEvaluator.java:42)
29-Mar-2019 15:03:59         at org.gradle.configuration.DefaultBuildConfigurer.configure(DefaultBuildConfigurer.java:35)
29-Mar-2019 15:03:59         at org.gradle.initialization.DefaultGradleLauncher$4.run(DefaultGradleLauncher.java:143)
29-Mar-2019 15:03:59         at org.gradle.internal.Factories$1.create(Factories.java:22)
29-Mar-2019 15:03:59         at org.gradle.internal.progress.DefaultBuildOperationExecutor.run(DefaultBuildOperationExecutor.java:62)
29-Mar-2019 15:03:59         at org.gradle.internal.progress.DefaultBuildOperationExecutor.run(DefaultBuildOperationExecutor.java:47)
29-Mar-2019 15:03:59         at org.gradle.initialization.DefaultGradleLauncher.runBuildOperation(DefaultGradleLauncher.java:189)
29-Mar-2019 15:03:59         at org.gradle.initialization.DefaultGradleLauncher.doBuildStages(DefaultGradleLauncher.java:140)
29-Mar-2019 15:03:59         at org.gradle.initialization.DefaultGradleLauncher.access$200(DefaultGradleLauncher.java:35)
29-Mar-2019 15:03:59         at org.gradle.initialization.DefaultGradleLauncher$1.create(DefaultGradleLauncher.java:104)
29-Mar-2019 15:03:59         at org.gradle.initialization.DefaultGradleLauncher$1.create(DefaultGradleLauncher.java:97)
29-Mar-2019 15:03:59         at org.gradle.internal.progress.DefaultBuildOperationExecutor.run(DefaultBuildOperationExecutor.java:62)
29-Mar-2019 15:03:59         at org.gradle.initialization.DefaultGradleLauncher.runRootBuildOperation(DefaultGradleLauncher.java:184)
29-Mar-2019 15:03:59         at org.gradle.initialization.DefaultGradleLauncher.doBuild(DefaultGradleLauncher.java:97)
29-Mar-2019 15:03:59         at org.gradle.initialization.DefaultGradleLauncher.run(DefaultGradleLauncher.java:86)
29-Mar-2019 15:03:59         at org.gradle.launcher.exec.InProcessBuildActionExecuter$DefaultBuildController.run(InProcessBuildActionExecuter.java:93)
29-Mar-2019 15:03:59         at org.gradle.tooling.internal.provider.ExecuteBuildActionRunner.run(ExecuteBuildActionRunner.java:28)
29-Mar-2019 15:03:59         at org.gradle.launcher.exec.ChainingBuildActionRunner.run(ChainingBuildActionRunner.java:35)
29-Mar-2019 15:03:59         at org.gradle.launcher.exec.InProcessBuildActionExecuter.execute(InProcessBuildActionExecuter.java:43)
29-Mar-2019 15:03:59         at org.gradle.launcher.exec.InProcessBuildActionExecuter.execute(InProcessBuildActionExecuter.java:27)
29-Mar-2019 15:03:59         at org.gradle.launcher.exec.ContinuousBuildActionExecuter.execute(ContinuousBuildActionExecuter.java:72)
29-Mar-2019 15:03:59         at org.gradle.launcher.exec.ContinuousBuildActionExecuter.execute(ContinuousBuildActionExecuter.java:44)
29-Mar-2019 15:03:59         at org.gradle.launcher.exec.DaemonUsageSuggestingBuildActionExecuter.execute(DaemonUsageSuggestingBuildActionExecuter.java:50)
29-Mar-2019 15:03:59         at org.gradle.launcher.exec.DaemonUsageSuggestingBuildActionExecuter.execute(DaemonUsageSuggestingBuildActionExecuter.java:27)
29-Mar-2019 15:03:59         at org.gradle.launcher.cli.RunBuildAction.run(RunBuildAction.java:40)
29-Mar-2019 15:03:59         at org.gradle.internal.Actions$RunnableActionAdapter.execute(Actions.java:170)
29-Mar-2019 15:03:59         at org.gradle.launcher.cli.CommandLineActionFactory$ParseAndBuildAction.execute(CommandLineActionFactory.java:237)
29-Mar-2019 15:03:59         at org.gradle.launcher.cli.CommandLineActionFactory$ParseAndBuildAction.execute(CommandLineActionFactory.java:210)
29-Mar-2019 15:03:59         at org.gradle.launcher.cli.JavaRuntimeValidationAction.execute(JavaRuntimeValidationAction.java:35)
29-Mar-2019 15:03:59         at org.gradle.launcher.cli.JavaRuntimeValidationAction.execute(JavaRuntimeValidationAction.java:24)
29-Mar-2019 15:03:59         at org.gradle.launcher.cli.CommandLineActionFactory$WithLogging.execute(CommandLineActionFactory.java:206)
29-Mar-2019 15:03:59         at org.gradle.launcher.cli.CommandLineActionFactory$WithLogging.execute(CommandLineActionFactory.java:169)
29-Mar-2019 15:03:59         at org.gradle.launcher.cli.ExceptionReportingAction.execute(ExceptionReportingAction.java:33)
29-Mar-2019 15:03:59         at org.gradle.launcher.cli.ExceptionReportingAction.execute(ExceptionReportingAction.java:22)
29-Mar-2019 15:03:59         at org.gradle.launcher.Main.doAction(Main.java:33)
29-Mar-2019 15:03:59         at org.gradle.launcher.bootstrap.EntryPoint.run(EntryPoint.java:45)
29-Mar-2019 15:03:59         at org.gradle.launcher.bootstrap.ProcessBootstrap.runNoExit(ProcessBootstrap.java:54)
29-Mar-2019 15:03:59         at org.gradle.launcher.bootstrap.ProcessBootstrap.run(ProcessBootstrap.java:35)
29-Mar-2019 15:03:59         at org.gradle.launcher.GradleMain.main(GradleMain.java:23)
29-Mar-2019 15:03:59         at org.gradle.wrapper.BootstrapMainStarter.start(BootstrapMainStarter.java:30)
29-Mar-2019 15:03:59         at org.gradle.wrapper.WrapperExecutor.execute(WrapperExecutor.java:127)
29-Mar-2019 15:03:59         at org.gradle.wrapper.GradleWrapperMain.main(GradleWrapperMain.java:55)
29-Mar-2019 15:03:59 Caused by: org.gradle.api.artifacts.ResolveException: Could not resolve all dependencies for configuration ':classpath'.
29-Mar-2019 15:03:59         at org.gradle.api.internal.artifacts.ivyservice.DefaultLenientConfiguration.rethrowFailure(DefaultLenientConfiguration.java:63)
29-Mar-2019 15:03:59         at org.gradle.api.internal.artifacts.ivyservice.DefaultResolvedConfiguration.rethrowFailure(DefaultResolvedConfiguration.java:36)
29-Mar-2019 15:03:59         at org.gradle.api.internal.artifacts.ivyservice.SelfResolvingDependencyResolver$FilesAggregatingResolvedConfiguration.rethrowFailure(SelfResolvingDependencyResolver.java:115)
29-Mar-2019 15:03:59         at org.gradle.api.internal.artifacts.ivyservice.ErrorHandlingArtifactDependencyResolver$ErrorHandlingResolvedConfiguration.rethrowFailure(ErrorHandlingArtifactDependencyResolver.java:191)
29-Mar-2019 15:03:59         at org.gradle.api.internal.artifacts.configurations.DefaultConfiguration$ConfigurationFileCollection.getFiles(DefaultConfiguration.java:674)
29-Mar-2019 15:03:59         at org.gradle.api.internal.artifacts.configurations.DefaultConfiguration.getFiles(DefaultConfiguration.java:284)
29-Mar-2019 15:03:59         at org.gradle.api.internal.artifacts.configurations.DefaultConfiguration_Decorated.getFiles(Unknown Source)
29-Mar-2019 15:03:59         at org.gradle.api.internal.initialization.DefaultScriptHandler.getScriptClassPath(DefaultScriptHandler.java:70)
29-Mar-2019 15:03:59         at org.gradle.plugin.use.internal.DefaultPluginRequestApplicator.defineScriptHandlerClassScope(DefaultPluginRequestApplicator.java:141)
29-Mar-2019 15:03:59         at org.gradle.plugin.use.internal.DefaultPluginRequestApplicator.applyPlugins(DefaultPluginRequestApplicator.java:54)
29-Mar-2019 15:03:59         at org.gradle.configuration.DefaultScriptPluginFactory$ScriptPluginImpl.apply(DefaultScriptPluginFactory.java:129)
29-Mar-2019 15:03:59         at org.gradle.configuration.project.BuildScriptProcessor.execute(BuildScriptProcessor.java:39)
29-Mar-2019 15:03:59         at org.gradle.configuration.project.BuildScriptProcessor.execute(BuildScriptProcessor.java:26)
29-Mar-2019 15:03:59         at org.gradle.configuration.project.ConfigureActionsProjectEvaluator.evaluate(ConfigureActionsProjectEvaluator.java:34)
29-Mar-2019 15:03:59         at org.gradle.configuration.project.LifecycleProjectEvaluator.evaluate(LifecycleProjectEvaluator.java:55)
29-Mar-2019 15:03:59         ... 44 more
29-Mar-2019 15:03:59 Caused by: org.gradle.internal.resolve.ModuleVersionResolveException: Could not resolve org.springframework.build.gradle:propdeps-plugin:0.0.7.
29-Mar-2019 15:03:59 Required by:
29-Mar-2019 15:03:59     :spring:3.2.19.BUILD-SNAPSHOT
29-Mar-2019 15:03:59         at org.gradle.api.internal.artifacts.ivyservice.ivyresolve.RepositoryChainComponentMetaDataResolver.resolveModule(RepositoryChainComponentMetaDataResolver.java:83)
29-Mar-2019 15:03:59         at org.gradle.api.internal.artifacts.ivyservice.ivyresolve.RepositoryChainComponentMetaDataResolver.resolve(RepositoryChainComponentMetaDataResolver.java:59)
29-Mar-2019 15:03:59         at org.gradle.api.internal.artifacts.ivyservice.clientmodule.ClientModuleResolver.resolve(ClientModuleResolver.java:44)
29-Mar-2019 15:03:59         at org.gradle.api.internal.artifacts.ivyservice.projectmodule.ProjectDependencyResolver.resolve(ProjectDependencyResolver.java:72)
29-Mar-2019 15:03:59         at org.gradle.api.internal.artifacts.ivyservice.resolveengine.graph.DependencyGraphBuilder$ModuleVersionResolveState.resolve(DependencyGraphBuilder.java:575)
29-Mar-2019 15:03:59         at org.gradle.api.internal.artifacts.ivyservice.resolveengine.graph.DependencyGraphBuilder$ModuleVersionResolveState.getMetaData(DependencyGraphBuilder.java:585)
29-Mar-2019 15:03:59         at org.gradle.api.internal.artifacts.ivyservice.resolveengine.graph.DependencyGraphBuilder$DependencyEdge.calculateTargetConfigurations(DependencyGraphBuilder.java:270)
29-Mar-2019 15:03:59         at org.gradle.api.internal.artifacts.ivyservice.resolveengine.graph.DependencyGraphBuilder$DependencyEdge.attachToTargetConfigurations(DependencyGraphBuilder.java:244)
29-Mar-2019 15:03:59         at org.gradle.api.internal.artifacts.ivyservice.resolveengine.graph.DependencyGraphBuilder.traverseGraph(DependencyGraphBuilder.java:156)
29-Mar-2019 15:03:59         at org.gradle.api.internal.artifacts.ivyservice.resolveengine.graph.DependencyGraphBuilder.resolveDependencyGraph(DependencyGraphBuilder.java:94)
29-Mar-2019 15:03:59         at org.gradle.api.internal.artifacts.ivyservice.resolveengine.graph.DependencyGraphBuilder.resolve(DependencyGraphBuilder.java:84)
29-Mar-2019 15:03:59         at org.gradle.api.internal.artifacts.ivyservice.resolveengine.DefaultDependencyResolver$1.execute(DefaultDependencyResolver.java:142)
29-Mar-2019 15:03:59         at org.gradle.api.internal.artifacts.ivyservice.resolveengine.DefaultDependencyResolver$1.execute(DefaultDependencyResolver.java:96)
29-Mar-2019 15:03:59         at org.gradle.internal.Transformers$4.transform(Transformers.java:137)
29-Mar-2019 15:03:59         at org.gradle.api.internal.artifacts.ivyservice.DefaultIvyContextManager.withIvy(DefaultIvyContextManager.java:61)
29-Mar-2019 15:03:59         at org.gradle.api.internal.artifacts.ivyservice.DefaultIvyContextManager.withIvy(DefaultIvyContextManager.java:39)
29-Mar-2019 15:03:59         at org.gradle.api.internal.artifacts.ivyservice.resolveengine.DefaultDependencyResolver.resolve(DefaultDependencyResolver.java:96)
29-Mar-2019 15:03:59         at org.gradle.api.internal.artifacts.ivyservice.CacheLockingArtifactDependencyResolver$1.run(CacheLockingArtifactDependencyResolver.java:42)
29-Mar-2019 15:03:59         at org.gradle.internal.Factories$1.create(Factories.java:22)
29-Mar-2019 15:03:59         at org.gradle.cache.internal.DefaultCacheAccess.useCache(DefaultCacheAccess.java:192)
29-Mar-2019 15:03:59         at org.gradle.cache.internal.DefaultCacheAccess.useCache(DefaultCacheAccess.java:175)
29-Mar-2019 15:03:59         at org.gradle.cache.internal.DefaultPersistentDirectoryStore.useCache(DefaultPersistentDirectoryStore.java:106)
29-Mar-2019 15:03:59         at org.gradle.cache.internal.DefaultCacheFactory$ReferenceTrackingCache.useCache(DefaultCacheFactory.java:187)
29-Mar-2019 15:03:59         at org.gradle.api.internal.artifacts.ivyservice.DefaultCacheLockingManager.useCache(DefaultCacheLockingManager.java:64)
29-Mar-2019 15:03:59         at org.gradle.api.internal.artifacts.ivyservice.CacheLockingArtifactDependencyResolver.resolve(CacheLockingArtifactDependencyResolver.java:40)
29-Mar-2019 15:03:59         at org.gradle.api.internal.artifacts.ivyservice.SelfResolvingDependencyResolver.resolve(SelfResolvingDependencyResolver.java:41)
29-Mar-2019 15:03:59         at org.gradle.api.internal.artifacts.ivyservice.ShortcircuitEmptyConfigsArtifactDependencyResolver.resolve(ShortcircuitEmptyConfigsArtifactDependencyResolver.java:56)
29-Mar-2019 15:03:59         at org.gradle.api.internal.artifacts.ivyservice.ErrorHandlingArtifactDependencyResolver.resolve(ErrorHandlingArtifactDependencyResolver.java:46)
29-Mar-2019 15:03:59         at org.gradle.api.internal.artifacts.ivyservice.DefaultConfigurationResolver.resolve(DefaultConfigurationResolver.java:45)
29-Mar-2019 15:03:59         at org.gradle.api.internal.artifacts.configurations.DefaultConfiguration.resolveGraphIfRequired(DefaultConfiguration.java:363)
29-Mar-2019 15:03:59         at org.gradle.api.internal.artifacts.configurations.DefaultConfiguration.resolveNow(DefaultConfiguration.java:338)
29-Mar-2019 15:03:59         at org.gradle.api.internal.artifacts.configurations.DefaultConfiguration.getResolvedConfiguration(DefaultConfiguration.java:331)
29-Mar-2019 15:03:59         at org.gradle.api.internal.artifacts.configurations.DefaultConfiguration_Decorated.getResolvedConfiguration(Unknown Source)
29-Mar-2019 15:03:59         at org.gradle.api.internal.artifacts.configurations.DefaultConfiguration$ConfigurationFileCollection.getFiles(DefaultConfiguration.java:672)
29-Mar-2019 15:03:59         ... 54 more
29-Mar-2019 15:03:59 Caused by: org.gradle.internal.resolve.ModuleVersionResolveException: Could not resolve org.springframework.build.gradle:propdeps-plugin:0.0.7.
29-Mar-2019 15:03:59         at org.gradle.api.internal.artifacts.ivyservice.ivyresolve.ErrorHandlingModuleComponentRepository$ErrorHandlingModuleComponentRepositoryAccess.resolveComponentMetaData(ErrorHandlingModuleComponentRepository.java:91)
29-Mar-2019 15:03:59         at org.gradle.api.internal.artifacts.ivyservice.ivyresolve.ComponentMetaDataResolveState.process(ComponentMetaDataResolveState.java:66)
29-Mar-2019 15:03:59         at org.gradle.api.internal.artifacts.ivyservice.ivyresolve.ComponentMetaDataResolveState.resolve(ComponentMetaDataResolveState.java:58)
29-Mar-2019 15:03:59         at org.gradle.api.internal.artifacts.ivyservice.ivyresolve.RepositoryChainComponentMetaDataResolver.findBestMatch(RepositoryChainComponentMetaDataResolver.java:116)
29-Mar-2019 15:03:59         at org.gradle.api.internal.artifacts.ivyservice.ivyresolve.RepositoryChainComponentMetaDataResolver.findBestMatch(RepositoryChainComponentMetaDataResolver.java:99)
29-Mar-2019 15:03:59         at org.gradle.api.internal.artifacts.ivyservice.ivyresolve.RepositoryChainComponentMetaDataResolver.resolveModule(RepositoryChainComponentMetaDataResolver.java:72)
29-Mar-2019 15:03:59         ... 87 more
29-Mar-2019 15:03:59 Caused by: org.gradle.internal.resource.ResourceException: Could not get resource 'https://repo.spring.io/plugins-release/org/springframework/build/gradle/propdeps-plugin/0.0.7/propdeps-plugin-0.0.7.pom'.
29-Mar-2019 15:03:59         at org.gradle.internal.resource.ResourceException.failure(ResourceException.java:61)
29-Mar-2019 15:03:59         at org.gradle.api.internal.artifacts.repositories.resolver.DefaultExternalResourceArtifactResolver.downloadStaticResource(DefaultExternalResourceArtifactResolver.java:99)
29-Mar-2019 15:03:59         at org.gradle.api.internal.artifacts.repositories.resolver.DefaultExternalResourceArtifactResolver.resolveMetaDataArtifact(DefaultExternalResourceArtifactResolver.java:56)
29-Mar-2019 15:03:59         at org.gradle.api.internal.artifacts.repositories.resolver.ExternalResourceResolver.parseMetaDataFromArtifact(ExternalResourceResolver.java:168)
29-Mar-2019 15:03:59         at org.gradle.api.internal.artifacts.repositories.resolver.ExternalResourceResolver.resolveStaticDependency(ExternalResourceResolver.java:147)
29-Mar-2019 15:03:59         at org.gradle.api.internal.artifacts.repositories.resolver.MavenResolver.doResolveComponentMetaData(MavenResolver.java:93)
29-Mar-2019 15:03:59         at org.gradle.api.internal.artifacts.repositories.resolver.ExternalResourceResolver$RemoteRepositoryAccess.resolveComponentMetaData(ExternalResourceResolver.java:412)
29-Mar-2019 15:03:59         at org.gradle.api.internal.artifacts.ivyservice.ivyresolve.CacheLockReleasingModuleComponentsRepository$LockReleasingRepositoryAccess$2.run(CacheLockReleasingModuleComponentsRepository.java:71)
29-Mar-2019 15:03:59         at org.gradle.internal.Factories$1.create(Factories.java:22)
29-Mar-2019 15:03:59         at org.gradle.cache.internal.DefaultCacheAccess.longRunningOperation(DefaultCacheAccess.java:242)
29-Mar-2019 15:03:59         at org.gradle.cache.internal.DefaultCacheAccess.longRunningOperation(DefaultCacheAccess.java:313)
29-Mar-2019 15:03:59         at org.gradle.cache.internal.DefaultPersistentDirectoryStore.longRunningOperation(DefaultPersistentDirectoryStore.java:114)
29-Mar-2019 15:03:59         at org.gradle.cache.internal.DefaultCacheFactory$ReferenceTrackingCache.longRunningOperation(DefaultCacheFactory.java:179)
29-Mar-2019 15:03:59         at org.gradle.api.internal.artifacts.ivyservice.DefaultCacheLockingManager.longRunningOperation(DefaultCacheLockingManager.java:56)
29-Mar-2019 15:03:59         at org.gradle.api.internal.artifacts.ivyservice.ivyresolve.CacheLockReleasingModuleComponentsRepository$LockReleasingRepositoryAccess.resolveComponentMetaData(CacheLockReleasingModuleComponentsRepository.java:69)
29-Mar-2019 15:03:59         at org.gradle.api.internal.artifacts.ivyservice.ivyresolve.CachingModuleComponentRepository$ResolveAndCacheRepositoryAccess.resolveComponentMetaData(CachingModuleComponentRepository.java:297)
29-Mar-2019 15:03:59         at org.gradle.api.internal.artifacts.ivyservice.ivyresolve.BaseModuleComponentRepositoryAccess.resolveComponentMetaData(BaseModuleComponentRepositoryAccess.java:42)
29-Mar-2019 15:03:59         at org.gradle.api.internal.artifacts.ivyservice.ivyresolve.memcache.InMemoryCachedModuleComponentRepository$CachedAccess.resolveComponentMetaData(InMemoryCachedModuleComponentRepository.java:76)
29-Mar-2019 15:03:59         at org.gradle.api.internal.artifacts.ivyservice.ivyresolve.ErrorHandlingModuleComponentRepository$ErrorHandlingModuleComponentRepositoryAccess.resolveComponentMetaData(ErrorHandlingModuleComponentRepository.java:89)
29-Mar-2019 15:03:59         ... 92 more
29-Mar-2019 15:03:59 Caused by: org.gradle.internal.resource.transport.http.HttpRequestException: Could not HEAD 'https://repo.spring.io/plugins-release/org/springframework/build/gradle/propdeps-plugin/0.0.7/propdeps-plugin-0.0.7.pom'.
29-Mar-2019 15:03:59         at org.gradle.internal.resource.transport.http.HttpClientHelper.performRequest(HttpClientHelper.java:83)
29-Mar-2019 15:03:59         at org.gradle.internal.resource.transport.http.HttpClientHelper.performRawHead(HttpClientHelper.java:61)
29-Mar-2019 15:03:59         at org.gradle.internal.resource.transport.http.HttpClientHelper.performHead(HttpClientHelper.java:65)
29-Mar-2019 15:03:59         at org.gradle.internal.resource.transport.http.HttpResourceAccessor.getMetaData(HttpResourceAccessor.java:85)
29-Mar-2019 15:03:59         at org.gradle.internal.resource.transfer.DefaultExternalResourceConnector.getMetaData(DefaultExternalResourceConnector.java:47)
29-Mar-2019 15:03:59         at org.gradle.internal.resource.transport.DefaultExternalResourceRepository.getResourceMetaData(DefaultExternalResourceRepository.java:68)
29-Mar-2019 15:03:59         at org.gradle.internal.resource.transfer.DefaultCacheAwareExternalResourceAccessor.getResource(DefaultCacheAwareExternalResourceAccessor.java:84)
29-Mar-2019 15:03:59         at org.gradle.api.internal.artifacts.repositories.resolver.DefaultExternalResourceArtifactResolver.downloadStaticResource(DefaultExternalResourceArtifactResolver.java:90)
29-Mar-2019 15:03:59         ... 109 more
29-Mar-2019 15:03:59 Caused by: javax.net.ssl.SSLPeerUnverifiedException: peer not authenticated
29-Mar-2019 15:03:59         at org.apache.http.conn.ssl.AbstractVerifier.verify(AbstractVerifier.java:128)
29-Mar-2019 15:03:59         at org.apache.http.conn.ssl.SSLSocketFactory.connectSocket(SSLSocketFactory.java:572)
29-Mar-2019 15:03:59         at org.apache.http.impl.conn.DefaultClientConnectionOperator.openConnection(DefaultClientConnectionOperator.java:180)
29-Mar-2019 15:03:59         at org.apache.http.impl.conn.ManagedClientConnectionImpl.open(ManagedClientConnectionImpl.java:294)
29-Mar-2019 15:03:59         at org.apache.http.impl.client.DefaultRequestDirector.tryConnect(DefaultRequestDirector.java:640)
29-Mar-2019 15:03:59         at org.apache.http.impl.client.DefaultRequestDirector.execute(DefaultRequestDirector.java:479)
29-Mar-2019 15:03:59         at org.apache.http.impl.client.AbstractHttpClient.execute(AbstractHttpClient.java:906)
29-Mar-2019 15:03:59         at org.apache.http.impl.client.DecompressingHttpClient.execute(DecompressingHttpClient.java:137)
29-Mar-2019 15:03:59         at org.apache.http.impl.client.DecompressingHttpClient.execute(DecompressingHttpClient.java:118)
29-Mar-2019 15:03:59         at org.gradle.internal.resource.transport.http.HttpClientHelper.performHttpRequest(HttpClientHelper.java:113)
29-Mar-2019 15:03:59         at org.gradle.internal.resource.transport.http.HttpClientHelper.executeGetOrHead(HttpClientHelper.java:90)
29-Mar-2019 15:03:59         at org.gradle.internal.resource.transport.http.HttpClientHelper.performRequest(HttpClientHelper.java:81)
29-Mar-2019 15:03:59         ... 116 more
29-Mar-2019 15:03:59
29-Mar-2019 15:03:59
29-Mar-2019 15:03:59 BUILD FAILED
29-Mar-2019 15:03:59
29-Mar-2019 15:03:59 Total time: 9.21 secs
29-Mar-2019 15:03:59
29-Mar-2019 15:03:59 Failing task since return code of [./gradlew --refresh-dependencies --no-daemon -PtestGroups=ci -P BRANCH_NAME=3.2.x --stacktrace clean check build -I /tmp/artifactory.init.script7308105534666587885gradle -DbuildInfoConfig.propertiesFile=/tmp/buildinfo8569915390831885228properties artifactoryPublish -Dartifactory.resolve.password=******** -Dartifactory.publish.password=********] was 1 while expected 0
29-Mar-2019 15:03:59 Parsing test results under /opt/bamboo-home/xml-data/build-dir/SPR-PUB0-JOB1...
29-Mar-2019 15:03:59 Finished task 'Artifactory Gradle' with result: Failed
29-Mar-2019 15:03:59 Running post build plugin 'Docker Container Cleanup'
29-Mar-2019 15:03:59 Running post build plugin 'NCover Results Collector'
29-Mar-2019 15:03:59 Running post build plugin 'Artifactory Release Management Staging'
29-Mar-2019 15:03:59 Running post build plugin 'Artifactory Build Info Copier'
29-Mar-2019 15:03:59 Running post build plugin 'Artifactory Gradle Properties Info Copier'
29-Mar-2019 15:03:59 Running post build plugin 'Clover Results Collector'
29-Mar-2019 15:03:59 Running post build plugin 'npm Cache Cleanup'
29-Mar-2019 15:03:59 Running post build plugin 'Artifact Copier'
29-Mar-2019 15:03:59 Successfully removed working directory at '/opt/bamboo-home/xml-data/build-dir/SPR-PUB0-JOB1'
29-Mar-2019 15:03:59 Finalising the build...
29-Mar-2019 15:03:59 Stopping timer.
29-Mar-2019 15:03:59 Build SPR-PUB0-JOB1-631 completed.
29-Mar-2019 15:03:59 Running on server: post build plugin 'NCover Results Collector'
29-Mar-2019 15:03:59 Running on server: post build plugin 'Build Hanging Detection Configuration'
29-Mar-2019 15:03:59 Running on server: post build plugin 'Clover Delta Calculator'
29-Mar-2019 15:03:59 Running on server: post build plugin 'Maven Dependencies Postprocessor'
29-Mar-2019 15:03:59 All post build plugins have finished
29-Mar-2019 15:03:59 Generating build results summary...
29-Mar-2019 15:03:59 Saving build results to disk...
29-Mar-2019 15:03:59 Logging substituted variables...
29-Mar-2019 15:03:59 Indexing build results...
29-Mar-2019 15:03:59 Finished building SPR-PUB0-JOB1-631.