Sonar Build (Master)

Build: #1132 failed Manual run by St├ęphane Nicoll

Logs

The following logs have been generated by the jobs in this plan.
  • Expand all
  • Collapse all
Job Logs
Collapse Default Job Default Stage Download or View
22-Aug-2017 08:40:37 95/230 files analyzed
22-Aug-2017 08:40:47 138/230 files analyzed
22-Aug-2017 08:40:57 177/230 files analyzed
22-Aug-2017 08:41:07 225/230 files analyzed
22-Aug-2017 08:41:08 230/230 files analyzed
22-Aug-2017 08:41:08 Sensor SCM Sensor (done) | time=51297ms
22-Aug-2017 08:41:08 Sensor FindBugs Sensor
22-Aug-2017 08:41:08 Findbugs needs sources to be compiled. Please build project before executing sonar or check the location of compiled classes to make it possible for Findbugs to analyse your project.
22-Aug-2017 08:41:08 :sonarqube FAILED
22-Aug-2017 08:41:08 :sonarqube (Thread[Task worker for ':' Thread 3,5,main]) completed. Took 2 mins 21.749 secs.
22-Aug-2017 08:41:08
22-Aug-2017 08:41:08 FAILURE: Build failed with an exception.
22-Aug-2017 08:41:08
22-Aug-2017 08:41:08 * What went wrong:
22-Aug-2017 08:41:08 Execution failed for task ':sonarqube'.
22-Aug-2017 08:41:08 > Can not execute Findbugs
22-Aug-2017 08:41:08
22-Aug-2017 08:41:08 * Try:
22-Aug-2017 08:41:08 Run with --stacktrace option to get the stack trace. Run with --debug option to get more log output.
22-Aug-2017 08:41:08
22-Aug-2017 08:41:08 163 actionable tasks: 163 executed
22-Aug-2017 08:41:08 * Get more help at https://help.gradle.org
22-Aug-2017 08:41:08
22-Aug-2017 08:41:08 BUILD FAILED in 14m 3s
22-Aug-2017 08:41:08 Stopped 2 worker daemon(s).