Sonar Build (Master)

Build: #1132 failed

Job: Default Job failed

Stages & jobs

  1. Default Stage

Build log

The build generated 72,227 lines of output.The output is too long and has been truncated to the last 1,000 lines. Download or view full build log

22-Aug-2017 08:39:51         at org.gradle.execution.taskgraph.DefaultTaskExecutionPlan.executeWithTask(DefaultTaskExecutionPlan.java:580) [gradle-core-4.1.jar:4.1]
22-Aug-2017 08:39:51         at org.gradle.execution.taskgraph.DefaultTaskPlanExecutor$TaskExecutorWorker.run(DefaultTaskPlanExecutor.java:99) [gradle-core-4.1.jar:4.1]
22-Aug-2017 08:39:51         at org.gradle.internal.concurrent.ExecutorPolicy$CatchAndRecordFailures.onExecute(ExecutorPolicy.java:63) [gradle-base-services-4.1.jar:4.1]
22-Aug-2017 08:39:51         at org.gradle.internal.concurrent.ManagedExecutorImpl$1.run(ManagedExecutorImpl.java:46) [gradle-base-services-4.1.jar:4.1]
22-Aug-2017 08:39:51         at java.util.concurrent.ThreadPoolExecutor.runWorker(ThreadPoolExecutor.java:1142) [na:1.8.0_121]
22-Aug-2017 08:39:51         at java.util.concurrent.ThreadPoolExecutor$Worker.run(ThreadPoolExecutor.java:617) [na:1.8.0_121]
22-Aug-2017 08:39:51         at org.gradle.internal.concurrent.ThreadFactoryImpl$ManagedThreadRunnable.run(ThreadFactoryImpl.java:55) [gradle-base-services-4.1.jar:4.1]
22-Aug-2017 08:39:51         at java.lang.Thread.run(Thread.java:745) [na:1.8.0_121]
22-Aug-2017 08:39:51 Caused by: java.lang.IllegalStateException: Unable to open /opt/bamboo-home/xml-data/build-dir/SPR-SONAR-JOB1/spring-orm/build/resources/test/order.jar
22-Aug-2017 08:39:51         at org.sonar.java.bytecode.loader.JarLoader.<init>(JarLoader.java:51) ~[java-frontend-4.5.0.8398.jar:na]
22-Aug-2017 08:39:51         at org.sonar.java.bytecode.loader.SquidClassLoader.<init>(SquidClassLoader.java:51) ~[java-frontend-4.5.0.8398.jar:na]
22-Aug-2017 08:39:51         at org.sonar.java.bytecode.ClassLoaderBuilder.create(ClassLoaderBuilder.java:59) ~[java-frontend-4.5.0.8398.jar:na]
22-Aug-2017 08:39:51         ... 87 common frames omitted
22-Aug-2017 08:39:51 Caused by: java.util.zip.ZipException: zip file is empty
22-Aug-2017 08:39:51         at java.util.zip.ZipFile.open(Native Method) ~[na:1.8.0_121]
22-Aug-2017 08:39:51         at java.util.zip.ZipFile.<init>(ZipFile.java:219) ~[na:1.8.0_121]
22-Aug-2017 08:39:51         at java.util.zip.ZipFile.<init>(ZipFile.java:149) ~[na:1.8.0_121]
22-Aug-2017 08:39:51         at java.util.jar.JarFile.<init>(JarFile.java:166) ~[na:1.8.0_121]
22-Aug-2017 08:39:51         at java.util.jar.JarFile.<init>(JarFile.java:130) ~[na:1.8.0_121]
22-Aug-2017 08:39:51         at org.sonar.java.bytecode.loader.JarLoader.<init>(JarLoader.java:48) ~[java-frontend-4.5.0.8398.jar:na]
22-Aug-2017 08:39:51         ... 89 common frames omitted
22-Aug-2017 08:39:51
22-Aug-2017 08:39:51 Unable to create symbol table for : /opt/bamboo-home/xml-data/build-dir/SPR-SONAR-JOB1/spring-aspects/src/test/java/org/springframework/scheduling/aspectj/TestableAsyncUncaughtExceptionHandler.java
22-Aug-2017 08:39:51 java.lang.IllegalStateException: Can not create ClassLoader
22-Aug-2017 08:39:51         at org.sonar.java.bytecode.ClassLoaderBuilder.create(ClassLoaderBuilder.java:61) ~[java-frontend-4.5.0.8398.jar:na]
22-Aug-2017 08:39:51         at org.sonar.java.resolve.BytecodeCompleter.getClassLoader(BytecodeCompleter.java:118) ~[java-frontend-4.5.0.8398.jar:na]
22-Aug-2017 08:39:51         at org.sonar.java.resolve.BytecodeCompleter.inputStreamFor(BytecodeCompleter.java:113) ~[java-frontend-4.5.0.8398.jar:na]
22-Aug-2017 08:39:51         at org.sonar.java.resolve.BytecodeCompleter.loadClass(BytecodeCompleter.java:212) ~[java-frontend-4.5.0.8398.jar:na]
22-Aug-2017 08:39:51         at org.sonar.java.resolve.Symbols.<init>(Symbols.java:176) ~[java-frontend-4.5.0.8398.jar:na]
22-Aug-2017 08:39:51         at org.sonar.java.resolve.SemanticModel.createFor(SemanticModel.java:55) ~[java-frontend-4.5.0.8398.jar:na]
22-Aug-2017 08:39:51         at org.sonar.java.model.VisitorsBridge.visitFile(VisitorsBridge.java:105) ~[java-frontend-4.5.0.8398.jar:na]
22-Aug-2017 08:39:51         at org.sonar.java.ast.JavaAstScanner.simpleScan(JavaAstScanner.java:84) [java-frontend-4.5.0.8398.jar:na]
22-Aug-2017 08:39:51         at org.sonar.java.ast.JavaAstScanner.scan(JavaAstScanner.java:67) [java-frontend-4.5.0.8398.jar:na]
22-Aug-2017 08:39:51         at org.sonar.java.JavaSquid.scanTests(JavaSquid.java:120) [java-frontend-4.5.0.8398.jar:na]
22-Aug-2017 08:39:51         at org.sonar.java.JavaSquid.scan(JavaSquid.java:109) [java-frontend-4.5.0.8398.jar:na]
22-Aug-2017 08:39:51         at org.sonar.plugins.java.JavaSquidSensor.execute(JavaSquidSensor.java:87) [sonar-java-plugin-4.5.0.8398.jar:na]
22-Aug-2017 08:39:51         at org.sonar.batch.sensor.SensorWrapper.analyse(SensorWrapper.java:57) [sonar-scanner-engine-shaded-5.6.3.jar:na]
22-Aug-2017 08:39:51         at org.sonar.batch.phases.SensorsExecutor.executeSensor(SensorsExecutor.java:58) [sonar-scanner-engine-shaded-5.6.3.jar:na]
22-Aug-2017 08:39:51         at org.sonar.batch.phases.SensorsExecutor.execute(SensorsExecutor.java:50) [sonar-scanner-engine-shaded-5.6.3.jar:na]
22-Aug-2017 08:39:51         at org.sonar.batch.phases.AbstractPhaseExecutor.execute(AbstractPhaseExecutor.java:83) [sonar-scanner-engine-shaded-5.6.3.jar:na]
22-Aug-2017 08:39:51         at org.sonar.batch.scan.ModuleScanContainer.doAfterStart(ModuleScanContainer.java:192) [sonar-scanner-engine-shaded-5.6.3.jar:na]
22-Aug-2017 08:39:51         at org.sonar.core.platform.ComponentContainer.startComponents(ComponentContainer.java:142) [sonar-scanner-engine-shaded-5.6.3.jar:na]
22-Aug-2017 08:39:51         at org.sonar.core.platform.ComponentContainer.execute(ComponentContainer.java:127) [sonar-scanner-engine-shaded-5.6.3.jar:na]
22-Aug-2017 08:39:51         at org.sonar.batch.scan.ProjectScanContainer.scan(ProjectScanContainer.java:241) [sonar-scanner-engine-shaded-5.6.3.jar:na]
22-Aug-2017 08:39:51         at org.sonar.batch.scan.ProjectScanContainer.scanRecursively(ProjectScanContainer.java:236) [sonar-scanner-engine-shaded-5.6.3.jar:na]
22-Aug-2017 08:39:51         at org.sonar.batch.scan.ProjectScanContainer.scanRecursively(ProjectScanContainer.java:234) [sonar-scanner-engine-shaded-5.6.3.jar:na]
22-Aug-2017 08:39:51         at org.sonar.batch.scan.ProjectScanContainer.doAfterStart(ProjectScanContainer.java:226) [sonar-scanner-engine-shaded-5.6.3.jar:na]
22-Aug-2017 08:39:51         at org.sonar.core.platform.ComponentContainer.startComponents(ComponentContainer.java:142) [sonar-scanner-engine-shaded-5.6.3.jar:na]
22-Aug-2017 08:39:51         at org.sonar.core.platform.ComponentContainer.execute(ComponentContainer.java:127) [sonar-scanner-engine-shaded-5.6.3.jar:na]
22-Aug-2017 08:39:51         at org.sonar.batch.task.ScanTask.execute(ScanTask.java:47) [sonar-scanner-engine-shaded-5.6.3.jar:na]
22-Aug-2017 08:39:51         at org.sonar.batch.task.TaskContainer.doAfterStart(TaskContainer.java:86) [sonar-scanner-engine-shaded-5.6.3.jar:na]
22-Aug-2017 08:39:51         at org.sonar.core.platform.ComponentContainer.startComponents(ComponentContainer.java:142) [sonar-scanner-engine-shaded-5.6.3.jar:na]
22-Aug-2017 08:39:51         at org.sonar.core.platform.ComponentContainer.execute(ComponentContainer.java:127) [sonar-scanner-engine-shaded-5.6.3.jar:na]
22-Aug-2017 08:39:51         at org.sonar.batch.bootstrap.GlobalContainer.executeTask(GlobalContainer.java:106) [sonar-scanner-engine-shaded-5.6.3.jar:na]
22-Aug-2017 08:39:51         at org.sonar.batch.bootstrapper.Batch.executeTask(Batch.java:119) [sonar-scanner-engine-shaded-5.6.3.jar:na]
22-Aug-2017 08:39:51         at org.sonarsource.scanner.api.internal.batch.BatchIsolatedLauncher.execute(BatchIsolatedLauncher.java:63) [sonar-scanner-api-batch9118975001708217432.jar:na]
22-Aug-2017 08:39:51         at sun.reflect.NativeMethodAccessorImpl.invoke0(Native Method) ~[na:1.8.0_121]
22-Aug-2017 08:39:51         at sun.reflect.NativeMethodAccessorImpl.invoke(NativeMethodAccessorImpl.java:62) ~[na:1.8.0_121]
22-Aug-2017 08:39:51         at sun.reflect.DelegatingMethodAccessorImpl.invoke(DelegatingMethodAccessorImpl.java:43) ~[na:1.8.0_121]
22-Aug-2017 08:39:51         at java.lang.reflect.Method.invoke(Method.java:498) ~[na:1.8.0_121]
22-Aug-2017 08:39:51         at org.sonarsource.scanner.api.internal.IsolatedLauncherProxy.invoke(IsolatedLauncherProxy.java:60) [sonar-scanner-api-2.9.0.887.jar:na]
22-Aug-2017 08:39:51         at com.sun.proxy.$Proxy99.execute(Unknown Source) [na:na]
22-Aug-2017 08:39:51         at org.sonarsource.scanner.api.EmbeddedScanner.doExecute(EmbeddedScanner.java:233) [sonar-scanner-api-2.9.0.887.jar:na]
22-Aug-2017 08:39:51         at org.sonarsource.scanner.api.EmbeddedScanner.runAnalysis(EmbeddedScanner.java:151) [sonar-scanner-api-2.9.0.887.jar:na]
22-Aug-2017 08:39:51         at org.sonarqube.gradle.SonarQubeTask.run(SonarQubeTask.java:99) [sonarqube-gradle-plugin-2.5.jar:na]
22-Aug-2017 08:39:51         at sun.reflect.NativeMethodAccessorImpl.invoke0(Native Method) ~[na:1.8.0_121]
22-Aug-2017 08:39:51         at sun.reflect.NativeMethodAccessorImpl.invoke(NativeMethodAccessorImpl.java:62) ~[na:1.8.0_121]
22-Aug-2017 08:39:51         at sun.reflect.DelegatingMethodAccessorImpl.invoke(DelegatingMethodAccessorImpl.java:43) ~[na:1.8.0_121]
22-Aug-2017 08:39:51         at java.lang.reflect.Method.invoke(Method.java:498) ~[na:1.8.0_121]
22-Aug-2017 08:39:51         at org.gradle.internal.reflect.JavaMethod.invoke(JavaMethod.java:73) [gradle-base-services-4.1.jar:4.1]
22-Aug-2017 08:39:51         at org.gradle.api.internal.project.taskfactory.DefaultTaskClassInfoStore$StandardTaskAction.doExecute(DefaultTaskClassInfoStore.java:141) [gradle-core-4.1.jar:4.1]
22-Aug-2017 08:39:51         at org.gradle.api.internal.project.taskfactory.DefaultTaskClassInfoStore$StandardTaskAction.execute(DefaultTaskClassInfoStore.java:134) [gradle-core-4.1.jar:4.1]
22-Aug-2017 08:39:51         at org.gradle.api.internal.project.taskfactory.DefaultTaskClassInfoStore$StandardTaskAction.execute(DefaultTaskClassInfoStore.java:121) [gradle-core-4.1.jar:4.1]
22-Aug-2017 08:39:51         at org.gradle.api.internal.AbstractTask$TaskActionWrapper.execute(AbstractTask.java:731) [gradle-core-4.1.jar:4.1]
22-Aug-2017 08:39:51         at org.gradle.api.internal.AbstractTask$TaskActionWrapper.execute(AbstractTask.java:705) [gradle-core-4.1.jar:4.1]
22-Aug-2017 08:39:51         at org.gradle.api.internal.tasks.execution.ExecuteActionsTaskExecuter$1.run(ExecuteActionsTaskExecuter.java:122) [gradle-core-4.1.jar:4.1]
22-Aug-2017 08:39:51         at org.gradle.internal.progress.DefaultBuildOperationExecutor$RunnableBuildOperationWorker.execute(DefaultBuildOperationExecutor.java:336) [gradle-core-4.1.jar:4.1]
22-Aug-2017 08:39:51         at org.gradle.internal.progress.DefaultBuildOperationExecutor$RunnableBuildOperationWorker.execute(DefaultBuildOperationExecutor.java:328) [gradle-core-4.1.jar:4.1]
22-Aug-2017 08:39:51         at org.gradle.internal.progress.DefaultBuildOperationExecutor.execute(DefaultBuildOperationExecutor.java:197) [gradle-core-4.1.jar:4.1]
22-Aug-2017 08:39:51         at org.gradle.internal.progress.DefaultBuildOperationExecutor.run(DefaultBuildOperationExecutor.java:107) [gradle-core-4.1.jar:4.1]
22-Aug-2017 08:39:51         at org.gradle.api.internal.tasks.execution.ExecuteActionsTaskExecuter.executeAction(ExecuteActionsTaskExecuter.java:111) [gradle-core-4.1.jar:4.1]
22-Aug-2017 08:39:51         at org.gradle.api.internal.tasks.execution.ExecuteActionsTaskExecuter.executeActions(ExecuteActionsTaskExecuter.java:92) [gradle-core-4.1.jar:4.1]
22-Aug-2017 08:39:51         at org.gradle.api.internal.tasks.execution.ExecuteActionsTaskExecuter.execute(ExecuteActionsTaskExecuter.java:70) [gradle-core-4.1.jar:4.1]
22-Aug-2017 08:39:51         at org.gradle.api.internal.tasks.execution.SkipUpToDateTaskExecuter.execute(SkipUpToDateTaskExecuter.java:63) [gradle-core-4.1.jar:4.1]
22-Aug-2017 08:39:51         at org.gradle.api.internal.tasks.execution.ResolveTaskOutputCachingStateExecuter.execute(ResolveTaskOutputCachingStateExecuter.java:54) [gradle-core-4.1.jar:4.1]
22-Aug-2017 08:39:51         at org.gradle.api.internal.tasks.execution.ValidatingTaskExecuter.execute(ValidatingTaskExecuter.java:58) [gradle-core-4.1.jar:4.1]
22-Aug-2017 08:39:51         at org.gradle.api.internal.tasks.execution.SkipEmptySourceFilesTaskExecuter.execute(SkipEmptySourceFilesTaskExecuter.java:88) [gradle-core-4.1.jar:4.1]
22-Aug-2017 08:39:51         at org.gradle.api.internal.tasks.execution.ResolveTaskArtifactStateTaskExecuter.execute(ResolveTaskArtifactStateTaskExecuter.java:52) [gradle-core-4.1.jar:4.1]
22-Aug-2017 08:39:51         at org.gradle.api.internal.tasks.execution.SkipTaskWithNoActionsExecuter.execute(SkipTaskWithNoActionsExecuter.java:52) [gradle-core-4.1.jar:4.1]
22-Aug-2017 08:39:51         at org.gradle.api.internal.tasks.execution.SkipOnlyIfTaskExecuter.execute(SkipOnlyIfTaskExecuter.java:54) [gradle-core-4.1.jar:4.1]
22-Aug-2017 08:39:51         at org.gradle.api.internal.tasks.execution.ExecuteAtMostOnceTaskExecuter.execute(ExecuteAtMostOnceTaskExecuter.java:43) [gradle-core-4.1.jar:4.1]
22-Aug-2017 08:39:51         at org.gradle.api.internal.tasks.execution.CatchExceptionTaskExecuter.execute(CatchExceptionTaskExecuter.java:34) [gradle-core-4.1.jar:4.1]
22-Aug-2017 08:39:51         at org.gradle.execution.taskgraph.DefaultTaskGraphExecuter$EventFiringTaskWorker$1.run(DefaultTaskGraphExecuter.java:248) [gradle-core-4.1.jar:4.1]
22-Aug-2017 08:39:51         at org.gradle.internal.progress.DefaultBuildOperationExecutor$RunnableBuildOperationWorker.execute(DefaultBuildOperationExecutor.java:336) [gradle-core-4.1.jar:4.1]
22-Aug-2017 08:39:51         at org.gradle.internal.progress.DefaultBuildOperationExecutor$RunnableBuildOperationWorker.execute(DefaultBuildOperationExecutor.java:328) [gradle-core-4.1.jar:4.1]
22-Aug-2017 08:39:51         at org.gradle.internal.progress.DefaultBuildOperationExecutor.execute(DefaultBuildOperationExecutor.java:197) [gradle-core-4.1.jar:4.1]
22-Aug-2017 08:39:51         at org.gradle.internal.progress.DefaultBuildOperationExecutor.run(DefaultBuildOperationExecutor.java:107) [gradle-core-4.1.jar:4.1]
22-Aug-2017 08:39:51         at org.gradle.execution.taskgraph.DefaultTaskGraphExecuter$EventFiringTaskWorker.execute(DefaultTaskGraphExecuter.java:241) [gradle-core-4.1.jar:4.1]
22-Aug-2017 08:39:51         at org.gradle.execution.taskgraph.DefaultTaskGraphExecuter$EventFiringTaskWorker.execute(DefaultTaskGraphExecuter.java:230) [gradle-core-4.1.jar:4.1]
22-Aug-2017 08:39:51         at org.gradle.execution.taskgraph.DefaultTaskPlanExecutor$TaskExecutorWorker.processTask(DefaultTaskPlanExecutor.java:124) [gradle-core-4.1.jar:4.1]
22-Aug-2017 08:39:51         at org.gradle.execution.taskgraph.DefaultTaskPlanExecutor$TaskExecutorWorker.access$200(DefaultTaskPlanExecutor.java:80) [gradle-core-4.1.jar:4.1]
22-Aug-2017 08:39:51         at org.gradle.execution.taskgraph.DefaultTaskPlanExecutor$TaskExecutorWorker$1.execute(DefaultTaskPlanExecutor.java:105) [gradle-core-4.1.jar:4.1]
22-Aug-2017 08:39:51         at org.gradle.execution.taskgraph.DefaultTaskPlanExecutor$TaskExecutorWorker$1.execute(DefaultTaskPlanExecutor.java:99) [gradle-core-4.1.jar:4.1]
22-Aug-2017 08:39:51         at org.gradle.execution.taskgraph.DefaultTaskExecutionPlan.execute(DefaultTaskExecutionPlan.java:625) [gradle-core-4.1.jar:4.1]
22-Aug-2017 08:39:51         at org.gradle.execution.taskgraph.DefaultTaskExecutionPlan.executeWithTask(DefaultTaskExecutionPlan.java:580) [gradle-core-4.1.jar:4.1]
22-Aug-2017 08:39:51         at org.gradle.execution.taskgraph.DefaultTaskPlanExecutor$TaskExecutorWorker.run(DefaultTaskPlanExecutor.java:99) [gradle-core-4.1.jar:4.1]
22-Aug-2017 08:39:51         at org.gradle.internal.concurrent.ExecutorPolicy$CatchAndRecordFailures.onExecute(ExecutorPolicy.java:63) [gradle-base-services-4.1.jar:4.1]
22-Aug-2017 08:39:51         at org.gradle.internal.concurrent.ManagedExecutorImpl$1.run(ManagedExecutorImpl.java:46) [gradle-base-services-4.1.jar:4.1]
22-Aug-2017 08:39:51         at java.util.concurrent.ThreadPoolExecutor.runWorker(ThreadPoolExecutor.java:1142) [na:1.8.0_121]
22-Aug-2017 08:39:51         at java.util.concurrent.ThreadPoolExecutor$Worker.run(ThreadPoolExecutor.java:617) [na:1.8.0_121]
22-Aug-2017 08:39:51         at org.gradle.internal.concurrent.ThreadFactoryImpl$ManagedThreadRunnable.run(ThreadFactoryImpl.java:55) [gradle-base-services-4.1.jar:4.1]
22-Aug-2017 08:39:51         at java.lang.Thread.run(Thread.java:745) [na:1.8.0_121]
22-Aug-2017 08:39:51 Caused by: java.lang.IllegalStateException: Unable to open /opt/bamboo-home/xml-data/build-dir/SPR-SONAR-JOB1/spring-orm/build/resources/test/order.jar
22-Aug-2017 08:39:51         at org.sonar.java.bytecode.loader.JarLoader.<init>(JarLoader.java:51) ~[java-frontend-4.5.0.8398.jar:na]
22-Aug-2017 08:39:51         at org.sonar.java.bytecode.loader.SquidClassLoader.<init>(SquidClassLoader.java:51) ~[java-frontend-4.5.0.8398.jar:na]
22-Aug-2017 08:39:51         at org.sonar.java.bytecode.ClassLoaderBuilder.create(ClassLoaderBuilder.java:59) ~[java-frontend-4.5.0.8398.jar:na]
22-Aug-2017 08:39:51         ... 87 common frames omitted
22-Aug-2017 08:39:51 Caused by: java.util.zip.ZipException: zip file is empty
22-Aug-2017 08:39:51         at java.util.zip.ZipFile.open(Native Method) ~[na:1.8.0_121]
22-Aug-2017 08:39:51         at java.util.zip.ZipFile.<init>(ZipFile.java:219) ~[na:1.8.0_121]
22-Aug-2017 08:39:51         at java.util.zip.ZipFile.<init>(ZipFile.java:149) ~[na:1.8.0_121]
22-Aug-2017 08:39:51         at java.util.jar.JarFile.<init>(JarFile.java:166) ~[na:1.8.0_121]
22-Aug-2017 08:39:51         at java.util.jar.JarFile.<init>(JarFile.java:130) ~[na:1.8.0_121]
22-Aug-2017 08:39:51         at org.sonar.java.bytecode.loader.JarLoader.<init>(JarLoader.java:48) ~[java-frontend-4.5.0.8398.jar:na]
22-Aug-2017 08:39:51         ... 89 common frames omitted
22-Aug-2017 08:39:51
22-Aug-2017 08:39:51 Unable to create symbol table for : /opt/bamboo-home/xml-data/build-dir/SPR-SONAR-JOB1/spring-aspects/src/test/java/org/springframework/transaction/aspectj/ClassWithPrivateAnnotatedMember.java
22-Aug-2017 08:39:51 java.lang.IllegalStateException: Can not create ClassLoader
22-Aug-2017 08:39:51         at org.sonar.java.bytecode.ClassLoaderBuilder.create(ClassLoaderBuilder.java:61) ~[java-frontend-4.5.0.8398.jar:na]
22-Aug-2017 08:39:51         at org.sonar.java.resolve.BytecodeCompleter.getClassLoader(BytecodeCompleter.java:118) ~[java-frontend-4.5.0.8398.jar:na]
22-Aug-2017 08:39:51         at org.sonar.java.resolve.BytecodeCompleter.inputStreamFor(BytecodeCompleter.java:113) ~[java-frontend-4.5.0.8398.jar:na]
22-Aug-2017 08:39:51         at org.sonar.java.resolve.BytecodeCompleter.loadClass(BytecodeCompleter.java:212) ~[java-frontend-4.5.0.8398.jar:na]
22-Aug-2017 08:39:51         at org.sonar.java.resolve.Symbols.<init>(Symbols.java:176) ~[java-frontend-4.5.0.8398.jar:na]
22-Aug-2017 08:39:51         at org.sonar.java.resolve.SemanticModel.createFor(SemanticModel.java:55) ~[java-frontend-4.5.0.8398.jar:na]
22-Aug-2017 08:39:51         at org.sonar.java.model.VisitorsBridge.visitFile(VisitorsBridge.java:105) ~[java-frontend-4.5.0.8398.jar:na]
22-Aug-2017 08:39:51         at org.sonar.java.ast.JavaAstScanner.simpleScan(JavaAstScanner.java:84) [java-frontend-4.5.0.8398.jar:na]
22-Aug-2017 08:39:51         at org.sonar.java.ast.JavaAstScanner.scan(JavaAstScanner.java:67) [java-frontend-4.5.0.8398.jar:na]
22-Aug-2017 08:39:51         at org.sonar.java.JavaSquid.scanTests(JavaSquid.java:120) [java-frontend-4.5.0.8398.jar:na]
22-Aug-2017 08:39:51         at org.sonar.java.JavaSquid.scan(JavaSquid.java:109) [java-frontend-4.5.0.8398.jar:na]
22-Aug-2017 08:39:51         at org.sonar.plugins.java.JavaSquidSensor.execute(JavaSquidSensor.java:87) [sonar-java-plugin-4.5.0.8398.jar:na]
22-Aug-2017 08:39:51         at org.sonar.batch.sensor.SensorWrapper.analyse(SensorWrapper.java:57) [sonar-scanner-engine-shaded-5.6.3.jar:na]
22-Aug-2017 08:39:51         at org.sonar.batch.phases.SensorsExecutor.executeSensor(SensorsExecutor.java:58) [sonar-scanner-engine-shaded-5.6.3.jar:na]
22-Aug-2017 08:39:51         at org.sonar.batch.phases.SensorsExecutor.execute(SensorsExecutor.java:50) [sonar-scanner-engine-shaded-5.6.3.jar:na]
22-Aug-2017 08:39:51         at org.sonar.batch.phases.AbstractPhaseExecutor.execute(AbstractPhaseExecutor.java:83) [sonar-scanner-engine-shaded-5.6.3.jar:na]
22-Aug-2017 08:39:51         at org.sonar.batch.scan.ModuleScanContainer.doAfterStart(ModuleScanContainer.java:192) [sonar-scanner-engine-shaded-5.6.3.jar:na]
22-Aug-2017 08:39:51         at org.sonar.core.platform.ComponentContainer.startComponents(ComponentContainer.java:142) [sonar-scanner-engine-shaded-5.6.3.jar:na]
22-Aug-2017 08:39:51         at org.sonar.core.platform.ComponentContainer.execute(ComponentContainer.java:127) [sonar-scanner-engine-shaded-5.6.3.jar:na]
22-Aug-2017 08:39:51         at org.sonar.batch.scan.ProjectScanContainer.scan(ProjectScanContainer.java:241) [sonar-scanner-engine-shaded-5.6.3.jar:na]
22-Aug-2017 08:39:51         at org.sonar.batch.scan.ProjectScanContainer.scanRecursively(ProjectScanContainer.java:236) [sonar-scanner-engine-shaded-5.6.3.jar:na]
22-Aug-2017 08:39:51         at org.sonar.batch.scan.ProjectScanContainer.scanRecursively(ProjectScanContainer.java:234) [sonar-scanner-engine-shaded-5.6.3.jar:na]
22-Aug-2017 08:39:51         at org.sonar.batch.scan.ProjectScanContainer.doAfterStart(ProjectScanContainer.java:226) [sonar-scanner-engine-shaded-5.6.3.jar:na]
22-Aug-2017 08:39:51         at org.sonar.core.platform.ComponentContainer.startComponents(ComponentContainer.java:142) [sonar-scanner-engine-shaded-5.6.3.jar:na]
22-Aug-2017 08:39:51         at org.sonar.core.platform.ComponentContainer.execute(ComponentContainer.java:127) [sonar-scanner-engine-shaded-5.6.3.jar:na]
22-Aug-2017 08:39:51         at org.sonar.batch.task.ScanTask.execute(ScanTask.java:47) [sonar-scanner-engine-shaded-5.6.3.jar:na]
22-Aug-2017 08:39:51         at org.sonar.batch.task.TaskContainer.doAfterStart(TaskContainer.java:86) [sonar-scanner-engine-shaded-5.6.3.jar:na]
22-Aug-2017 08:39:51         at org.sonar.core.platform.ComponentContainer.startComponents(ComponentContainer.java:142) [sonar-scanner-engine-shaded-5.6.3.jar:na]
22-Aug-2017 08:39:51         at org.sonar.core.platform.ComponentContainer.execute(ComponentContainer.java:127) [sonar-scanner-engine-shaded-5.6.3.jar:na]
22-Aug-2017 08:39:51         at org.sonar.batch.bootstrap.GlobalContainer.executeTask(GlobalContainer.java:106) [sonar-scanner-engine-shaded-5.6.3.jar:na]
22-Aug-2017 08:39:51         at org.sonar.batch.bootstrapper.Batch.executeTask(Batch.java:119) [sonar-scanner-engine-shaded-5.6.3.jar:na]
22-Aug-2017 08:39:51         at org.sonarsource.scanner.api.internal.batch.BatchIsolatedLauncher.execute(BatchIsolatedLauncher.java:63) [sonar-scanner-api-batch9118975001708217432.jar:na]
22-Aug-2017 08:39:51         at sun.reflect.NativeMethodAccessorImpl.invoke0(Native Method) ~[na:1.8.0_121]
22-Aug-2017 08:39:51         at sun.reflect.NativeMethodAccessorImpl.invoke(NativeMethodAccessorImpl.java:62) ~[na:1.8.0_121]
22-Aug-2017 08:39:51         at sun.reflect.DelegatingMethodAccessorImpl.invoke(DelegatingMethodAccessorImpl.java:43) ~[na:1.8.0_121]
22-Aug-2017 08:39:51         at java.lang.reflect.Method.invoke(Method.java:498) ~[na:1.8.0_121]
22-Aug-2017 08:39:51         at org.sonarsource.scanner.api.internal.IsolatedLauncherProxy.invoke(IsolatedLauncherProxy.java:60) [sonar-scanner-api-2.9.0.887.jar:na]
22-Aug-2017 08:39:51         at com.sun.proxy.$Proxy99.execute(Unknown Source) [na:na]
22-Aug-2017 08:39:51         at org.sonarsource.scanner.api.EmbeddedScanner.doExecute(EmbeddedScanner.java:233) [sonar-scanner-api-2.9.0.887.jar:na]
22-Aug-2017 08:39:51         at org.sonarsource.scanner.api.EmbeddedScanner.runAnalysis(EmbeddedScanner.java:151) [sonar-scanner-api-2.9.0.887.jar:na]
22-Aug-2017 08:39:51         at org.sonarqube.gradle.SonarQubeTask.run(SonarQubeTask.java:99) [sonarqube-gradle-plugin-2.5.jar:na]
22-Aug-2017 08:39:51         at sun.reflect.NativeMethodAccessorImpl.invoke0(Native Method) ~[na:1.8.0_121]
22-Aug-2017 08:39:51         at sun.reflect.NativeMethodAccessorImpl.invoke(NativeMethodAccessorImpl.java:62) ~[na:1.8.0_121]
22-Aug-2017 08:39:51         at sun.reflect.DelegatingMethodAccessorImpl.invoke(DelegatingMethodAccessorImpl.java:43) ~[na:1.8.0_121]
22-Aug-2017 08:39:51         at java.lang.reflect.Method.invoke(Method.java:498) ~[na:1.8.0_121]
22-Aug-2017 08:39:51         at org.gradle.internal.reflect.JavaMethod.invoke(JavaMethod.java:73) [gradle-base-services-4.1.jar:4.1]
22-Aug-2017 08:39:51         at org.gradle.api.internal.project.taskfactory.DefaultTaskClassInfoStore$StandardTaskAction.doExecute(DefaultTaskClassInfoStore.java:141) [gradle-core-4.1.jar:4.1]
22-Aug-2017 08:39:51         at org.gradle.api.internal.project.taskfactory.DefaultTaskClassInfoStore$StandardTaskAction.execute(DefaultTaskClassInfoStore.java:134) [gradle-core-4.1.jar:4.1]
22-Aug-2017 08:39:51         at org.gradle.api.internal.project.taskfactory.DefaultTaskClassInfoStore$StandardTaskAction.execute(DefaultTaskClassInfoStore.java:121) [gradle-core-4.1.jar:4.1]
22-Aug-2017 08:39:51         at org.gradle.api.internal.AbstractTask$TaskActionWrapper.execute(AbstractTask.java:731) [gradle-core-4.1.jar:4.1]
22-Aug-2017 08:39:51         at org.gradle.api.internal.AbstractTask$TaskActionWrapper.execute(AbstractTask.java:705) [gradle-core-4.1.jar:4.1]
22-Aug-2017 08:39:51         at org.gradle.api.internal.tasks.execution.ExecuteActionsTaskExecuter$1.run(ExecuteActionsTaskExecuter.java:122) [gradle-core-4.1.jar:4.1]
22-Aug-2017 08:39:51         at org.gradle.internal.progress.DefaultBuildOperationExecutor$RunnableBuildOperationWorker.execute(DefaultBuildOperationExecutor.java:336) [gradle-core-4.1.jar:4.1]
22-Aug-2017 08:39:51         at org.gradle.internal.progress.DefaultBuildOperationExecutor$RunnableBuildOperationWorker.execute(DefaultBuildOperationExecutor.java:328) [gradle-core-4.1.jar:4.1]
22-Aug-2017 08:39:51         at org.gradle.internal.progress.DefaultBuildOperationExecutor.execute(DefaultBuildOperationExecutor.java:197) [gradle-core-4.1.jar:4.1]
22-Aug-2017 08:39:51         at org.gradle.internal.progress.DefaultBuildOperationExecutor.run(DefaultBuildOperationExecutor.java:107) [gradle-core-4.1.jar:4.1]
22-Aug-2017 08:39:51         at org.gradle.api.internal.tasks.execution.ExecuteActionsTaskExecuter.executeAction(ExecuteActionsTaskExecuter.java:111) [gradle-core-4.1.jar:4.1]
22-Aug-2017 08:39:51         at org.gradle.api.internal.tasks.execution.ExecuteActionsTaskExecuter.executeActions(ExecuteActionsTaskExecuter.java:92) [gradle-core-4.1.jar:4.1]
22-Aug-2017 08:39:51         at org.gradle.api.internal.tasks.execution.ExecuteActionsTaskExecuter.execute(ExecuteActionsTaskExecuter.java:70) [gradle-core-4.1.jar:4.1]
22-Aug-2017 08:39:51         at org.gradle.api.internal.tasks.execution.SkipUpToDateTaskExecuter.execute(SkipUpToDateTaskExecuter.java:63) [gradle-core-4.1.jar:4.1]
22-Aug-2017 08:39:51         at org.gradle.api.internal.tasks.execution.ResolveTaskOutputCachingStateExecuter.execute(ResolveTaskOutputCachingStateExecuter.java:54) [gradle-core-4.1.jar:4.1]
22-Aug-2017 08:39:51         at org.gradle.api.internal.tasks.execution.ValidatingTaskExecuter.execute(ValidatingTaskExecuter.java:58) [gradle-core-4.1.jar:4.1]
22-Aug-2017 08:39:51         at org.gradle.api.internal.tasks.execution.SkipEmptySourceFilesTaskExecuter.execute(SkipEmptySourceFilesTaskExecuter.java:88) [gradle-core-4.1.jar:4.1]
22-Aug-2017 08:39:51         at org.gradle.api.internal.tasks.execution.ResolveTaskArtifactStateTaskExecuter.execute(ResolveTaskArtifactStateTaskExecuter.java:52) [gradle-core-4.1.jar:4.1]
22-Aug-2017 08:39:51         at org.gradle.api.internal.tasks.execution.SkipTaskWithNoActionsExecuter.execute(SkipTaskWithNoActionsExecuter.java:52) [gradle-core-4.1.jar:4.1]
22-Aug-2017 08:39:51         at org.gradle.api.internal.tasks.execution.SkipOnlyIfTaskExecuter.execute(SkipOnlyIfTaskExecuter.java:54) [gradle-core-4.1.jar:4.1]
22-Aug-2017 08:39:51         at org.gradle.api.internal.tasks.execution.ExecuteAtMostOnceTaskExecuter.execute(ExecuteAtMostOnceTaskExecuter.java:43) [gradle-core-4.1.jar:4.1]
22-Aug-2017 08:39:51         at org.gradle.api.internal.tasks.execution.CatchExceptionTaskExecuter.execute(CatchExceptionTaskExecuter.java:34) [gradle-core-4.1.jar:4.1]
22-Aug-2017 08:39:51         at org.gradle.execution.taskgraph.DefaultTaskGraphExecuter$EventFiringTaskWorker$1.run(DefaultTaskGraphExecuter.java:248) [gradle-core-4.1.jar:4.1]
22-Aug-2017 08:39:51         at org.gradle.internal.progress.DefaultBuildOperationExecutor$RunnableBuildOperationWorker.execute(DefaultBuildOperationExecutor.java:336) [gradle-core-4.1.jar:4.1]
22-Aug-2017 08:39:51         at org.gradle.internal.progress.DefaultBuildOperationExecutor$RunnableBuildOperationWorker.execute(DefaultBuildOperationExecutor.java:328) [gradle-core-4.1.jar:4.1]
22-Aug-2017 08:39:51         at org.gradle.internal.progress.DefaultBuildOperationExecutor.execute(DefaultBuildOperationExecutor.java:197) [gradle-core-4.1.jar:4.1]
22-Aug-2017 08:39:51         at org.gradle.internal.progress.DefaultBuildOperationExecutor.run(DefaultBuildOperationExecutor.java:107) [gradle-core-4.1.jar:4.1]
22-Aug-2017 08:39:51         at org.gradle.execution.taskgraph.DefaultTaskGraphExecuter$EventFiringTaskWorker.execute(DefaultTaskGraphExecuter.java:241) [gradle-core-4.1.jar:4.1]
22-Aug-2017 08:39:51         at org.gradle.execution.taskgraph.DefaultTaskGraphExecuter$EventFiringTaskWorker.execute(DefaultTaskGraphExecuter.java:230) [gradle-core-4.1.jar:4.1]
22-Aug-2017 08:39:51         at org.gradle.execution.taskgraph.DefaultTaskPlanExecutor$TaskExecutorWorker.processTask(DefaultTaskPlanExecutor.java:124) [gradle-core-4.1.jar:4.1]
22-Aug-2017 08:39:51         at org.gradle.execution.taskgraph.DefaultTaskPlanExecutor$TaskExecutorWorker.access$200(DefaultTaskPlanExecutor.java:80) [gradle-core-4.1.jar:4.1]
22-Aug-2017 08:39:51         at org.gradle.execution.taskgraph.DefaultTaskPlanExecutor$TaskExecutorWorker$1.execute(DefaultTaskPlanExecutor.java:105) [gradle-core-4.1.jar:4.1]
22-Aug-2017 08:39:51         at org.gradle.execution.taskgraph.DefaultTaskPlanExecutor$TaskExecutorWorker$1.execute(DefaultTaskPlanExecutor.java:99) [gradle-core-4.1.jar:4.1]
22-Aug-2017 08:39:51         at org.gradle.execution.taskgraph.DefaultTaskExecutionPlan.execute(DefaultTaskExecutionPlan.java:625) [gradle-core-4.1.jar:4.1]
22-Aug-2017 08:39:51         at org.gradle.execution.taskgraph.DefaultTaskExecutionPlan.executeWithTask(DefaultTaskExecutionPlan.java:580) [gradle-core-4.1.jar:4.1]
22-Aug-2017 08:39:51         at org.gradle.execution.taskgraph.DefaultTaskPlanExecutor$TaskExecutorWorker.run(DefaultTaskPlanExecutor.java:99) [gradle-core-4.1.jar:4.1]
22-Aug-2017 08:39:51         at org.gradle.internal.concurrent.ExecutorPolicy$CatchAndRecordFailures.onExecute(ExecutorPolicy.java:63) [gradle-base-services-4.1.jar:4.1]
22-Aug-2017 08:39:51         at org.gradle.internal.concurrent.ManagedExecutorImpl$1.run(ManagedExecutorImpl.java:46) [gradle-base-services-4.1.jar:4.1]
22-Aug-2017 08:39:51         at java.util.concurrent.ThreadPoolExecutor.runWorker(ThreadPoolExecutor.java:1142) [na:1.8.0_121]
22-Aug-2017 08:39:51         at java.util.concurrent.ThreadPoolExecutor$Worker.run(ThreadPoolExecutor.java:617) [na:1.8.0_121]
22-Aug-2017 08:39:51         at org.gradle.internal.concurrent.ThreadFactoryImpl$ManagedThreadRunnable.run(ThreadFactoryImpl.java:55) [gradle-base-services-4.1.jar:4.1]
22-Aug-2017 08:39:51         at java.lang.Thread.run(Thread.java:745) [na:1.8.0_121]
22-Aug-2017 08:39:51 Caused by: java.lang.IllegalStateException: Unable to open /opt/bamboo-home/xml-data/build-dir/SPR-SONAR-JOB1/spring-orm/build/resources/test/order.jar
22-Aug-2017 08:39:51         at org.sonar.java.bytecode.loader.JarLoader.<init>(JarLoader.java:51) ~[java-frontend-4.5.0.8398.jar:na]
22-Aug-2017 08:39:51         at org.sonar.java.bytecode.loader.SquidClassLoader.<init>(SquidClassLoader.java:51) ~[java-frontend-4.5.0.8398.jar:na]
22-Aug-2017 08:39:51         at org.sonar.java.bytecode.ClassLoaderBuilder.create(ClassLoaderBuilder.java:59) ~[java-frontend-4.5.0.8398.jar:na]
22-Aug-2017 08:39:51         ... 87 common frames omitted
22-Aug-2017 08:39:51 Caused by: java.util.zip.ZipException: zip file is empty
22-Aug-2017 08:39:51         at java.util.zip.ZipFile.open(Native Method) ~[na:1.8.0_121]
22-Aug-2017 08:39:51         at java.util.zip.ZipFile.<init>(ZipFile.java:219) ~[na:1.8.0_121]
22-Aug-2017 08:39:51         at java.util.zip.ZipFile.<init>(ZipFile.java:149) ~[na:1.8.0_121]
22-Aug-2017 08:39:51         at java.util.jar.JarFile.<init>(JarFile.java:166) ~[na:1.8.0_121]
22-Aug-2017 08:39:51         at java.util.jar.JarFile.<init>(JarFile.java:130) ~[na:1.8.0_121]
22-Aug-2017 08:39:51         at org.sonar.java.bytecode.loader.JarLoader.<init>(JarLoader.java:48) ~[java-frontend-4.5.0.8398.jar:na]
22-Aug-2017 08:39:51         ... 89 common frames omitted
22-Aug-2017 08:39:51
22-Aug-2017 08:39:51 Unable to create symbol table for : /opt/bamboo-home/xml-data/build-dir/SPR-SONAR-JOB1/spring-aspects/src/test/java/org/springframework/transaction/aspectj/ClassWithProtectedAnnotatedMember.java
22-Aug-2017 08:39:51 java.lang.IllegalStateException: Can not create ClassLoader
22-Aug-2017 08:39:51         at org.sonar.java.bytecode.ClassLoaderBuilder.create(ClassLoaderBuilder.java:61) ~[java-frontend-4.5.0.8398.jar:na]
22-Aug-2017 08:39:51         at org.sonar.java.resolve.BytecodeCompleter.getClassLoader(BytecodeCompleter.java:118) ~[java-frontend-4.5.0.8398.jar:na]
22-Aug-2017 08:39:51         at org.sonar.java.resolve.BytecodeCompleter.inputStreamFor(BytecodeCompleter.java:113) ~[java-frontend-4.5.0.8398.jar:na]
22-Aug-2017 08:39:51         at org.sonar.java.resolve.BytecodeCompleter.loadClass(BytecodeCompleter.java:212) ~[java-frontend-4.5.0.8398.jar:na]
22-Aug-2017 08:39:51         at org.sonar.java.resolve.Symbols.<init>(Symbols.java:176) ~[java-frontend-4.5.0.8398.jar:na]
22-Aug-2017 08:39:51         at org.sonar.java.resolve.SemanticModel.createFor(SemanticModel.java:55) ~[java-frontend-4.5.0.8398.jar:na]
22-Aug-2017 08:39:51         at org.sonar.java.model.VisitorsBridge.visitFile(VisitorsBridge.java:105) ~[java-frontend-4.5.0.8398.jar:na]
22-Aug-2017 08:39:51         at org.sonar.java.ast.JavaAstScanner.simpleScan(JavaAstScanner.java:84) [java-frontend-4.5.0.8398.jar:na]
22-Aug-2017 08:39:51         at org.sonar.java.ast.JavaAstScanner.scan(JavaAstScanner.java:67) [java-frontend-4.5.0.8398.jar:na]
22-Aug-2017 08:39:51         at org.sonar.java.JavaSquid.scanTests(JavaSquid.java:120) [java-frontend-4.5.0.8398.jar:na]
22-Aug-2017 08:39:51         at org.sonar.java.JavaSquid.scan(JavaSquid.java:109) [java-frontend-4.5.0.8398.jar:na]
22-Aug-2017 08:39:51         at org.sonar.plugins.java.JavaSquidSensor.execute(JavaSquidSensor.java:87) [sonar-java-plugin-4.5.0.8398.jar:na]
22-Aug-2017 08:39:51         at org.sonar.batch.sensor.SensorWrapper.analyse(SensorWrapper.java:57) [sonar-scanner-engine-shaded-5.6.3.jar:na]
22-Aug-2017 08:39:51         at org.sonar.batch.phases.SensorsExecutor.executeSensor(SensorsExecutor.java:58) [sonar-scanner-engine-shaded-5.6.3.jar:na]
22-Aug-2017 08:39:51         at org.sonar.batch.phases.SensorsExecutor.execute(SensorsExecutor.java:50) [sonar-scanner-engine-shaded-5.6.3.jar:na]
22-Aug-2017 08:39:51         at org.sonar.batch.phases.AbstractPhaseExecutor.execute(AbstractPhaseExecutor.java:83) [sonar-scanner-engine-shaded-5.6.3.jar:na]
22-Aug-2017 08:39:51         at org.sonar.batch.scan.ModuleScanContainer.doAfterStart(ModuleScanContainer.java:192) [sonar-scanner-engine-shaded-5.6.3.jar:na]
22-Aug-2017 08:39:51         at org.sonar.core.platform.ComponentContainer.startComponents(ComponentContainer.java:142) [sonar-scanner-engine-shaded-5.6.3.jar:na]
22-Aug-2017 08:39:51         at org.sonar.core.platform.ComponentContainer.execute(ComponentContainer.java:127) [sonar-scanner-engine-shaded-5.6.3.jar:na]
22-Aug-2017 08:39:51         at org.sonar.batch.scan.ProjectScanContainer.scan(ProjectScanContainer.java:241) [sonar-scanner-engine-shaded-5.6.3.jar:na]
22-Aug-2017 08:39:51         at org.sonar.batch.scan.ProjectScanContainer.scanRecursively(ProjectScanContainer.java:236) [sonar-scanner-engine-shaded-5.6.3.jar:na]
22-Aug-2017 08:39:51         at org.sonar.batch.scan.ProjectScanContainer.scanRecursively(ProjectScanContainer.java:234) [sonar-scanner-engine-shaded-5.6.3.jar:na]
22-Aug-2017 08:39:51         at org.sonar.batch.scan.ProjectScanContainer.doAfterStart(ProjectScanContainer.java:226) [sonar-scanner-engine-shaded-5.6.3.jar:na]
22-Aug-2017 08:39:51         at org.sonar.core.platform.ComponentContainer.startComponents(ComponentContainer.java:142) [sonar-scanner-engine-shaded-5.6.3.jar:na]
22-Aug-2017 08:39:51         at org.sonar.core.platform.ComponentContainer.execute(ComponentContainer.java:127) [sonar-scanner-engine-shaded-5.6.3.jar:na]
22-Aug-2017 08:39:51         at org.sonar.batch.task.ScanTask.execute(ScanTask.java:47) [sonar-scanner-engine-shaded-5.6.3.jar:na]
22-Aug-2017 08:39:51         at org.sonar.batch.task.TaskContainer.doAfterStart(TaskContainer.java:86) [sonar-scanner-engine-shaded-5.6.3.jar:na]
22-Aug-2017 08:39:51         at org.sonar.core.platform.ComponentContainer.startComponents(ComponentContainer.java:142) [sonar-scanner-engine-shaded-5.6.3.jar:na]
22-Aug-2017 08:39:51         at org.sonar.core.platform.ComponentContainer.execute(ComponentContainer.java:127) [sonar-scanner-engine-shaded-5.6.3.jar:na]
22-Aug-2017 08:39:51         at org.sonar.batch.bootstrap.GlobalContainer.executeTask(GlobalContainer.java:106) [sonar-scanner-engine-shaded-5.6.3.jar:na]
22-Aug-2017 08:39:51         at org.sonar.batch.bootstrapper.Batch.executeTask(Batch.java:119) [sonar-scanner-engine-shaded-5.6.3.jar:na]
22-Aug-2017 08:39:51         at org.sonarsource.scanner.api.internal.batch.BatchIsolatedLauncher.execute(BatchIsolatedLauncher.java:63) [sonar-scanner-api-batch9118975001708217432.jar:na]
22-Aug-2017 08:39:51         at sun.reflect.NativeMethodAccessorImpl.invoke0(Native Method) ~[na:1.8.0_121]
22-Aug-2017 08:39:51         at sun.reflect.NativeMethodAccessorImpl.invoke(NativeMethodAccessorImpl.java:62) ~[na:1.8.0_121]
22-Aug-2017 08:39:51         at sun.reflect.DelegatingMethodAccessorImpl.invoke(DelegatingMethodAccessorImpl.java:43) ~[na:1.8.0_121]
22-Aug-2017 08:39:51         at java.lang.reflect.Method.invoke(Method.java:498) ~[na:1.8.0_121]
22-Aug-2017 08:39:51         at org.sonarsource.scanner.api.internal.IsolatedLauncherProxy.invoke(IsolatedLauncherProxy.java:60) [sonar-scanner-api-2.9.0.887.jar:na]
22-Aug-2017 08:39:51         at com.sun.proxy.$Proxy99.execute(Unknown Source) [na:na]
22-Aug-2017 08:39:51         at org.sonarsource.scanner.api.EmbeddedScanner.doExecute(EmbeddedScanner.java:233) [sonar-scanner-api-2.9.0.887.jar:na]
22-Aug-2017 08:39:51         at org.sonarsource.scanner.api.EmbeddedScanner.runAnalysis(EmbeddedScanner.java:151) [sonar-scanner-api-2.9.0.887.jar:na]
22-Aug-2017 08:39:51         at org.sonarqube.gradle.SonarQubeTask.run(SonarQubeTask.java:99) [sonarqube-gradle-plugin-2.5.jar:na]
22-Aug-2017 08:39:51         at sun.reflect.NativeMethodAccessorImpl.invoke0(Native Method) ~[na:1.8.0_121]
22-Aug-2017 08:39:51         at sun.reflect.NativeMethodAccessorImpl.invoke(NativeMethodAccessorImpl.java:62) ~[na:1.8.0_121]
22-Aug-2017 08:39:51         at sun.reflect.DelegatingMethodAccessorImpl.invoke(DelegatingMethodAccessorImpl.java:43) ~[na:1.8.0_121]
22-Aug-2017 08:39:51         at java.lang.reflect.Method.invoke(Method.java:498) ~[na:1.8.0_121]
22-Aug-2017 08:39:51         at org.gradle.internal.reflect.JavaMethod.invoke(JavaMethod.java:73) [gradle-base-services-4.1.jar:4.1]
22-Aug-2017 08:39:51         at org.gradle.api.internal.project.taskfactory.DefaultTaskClassInfoStore$StandardTaskAction.doExecute(DefaultTaskClassInfoStore.java:141) [gradle-core-4.1.jar:4.1]
22-Aug-2017 08:39:51         at org.gradle.api.internal.project.taskfactory.DefaultTaskClassInfoStore$StandardTaskAction.execute(DefaultTaskClassInfoStore.java:134) [gradle-core-4.1.jar:4.1]
22-Aug-2017 08:39:51         at org.gradle.api.internal.project.taskfactory.DefaultTaskClassInfoStore$StandardTaskAction.execute(DefaultTaskClassInfoStore.java:121) [gradle-core-4.1.jar:4.1]
22-Aug-2017 08:39:51         at org.gradle.api.internal.AbstractTask$TaskActionWrapper.execute(AbstractTask.java:731) [gradle-core-4.1.jar:4.1]
22-Aug-2017 08:39:51         at org.gradle.api.internal.AbstractTask$TaskActionWrapper.execute(AbstractTask.java:705) [gradle-core-4.1.jar:4.1]
22-Aug-2017 08:39:51         at org.gradle.api.internal.tasks.execution.ExecuteActionsTaskExecuter$1.run(ExecuteActionsTaskExecuter.java:122) [gradle-core-4.1.jar:4.1]
22-Aug-2017 08:39:51         at org.gradle.internal.progress.DefaultBuildOperationExecutor$RunnableBuildOperationWorker.execute(DefaultBuildOperationExecutor.java:336) [gradle-core-4.1.jar:4.1]
22-Aug-2017 08:39:51         at org.gradle.internal.progress.DefaultBuildOperationExecutor$RunnableBuildOperationWorker.execute(DefaultBuildOperationExecutor.java:328) [gradle-core-4.1.jar:4.1]
22-Aug-2017 08:39:51         at org.gradle.internal.progress.DefaultBuildOperationExecutor.execute(DefaultBuildOperationExecutor.java:197) [gradle-core-4.1.jar:4.1]
22-Aug-2017 08:39:51         at org.gradle.internal.progress.DefaultBuildOperationExecutor.run(DefaultBuildOperationExecutor.java:107) [gradle-core-4.1.jar:4.1]
22-Aug-2017 08:39:51         at org.gradle.api.internal.tasks.execution.ExecuteActionsTaskExecuter.executeAction(ExecuteActionsTaskExecuter.java:111) [gradle-core-4.1.jar:4.1]
22-Aug-2017 08:39:51         at org.gradle.api.internal.tasks.execution.ExecuteActionsTaskExecuter.executeActions(ExecuteActionsTaskExecuter.java:92) [gradle-core-4.1.jar:4.1]
22-Aug-2017 08:39:51         at org.gradle.api.internal.tasks.execution.ExecuteActionsTaskExecuter.execute(ExecuteActionsTaskExecuter.java:70) [gradle-core-4.1.jar:4.1]
22-Aug-2017 08:39:51         at org.gradle.api.internal.tasks.execution.SkipUpToDateTaskExecuter.execute(SkipUpToDateTaskExecuter.java:63) [gradle-core-4.1.jar:4.1]
22-Aug-2017 08:39:51         at org.gradle.api.internal.tasks.execution.ResolveTaskOutputCachingStateExecuter.execute(ResolveTaskOutputCachingStateExecuter.java:54) [gradle-core-4.1.jar:4.1]
22-Aug-2017 08:39:51         at org.gradle.api.internal.tasks.execution.ValidatingTaskExecuter.execute(ValidatingTaskExecuter.java:58) [gradle-core-4.1.jar:4.1]
22-Aug-2017 08:39:51         at org.gradle.api.internal.tasks.execution.SkipEmptySourceFilesTaskExecuter.execute(SkipEmptySourceFilesTaskExecuter.java:88) [gradle-core-4.1.jar:4.1]
22-Aug-2017 08:39:51         at org.gradle.api.internal.tasks.execution.ResolveTaskArtifactStateTaskExecuter.execute(ResolveTaskArtifactStateTaskExecuter.java:52) [gradle-core-4.1.jar:4.1]
22-Aug-2017 08:39:51         at org.gradle.api.internal.tasks.execution.SkipTaskWithNoActionsExecuter.execute(SkipTaskWithNoActionsExecuter.java:52) [gradle-core-4.1.jar:4.1]
22-Aug-2017 08:39:51         at org.gradle.api.internal.tasks.execution.SkipOnlyIfTaskExecuter.execute(SkipOnlyIfTaskExecuter.java:54) [gradle-core-4.1.jar:4.1]
22-Aug-2017 08:39:51         at org.gradle.api.internal.tasks.execution.ExecuteAtMostOnceTaskExecuter.execute(ExecuteAtMostOnceTaskExecuter.java:43) [gradle-core-4.1.jar:4.1]
22-Aug-2017 08:39:51         at org.gradle.api.internal.tasks.execution.CatchExceptionTaskExecuter.execute(CatchExceptionTaskExecuter.java:34) [gradle-core-4.1.jar:4.1]
22-Aug-2017 08:39:51         at org.gradle.execution.taskgraph.DefaultTaskGraphExecuter$EventFiringTaskWorker$1.run(DefaultTaskGraphExecuter.java:248) [gradle-core-4.1.jar:4.1]
22-Aug-2017 08:39:51         at org.gradle.internal.progress.DefaultBuildOperationExecutor$RunnableBuildOperationWorker.execute(DefaultBuildOperationExecutor.java:336) [gradle-core-4.1.jar:4.1]
22-Aug-2017 08:39:51         at org.gradle.internal.progress.DefaultBuildOperationExecutor$RunnableBuildOperationWorker.execute(DefaultBuildOperationExecutor.java:328) [gradle-core-4.1.jar:4.1]
22-Aug-2017 08:39:51         at org.gradle.internal.progress.DefaultBuildOperationExecutor.execute(DefaultBuildOperationExecutor.java:197) [gradle-core-4.1.jar:4.1]
22-Aug-2017 08:39:51         at org.gradle.internal.progress.DefaultBuildOperationExecutor.run(DefaultBuildOperationExecutor.java:107) [gradle-core-4.1.jar:4.1]
22-Aug-2017 08:39:51         at org.gradle.execution.taskgraph.DefaultTaskGraphExecuter$EventFiringTaskWorker.execute(DefaultTaskGraphExecuter.java:241) [gradle-core-4.1.jar:4.1]
22-Aug-2017 08:39:51         at org.gradle.execution.taskgraph.DefaultTaskGraphExecuter$EventFiringTaskWorker.execute(DefaultTaskGraphExecuter.java:230) [gradle-core-4.1.jar:4.1]
22-Aug-2017 08:39:51         at org.gradle.execution.taskgraph.DefaultTaskPlanExecutor$TaskExecutorWorker.processTask(DefaultTaskPlanExecutor.java:124) [gradle-core-4.1.jar:4.1]
22-Aug-2017 08:39:51         at org.gradle.execution.taskgraph.DefaultTaskPlanExecutor$TaskExecutorWorker.access$200(DefaultTaskPlanExecutor.java:80) [gradle-core-4.1.jar:4.1]
22-Aug-2017 08:39:51         at org.gradle.execution.taskgraph.DefaultTaskPlanExecutor$TaskExecutorWorker$1.execute(DefaultTaskPlanExecutor.java:105) [gradle-core-4.1.jar:4.1]
22-Aug-2017 08:39:51         at org.gradle.execution.taskgraph.DefaultTaskPlanExecutor$TaskExecutorWorker$1.execute(DefaultTaskPlanExecutor.java:99) [gradle-core-4.1.jar:4.1]
22-Aug-2017 08:39:51         at org.gradle.execution.taskgraph.DefaultTaskExecutionPlan.execute(DefaultTaskExecutionPlan.java:625) [gradle-core-4.1.jar:4.1]
22-Aug-2017 08:39:51         at org.gradle.execution.taskgraph.DefaultTaskExecutionPlan.executeWithTask(DefaultTaskExecutionPlan.java:580) [gradle-core-4.1.jar:4.1]
22-Aug-2017 08:39:51         at org.gradle.execution.taskgraph.DefaultTaskPlanExecutor$TaskExecutorWorker.run(DefaultTaskPlanExecutor.java:99) [gradle-core-4.1.jar:4.1]
22-Aug-2017 08:39:51         at org.gradle.internal.concurrent.ExecutorPolicy$CatchAndRecordFailures.onExecute(ExecutorPolicy.java:63) [gradle-base-services-4.1.jar:4.1]
22-Aug-2017 08:39:51         at org.gradle.internal.concurrent.ManagedExecutorImpl$1.run(ManagedExecutorImpl.java:46) [gradle-base-services-4.1.jar:4.1]
22-Aug-2017 08:39:51         at java.util.concurrent.ThreadPoolExecutor.runWorker(ThreadPoolExecutor.java:1142) [na:1.8.0_121]
22-Aug-2017 08:39:51         at java.util.concurrent.ThreadPoolExecutor$Worker.run(ThreadPoolExecutor.java:617) [na:1.8.0_121]
22-Aug-2017 08:39:51         at org.gradle.internal.concurrent.ThreadFactoryImpl$ManagedThreadRunnable.run(ThreadFactoryImpl.java:55) [gradle-base-services-4.1.jar:4.1]
22-Aug-2017 08:39:51         at java.lang.Thread.run(Thread.java:745) [na:1.8.0_121]
22-Aug-2017 08:39:51 Caused by: java.lang.IllegalStateException: Unable to open /opt/bamboo-home/xml-data/build-dir/SPR-SONAR-JOB1/spring-orm/build/resources/test/order.jar
22-Aug-2017 08:39:51         at org.sonar.java.bytecode.loader.JarLoader.<init>(JarLoader.java:51) ~[java-frontend-4.5.0.8398.jar:na]
22-Aug-2017 08:39:51         at org.sonar.java.bytecode.loader.SquidClassLoader.<init>(SquidClassLoader.java:51) ~[java-frontend-4.5.0.8398.jar:na]
22-Aug-2017 08:39:51         at org.sonar.java.bytecode.ClassLoaderBuilder.create(ClassLoaderBuilder.java:59) ~[java-frontend-4.5.0.8398.jar:na]
22-Aug-2017 08:39:51         ... 87 common frames omitted
22-Aug-2017 08:39:51 Caused by: java.util.zip.ZipException: zip file is empty
22-Aug-2017 08:39:51         at java.util.zip.ZipFile.open(Native Method) ~[na:1.8.0_121]
22-Aug-2017 08:39:51         at java.util.zip.ZipFile.<init>(ZipFile.java:219) ~[na:1.8.0_121]
22-Aug-2017 08:39:51         at java.util.zip.ZipFile.<init>(ZipFile.java:149) ~[na:1.8.0_121]
22-Aug-2017 08:39:51         at java.util.jar.JarFile.<init>(JarFile.java:166) ~[na:1.8.0_121]
22-Aug-2017 08:39:51         at java.util.jar.JarFile.<init>(JarFile.java:130) ~[na:1.8.0_121]
22-Aug-2017 08:39:51         at org.sonar.java.bytecode.loader.JarLoader.<init>(JarLoader.java:48) ~[java-frontend-4.5.0.8398.jar:na]
22-Aug-2017 08:39:51         ... 89 common frames omitted
22-Aug-2017 08:39:51
22-Aug-2017 08:39:51 Unable to create symbol table for : /opt/bamboo-home/xml-data/build-dir/SPR-SONAR-JOB1/spring-aspects/src/test/java/org/springframework/transaction/aspectj/ITransactional.java
22-Aug-2017 08:39:51 java.lang.IllegalStateException: Can not create ClassLoader
22-Aug-2017 08:39:51         at org.sonar.java.bytecode.ClassLoaderBuilder.create(ClassLoaderBuilder.java:61) ~[java-frontend-4.5.0.8398.jar:na]
22-Aug-2017 08:39:51         at org.sonar.java.resolve.BytecodeCompleter.getClassLoader(BytecodeCompleter.java:118) ~[java-frontend-4.5.0.8398.jar:na]
22-Aug-2017 08:39:51         at org.sonar.java.resolve.BytecodeCompleter.inputStreamFor(BytecodeCompleter.java:113) ~[java-frontend-4.5.0.8398.jar:na]
22-Aug-2017 08:39:51         at org.sonar.java.resolve.BytecodeCompleter.loadClass(BytecodeCompleter.java:212) ~[java-frontend-4.5.0.8398.jar:na]
22-Aug-2017 08:39:51         at org.sonar.java.resolve.Symbols.<init>(Symbols.java:176) ~[java-frontend-4.5.0.8398.jar:na]
22-Aug-2017 08:39:51         at org.sonar.java.resolve.SemanticModel.createFor(SemanticModel.java:55) ~[java-frontend-4.5.0.8398.jar:na]
22-Aug-2017 08:39:51         at org.sonar.java.model.VisitorsBridge.visitFile(VisitorsBridge.java:105) ~[java-frontend-4.5.0.8398.jar:na]
22-Aug-2017 08:39:51         at org.sonar.java.ast.JavaAstScanner.simpleScan(JavaAstScanner.java:84) [java-frontend-4.5.0.8398.jar:na]
22-Aug-2017 08:39:51         at org.sonar.java.ast.JavaAstScanner.scan(JavaAstScanner.java:67) [java-frontend-4.5.0.8398.jar:na]
22-Aug-2017 08:39:51         at org.sonar.java.JavaSquid.scanTests(JavaSquid.java:120) [java-frontend-4.5.0.8398.jar:na]
22-Aug-2017 08:39:51         at org.sonar.java.JavaSquid.scan(JavaSquid.java:109) [java-frontend-4.5.0.8398.jar:na]
22-Aug-2017 08:39:51         at org.sonar.plugins.java.JavaSquidSensor.execute(JavaSquidSensor.java:87) [sonar-java-plugin-4.5.0.8398.jar:na]
22-Aug-2017 08:39:51         at org.sonar.batch.sensor.SensorWrapper.analyse(SensorWrapper.java:57) [sonar-scanner-engine-shaded-5.6.3.jar:na]
22-Aug-2017 08:39:51         at org.sonar.batch.phases.SensorsExecutor.executeSensor(SensorsExecutor.java:58) [sonar-scanner-engine-shaded-5.6.3.jar:na]
22-Aug-2017 08:39:51         at org.sonar.batch.phases.SensorsExecutor.execute(SensorsExecutor.java:50) [sonar-scanner-engine-shaded-5.6.3.jar:na]
22-Aug-2017 08:39:51         at org.sonar.batch.phases.AbstractPhaseExecutor.execute(AbstractPhaseExecutor.java:83) [sonar-scanner-engine-shaded-5.6.3.jar:na]
22-Aug-2017 08:39:51         at org.sonar.batch.scan.ModuleScanContainer.doAfterStart(ModuleScanContainer.java:192) [sonar-scanner-engine-shaded-5.6.3.jar:na]
22-Aug-2017 08:39:51         at org.sonar.core.platform.ComponentContainer.startComponents(ComponentContainer.java:142) [sonar-scanner-engine-shaded-5.6.3.jar:na]
22-Aug-2017 08:39:51         at org.sonar.core.platform.ComponentContainer.execute(ComponentContainer.java:127) [sonar-scanner-engine-shaded-5.6.3.jar:na]
22-Aug-2017 08:39:51         at org.sonar.batch.scan.ProjectScanContainer.scan(ProjectScanContainer.java:241) [sonar-scanner-engine-shaded-5.6.3.jar:na]
22-Aug-2017 08:39:51         at org.sonar.batch.scan.ProjectScanContainer.scanRecursively(ProjectScanContainer.java:236) [sonar-scanner-engine-shaded-5.6.3.jar:na]
22-Aug-2017 08:39:51         at org.sonar.batch.scan.ProjectScanContainer.scanRecursively(ProjectScanContainer.java:234) [sonar-scanner-engine-shaded-5.6.3.jar:na]
22-Aug-2017 08:39:51         at org.sonar.batch.scan.ProjectScanContainer.doAfterStart(ProjectScanContainer.java:226) [sonar-scanner-engine-shaded-5.6.3.jar:na]
22-Aug-2017 08:39:51         at org.sonar.core.platform.ComponentContainer.startComponents(ComponentContainer.java:142) [sonar-scanner-engine-shaded-5.6.3.jar:na]
22-Aug-2017 08:39:51         at org.sonar.core.platform.ComponentContainer.execute(ComponentContainer.java:127) [sonar-scanner-engine-shaded-5.6.3.jar:na]
22-Aug-2017 08:39:51         at org.sonar.batch.task.ScanTask.execute(ScanTask.java:47) [sonar-scanner-engine-shaded-5.6.3.jar:na]
22-Aug-2017 08:39:51         at org.sonar.batch.task.TaskContainer.doAfterStart(TaskContainer.java:86) [sonar-scanner-engine-shaded-5.6.3.jar:na]
22-Aug-2017 08:39:51         at org.sonar.core.platform.ComponentContainer.startComponents(ComponentContainer.java:142) [sonar-scanner-engine-shaded-5.6.3.jar:na]
22-Aug-2017 08:39:51         at org.sonar.core.platform.ComponentContainer.execute(ComponentContainer.java:127) [sonar-scanner-engine-shaded-5.6.3.jar:na]
22-Aug-2017 08:39:51         at org.sonar.batch.bootstrap.GlobalContainer.executeTask(GlobalContainer.java:106) [sonar-scanner-engine-shaded-5.6.3.jar:na]
22-Aug-2017 08:39:51         at org.sonar.batch.bootstrapper.Batch.executeTask(Batch.java:119) [sonar-scanner-engine-shaded-5.6.3.jar:na]
22-Aug-2017 08:39:51         at org.sonarsource.scanner.api.internal.batch.BatchIsolatedLauncher.execute(BatchIsolatedLauncher.java:63) [sonar-scanner-api-batch9118975001708217432.jar:na]
22-Aug-2017 08:39:51         at sun.reflect.NativeMethodAccessorImpl.invoke0(Native Method) ~[na:1.8.0_121]
22-Aug-2017 08:39:51         at sun.reflect.NativeMethodAccessorImpl.invoke(NativeMethodAccessorImpl.java:62) ~[na:1.8.0_121]
22-Aug-2017 08:39:51         at sun.reflect.DelegatingMethodAccessorImpl.invoke(DelegatingMethodAccessorImpl.java:43) ~[na:1.8.0_121]
22-Aug-2017 08:39:51         at java.lang.reflect.Method.invoke(Method.java:498) ~[na:1.8.0_121]
22-Aug-2017 08:39:51         at org.sonarsource.scanner.api.internal.IsolatedLauncherProxy.invoke(IsolatedLauncherProxy.java:60) [sonar-scanner-api-2.9.0.887.jar:na]
22-Aug-2017 08:39:51         at com.sun.proxy.$Proxy99.execute(Unknown Source) [na:na]
22-Aug-2017 08:39:51         at org.sonarsource.scanner.api.EmbeddedScanner.doExecute(EmbeddedScanner.java:233) [sonar-scanner-api-2.9.0.887.jar:na]
22-Aug-2017 08:39:51         at org.sonarsource.scanner.api.EmbeddedScanner.runAnalysis(EmbeddedScanner.java:151) [sonar-scanner-api-2.9.0.887.jar:na]
22-Aug-2017 08:39:51         at org.sonarqube.gradle.SonarQubeTask.run(SonarQubeTask.java:99) [sonarqube-gradle-plugin-2.5.jar:na]
22-Aug-2017 08:39:51         at sun.reflect.NativeMethodAccessorImpl.invoke0(Native Method) ~[na:1.8.0_121]
22-Aug-2017 08:39:51         at sun.reflect.NativeMethodAccessorImpl.invoke(NativeMethodAccessorImpl.java:62) ~[na:1.8.0_121]
22-Aug-2017 08:39:51         at sun.reflect.DelegatingMethodAccessorImpl.invoke(DelegatingMethodAccessorImpl.java:43) ~[na:1.8.0_121]
22-Aug-2017 08:39:51         at java.lang.reflect.Method.invoke(Method.java:498) ~[na:1.8.0_121]
22-Aug-2017 08:39:51         at org.gradle.internal.reflect.JavaMethod.invoke(JavaMethod.java:73) [gradle-base-services-4.1.jar:4.1]
22-Aug-2017 08:39:51         at org.gradle.api.internal.project.taskfactory.DefaultTaskClassInfoStore$StandardTaskAction.doExecute(DefaultTaskClassInfoStore.java:141) [gradle-core-4.1.jar:4.1]
22-Aug-2017 08:39:51         at org.gradle.api.internal.project.taskfactory.DefaultTaskClassInfoStore$StandardTaskAction.execute(DefaultTaskClassInfoStore.java:134) [gradle-core-4.1.jar:4.1]
22-Aug-2017 08:39:51         at org.gradle.api.internal.project.taskfactory.DefaultTaskClassInfoStore$StandardTaskAction.execute(DefaultTaskClassInfoStore.java:121) [gradle-core-4.1.jar:4.1]
22-Aug-2017 08:39:51         at org.gradle.api.internal.AbstractTask$TaskActionWrapper.execute(AbstractTask.java:731) [gradle-core-4.1.jar:4.1]
22-Aug-2017 08:39:51         at org.gradle.api.internal.AbstractTask$TaskActionWrapper.execute(AbstractTask.java:705) [gradle-core-4.1.jar:4.1]
22-Aug-2017 08:39:51         at org.gradle.api.internal.tasks.execution.ExecuteActionsTaskExecuter$1.run(ExecuteActionsTaskExecuter.java:122) [gradle-core-4.1.jar:4.1]
22-Aug-2017 08:39:51         at org.gradle.internal.progress.DefaultBuildOperationExecutor$RunnableBuildOperationWorker.execute(DefaultBuildOperationExecutor.java:336) [gradle-core-4.1.jar:4.1]
22-Aug-2017 08:39:51         at org.gradle.internal.progress.DefaultBuildOperationExecutor$RunnableBuildOperationWorker.execute(DefaultBuildOperationExecutor.java:328) [gradle-core-4.1.jar:4.1]
22-Aug-2017 08:39:51         at org.gradle.internal.progress.DefaultBuildOperationExecutor.execute(DefaultBuildOperationExecutor.java:197) [gradle-core-4.1.jar:4.1]
22-Aug-2017 08:39:51         at org.gradle.internal.progress.DefaultBuildOperationExecutor.run(DefaultBuildOperationExecutor.java:107) [gradle-core-4.1.jar:4.1]
22-Aug-2017 08:39:51         at org.gradle.api.internal.tasks.execution.ExecuteActionsTaskExecuter.executeAction(ExecuteActionsTaskExecuter.java:111) [gradle-core-4.1.jar:4.1]
22-Aug-2017 08:39:51         at org.gradle.api.internal.tasks.execution.ExecuteActionsTaskExecuter.executeActions(ExecuteActionsTaskExecuter.java:92) [gradle-core-4.1.jar:4.1]
22-Aug-2017 08:39:51         at org.gradle.api.internal.tasks.execution.ExecuteActionsTaskExecuter.execute(ExecuteActionsTaskExecuter.java:70) [gradle-core-4.1.jar:4.1]
22-Aug-2017 08:39:51         at org.gradle.api.internal.tasks.execution.SkipUpToDateTaskExecuter.execute(SkipUpToDateTaskExecuter.java:63) [gradle-core-4.1.jar:4.1]
22-Aug-2017 08:39:51         at org.gradle.api.internal.tasks.execution.ResolveTaskOutputCachingStateExecuter.execute(ResolveTaskOutputCachingStateExecuter.java:54) [gradle-core-4.1.jar:4.1]
22-Aug-2017 08:39:51         at org.gradle.api.internal.tasks.execution.ValidatingTaskExecuter.execute(ValidatingTaskExecuter.java:58) [gradle-core-4.1.jar:4.1]
22-Aug-2017 08:39:51         at org.gradle.api.internal.tasks.execution.SkipEmptySourceFilesTaskExecuter.execute(SkipEmptySourceFilesTaskExecuter.java:88) [gradle-core-4.1.jar:4.1]
22-Aug-2017 08:39:51         at org.gradle.api.internal.tasks.execution.ResolveTaskArtifactStateTaskExecuter.execute(ResolveTaskArtifactStateTaskExecuter.java:52) [gradle-core-4.1.jar:4.1]
22-Aug-2017 08:39:51         at org.gradle.api.internal.tasks.execution.SkipTaskWithNoActionsExecuter.execute(SkipTaskWithNoActionsExecuter.java:52) [gradle-core-4.1.jar:4.1]
22-Aug-2017 08:39:51         at org.gradle.api.internal.tasks.execution.SkipOnlyIfTaskExecuter.execute(SkipOnlyIfTaskExecuter.java:54) [gradle-core-4.1.jar:4.1]
22-Aug-2017 08:39:51         at org.gradle.api.internal.tasks.execution.ExecuteAtMostOnceTaskExecuter.execute(ExecuteAtMostOnceTaskExecuter.java:43) [gradle-core-4.1.jar:4.1]
22-Aug-2017 08:39:51         at org.gradle.api.internal.tasks.execution.CatchExceptionTaskExecuter.execute(CatchExceptionTaskExecuter.java:34) [gradle-core-4.1.jar:4.1]
22-Aug-2017 08:39:51         at org.gradle.execution.taskgraph.DefaultTaskGraphExecuter$EventFiringTaskWorker$1.run(DefaultTaskGraphExecuter.java:248) [gradle-core-4.1.jar:4.1]
22-Aug-2017 08:39:51         at org.gradle.internal.progress.DefaultBuildOperationExecutor$RunnableBuildOperationWorker.execute(DefaultBuildOperationExecutor.java:336) [gradle-core-4.1.jar:4.1]
22-Aug-2017 08:39:51         at org.gradle.internal.progress.DefaultBuildOperationExecutor$RunnableBuildOperationWorker.execute(DefaultBuildOperationExecutor.java:328) [gradle-core-4.1.jar:4.1]
22-Aug-2017 08:39:51         at org.gradle.internal.progress.DefaultBuildOperationExecutor.execute(DefaultBuildOperationExecutor.java:197) [gradle-core-4.1.jar:4.1]
22-Aug-2017 08:39:51         at org.gradle.internal.progress.DefaultBuildOperationExecutor.run(DefaultBuildOperationExecutor.java:107) [gradle-core-4.1.jar:4.1]
22-Aug-2017 08:39:51         at org.gradle.execution.taskgraph.DefaultTaskGraphExecuter$EventFiringTaskWorker.execute(DefaultTaskGraphExecuter.java:241) [gradle-core-4.1.jar:4.1]
22-Aug-2017 08:39:51         at org.gradle.execution.taskgraph.DefaultTaskGraphExecuter$EventFiringTaskWorker.execute(DefaultTaskGraphExecuter.java:230) [gradle-core-4.1.jar:4.1]
22-Aug-2017 08:39:51         at org.gradle.execution.taskgraph.DefaultTaskPlanExecutor$TaskExecutorWorker.processTask(DefaultTaskPlanExecutor.java:124) [gradle-core-4.1.jar:4.1]
22-Aug-2017 08:39:51         at org.gradle.execution.taskgraph.DefaultTaskPlanExecutor$TaskExecutorWorker.access$200(DefaultTaskPlanExecutor.java:80) [gradle-core-4.1.jar:4.1]
22-Aug-2017 08:39:51         at org.gradle.execution.taskgraph.DefaultTaskPlanExecutor$TaskExecutorWorker$1.execute(DefaultTaskPlanExecutor.java:105) [gradle-core-4.1.jar:4.1]
22-Aug-2017 08:39:51         at org.gradle.execution.taskgraph.DefaultTaskPlanExecutor$TaskExecutorWorker$1.execute(DefaultTaskPlanExecutor.java:99) [gradle-core-4.1.jar:4.1]
22-Aug-2017 08:39:51         at org.gradle.execution.taskgraph.DefaultTaskExecutionPlan.execute(DefaultTaskExecutionPlan.java:625) [gradle-core-4.1.jar:4.1]
22-Aug-2017 08:39:51         at org.gradle.execution.taskgraph.DefaultTaskExecutionPlan.executeWithTask(DefaultTaskExecutionPlan.java:580) [gradle-core-4.1.jar:4.1]
22-Aug-2017 08:39:51         at org.gradle.execution.taskgraph.DefaultTaskPlanExecutor$TaskExecutorWorker.run(DefaultTaskPlanExecutor.java:99) [gradle-core-4.1.jar:4.1]
22-Aug-2017 08:39:51         at org.gradle.internal.concurrent.ExecutorPolicy$CatchAndRecordFailures.onExecute(ExecutorPolicy.java:63) [gradle-base-services-4.1.jar:4.1]
22-Aug-2017 08:39:51         at org.gradle.internal.concurrent.ManagedExecutorImpl$1.run(ManagedExecutorImpl.java:46) [gradle-base-services-4.1.jar:4.1]
22-Aug-2017 08:39:51         at java.util.concurrent.ThreadPoolExecutor.runWorker(ThreadPoolExecutor.java:1142) [na:1.8.0_121]
22-Aug-2017 08:39:51         at java.util.concurrent.ThreadPoolExecutor$Worker.run(ThreadPoolExecutor.java:617) [na:1.8.0_121]
22-Aug-2017 08:39:51         at org.gradle.internal.concurrent.ThreadFactoryImpl$ManagedThreadRunnable.run(ThreadFactoryImpl.java:55) [gradle-base-services-4.1.jar:4.1]
22-Aug-2017 08:39:51         at java.lang.Thread.run(Thread.java:745) [na:1.8.0_121]
22-Aug-2017 08:39:51 Caused by: java.lang.IllegalStateException: Unable to open /opt/bamboo-home/xml-data/build-dir/SPR-SONAR-JOB1/spring-orm/build/resources/test/order.jar
22-Aug-2017 08:39:51         at org.sonar.java.bytecode.loader.JarLoader.<init>(JarLoader.java:51) ~[java-frontend-4.5.0.8398.jar:na]
22-Aug-2017 08:39:51         at org.sonar.java.bytecode.loader.SquidClassLoader.<init>(SquidClassLoader.java:51) ~[java-frontend-4.5.0.8398.jar:na]
22-Aug-2017 08:39:51         at org.sonar.java.bytecode.ClassLoaderBuilder.create(ClassLoaderBuilder.java:59) ~[java-frontend-4.5.0.8398.jar:na]
22-Aug-2017 08:39:51         ... 87 common frames omitted
22-Aug-2017 08:39:51 Caused by: java.util.zip.ZipException: zip file is empty
22-Aug-2017 08:39:51         at java.util.zip.ZipFile.open(Native Method) ~[na:1.8.0_121]
22-Aug-2017 08:39:51         at java.util.zip.ZipFile.<init>(ZipFile.java:219) ~[na:1.8.0_121]
22-Aug-2017 08:39:51         at java.util.zip.ZipFile.<init>(ZipFile.java:149) ~[na:1.8.0_121]
22-Aug-2017 08:39:51         at java.util.jar.JarFile.<init>(JarFile.java:166) ~[na:1.8.0_121]
22-Aug-2017 08:39:51         at java.util.jar.JarFile.<init>(JarFile.java:130) ~[na:1.8.0_121]
22-Aug-2017 08:39:51         at org.sonar.java.bytecode.loader.JarLoader.<init>(JarLoader.java:48) ~[java-frontend-4.5.0.8398.jar:na]
22-Aug-2017 08:39:51         ... 89 common frames omitted
22-Aug-2017 08:39:51
22-Aug-2017 08:39:51 Unable to create symbol table for : /opt/bamboo-home/xml-data/build-dir/SPR-SONAR-JOB1/spring-aspects/src/test/java/org/springframework/transaction/aspectj/JtaTransactionAspectsTests.java
22-Aug-2017 08:39:51 java.lang.IllegalStateException: Can not create ClassLoader
22-Aug-2017 08:39:51         at org.sonar.java.bytecode.ClassLoaderBuilder.create(ClassLoaderBuilder.java:61) ~[java-frontend-4.5.0.8398.jar:na]
22-Aug-2017 08:39:51         at org.sonar.java.resolve.BytecodeCompleter.getClassLoader(BytecodeCompleter.java:118) ~[java-frontend-4.5.0.8398.jar:na]
22-Aug-2017 08:39:51         at org.sonar.java.resolve.BytecodeCompleter.inputStreamFor(BytecodeCompleter.java:113) ~[java-frontend-4.5.0.8398.jar:na]
22-Aug-2017 08:39:51         at org.sonar.java.resolve.BytecodeCompleter.loadClass(BytecodeCompleter.java:212) ~[java-frontend-4.5.0.8398.jar:na]
22-Aug-2017 08:39:51         at org.sonar.java.resolve.Symbols.<init>(Symbols.java:176) ~[java-frontend-4.5.0.8398.jar:na]
22-Aug-2017 08:39:51         at org.sonar.java.resolve.SemanticModel.createFor(SemanticModel.java:55) ~[java-frontend-4.5.0.8398.jar:na]
22-Aug-2017 08:39:51         at org.sonar.java.model.VisitorsBridge.visitFile(VisitorsBridge.java:105) ~[java-frontend-4.5.0.8398.jar:na]
22-Aug-2017 08:39:51         at org.sonar.java.ast.JavaAstScanner.simpleScan(JavaAstScanner.java:84) [java-frontend-4.5.0.8398.jar:na]
22-Aug-2017 08:39:51         at org.sonar.java.ast.JavaAstScanner.scan(JavaAstScanner.java:67) [java-frontend-4.5.0.8398.jar:na]
22-Aug-2017 08:39:51         at org.sonar.java.JavaSquid.scanTests(JavaSquid.java:120) [java-frontend-4.5.0.8398.jar:na]
22-Aug-2017 08:39:51         at org.sonar.java.JavaSquid.scan(JavaSquid.java:109) [java-frontend-4.5.0.8398.jar:na]
22-Aug-2017 08:39:51         at org.sonar.plugins.java.JavaSquidSensor.execute(JavaSquidSensor.java:87) [sonar-java-plugin-4.5.0.8398.jar:na]
22-Aug-2017 08:39:51         at org.sonar.batch.sensor.SensorWrapper.analyse(SensorWrapper.java:57) [sonar-scanner-engine-shaded-5.6.3.jar:na]
22-Aug-2017 08:39:51         at org.sonar.batch.phases.SensorsExecutor.executeSensor(SensorsExecutor.java:58) [sonar-scanner-engine-shaded-5.6.3.jar:na]
22-Aug-2017 08:39:51         at org.sonar.batch.phases.SensorsExecutor.execute(SensorsExecutor.java:50) [sonar-scanner-engine-shaded-5.6.3.jar:na]
22-Aug-2017 08:39:51         at org.sonar.batch.phases.AbstractPhaseExecutor.execute(AbstractPhaseExecutor.java:83) [sonar-scanner-engine-shaded-5.6.3.jar:na]
22-Aug-2017 08:39:51         at org.sonar.batch.scan.ModuleScanContainer.doAfterStart(ModuleScanContainer.java:192) [sonar-scanner-engine-shaded-5.6.3.jar:na]
22-Aug-2017 08:39:51         at org.sonar.core.platform.ComponentContainer.startComponents(ComponentContainer.java:142) [sonar-scanner-engine-shaded-5.6.3.jar:na]
22-Aug-2017 08:39:51         at org.sonar.core.platform.ComponentContainer.execute(ComponentContainer.java:127) [sonar-scanner-engine-shaded-5.6.3.jar:na]
22-Aug-2017 08:39:51         at org.sonar.batch.scan.ProjectScanContainer.scan(ProjectScanContainer.java:241) [sonar-scanner-engine-shaded-5.6.3.jar:na]
22-Aug-2017 08:39:51         at org.sonar.batch.scan.ProjectScanContainer.scanRecursively(ProjectScanContainer.java:236) [sonar-scanner-engine-shaded-5.6.3.jar:na]
22-Aug-2017 08:39:51         at org.sonar.batch.scan.ProjectScanContainer.scanRecursively(ProjectScanContainer.java:234) [sonar-scanner-engine-shaded-5.6.3.jar:na]
22-Aug-2017 08:39:51         at org.sonar.batch.scan.ProjectScanContainer.doAfterStart(ProjectScanContainer.java:226) [sonar-scanner-engine-shaded-5.6.3.jar:na]
22-Aug-2017 08:39:51         at org.sonar.core.platform.ComponentContainer.startComponents(ComponentContainer.java:142) [sonar-scanner-engine-shaded-5.6.3.jar:na]
22-Aug-2017 08:39:51         at org.sonar.core.platform.ComponentContainer.execute(ComponentContainer.java:127) [sonar-scanner-engine-shaded-5.6.3.jar:na]
22-Aug-2017 08:39:51         at org.sonar.batch.task.ScanTask.execute(ScanTask.java:47) [sonar-scanner-engine-shaded-5.6.3.jar:na]
22-Aug-2017 08:39:51         at org.sonar.batch.task.TaskContainer.doAfterStart(TaskContainer.java:86) [sonar-scanner-engine-shaded-5.6.3.jar:na]
22-Aug-2017 08:39:51         at org.sonar.core.platform.ComponentContainer.startComponents(ComponentContainer.java:142) [sonar-scanner-engine-shaded-5.6.3.jar:na]
22-Aug-2017 08:39:51         at org.sonar.core.platform.ComponentContainer.execute(ComponentContainer.java:127) [sonar-scanner-engine-shaded-5.6.3.jar:na]
22-Aug-2017 08:39:51         at org.sonar.batch.bootstrap.GlobalContainer.executeTask(GlobalContainer.java:106) [sonar-scanner-engine-shaded-5.6.3.jar:na]
22-Aug-2017 08:39:51         at org.sonar.batch.bootstrapper.Batch.executeTask(Batch.java:119) [sonar-scanner-engine-shaded-5.6.3.jar:na]
22-Aug-2017 08:39:51         at org.sonarsource.scanner.api.internal.batch.BatchIsolatedLauncher.execute(BatchIsolatedLauncher.java:63) [sonar-scanner-api-batch9118975001708217432.jar:na]
22-Aug-2017 08:39:51         at sun.reflect.NativeMethodAccessorImpl.invoke0(Native Method) ~[na:1.8.0_121]
22-Aug-2017 08:39:51         at sun.reflect.NativeMethodAccessorImpl.invoke(NativeMethodAccessorImpl.java:62) ~[na:1.8.0_121]
22-Aug-2017 08:39:51         at sun.reflect.DelegatingMethodAccessorImpl.invoke(DelegatingMethodAccessorImpl.java:43) ~[na:1.8.0_121]
22-Aug-2017 08:39:51         at java.lang.reflect.Method.invoke(Method.java:498) ~[na:1.8.0_121]
22-Aug-2017 08:39:51         at org.sonarsource.scanner.api.internal.IsolatedLauncherProxy.invoke(IsolatedLauncherProxy.java:60) [sonar-scanner-api-2.9.0.887.jar:na]
22-Aug-2017 08:39:51         at com.sun.proxy.$Proxy99.execute(Unknown Source) [na:na]
22-Aug-2017 08:39:51         at org.sonarsource.scanner.api.EmbeddedScanner.doExecute(EmbeddedScanner.java:233) [sonar-scanner-api-2.9.0.887.jar:na]
22-Aug-2017 08:39:51         at org.sonarsource.scanner.api.EmbeddedScanner.runAnalysis(EmbeddedScanner.java:151) [sonar-scanner-api-2.9.0.887.jar:na]
22-Aug-2017 08:39:51         at org.sonarqube.gradle.SonarQubeTask.run(SonarQubeTask.java:99) [sonarqube-gradle-plugin-2.5.jar:na]
22-Aug-2017 08:39:51         at sun.reflect.NativeMethodAccessorImpl.invoke0(Native Method) ~[na:1.8.0_121]
22-Aug-2017 08:39:51         at sun.reflect.NativeMethodAccessorImpl.invoke(NativeMethodAccessorImpl.java:62) ~[na:1.8.0_121]
22-Aug-2017 08:39:51         at sun.reflect.DelegatingMethodAccessorImpl.invoke(DelegatingMethodAccessorImpl.java:43) ~[na:1.8.0_121]
22-Aug-2017 08:39:51         at java.lang.reflect.Method.invoke(Method.java:498) ~[na:1.8.0_121]
22-Aug-2017 08:39:51         at org.gradle.internal.reflect.JavaMethod.invoke(JavaMethod.java:73) [gradle-base-services-4.1.jar:4.1]
22-Aug-2017 08:39:51         at org.gradle.api.internal.project.taskfactory.DefaultTaskClassInfoStore$StandardTaskAction.doExecute(DefaultTaskClassInfoStore.java:141) [gradle-core-4.1.jar:4.1]
22-Aug-2017 08:39:51         at org.gradle.api.internal.project.taskfactory.DefaultTaskClassInfoStore$StandardTaskAction.execute(DefaultTaskClassInfoStore.java:134) [gradle-core-4.1.jar:4.1]
22-Aug-2017 08:39:51         at org.gradle.api.internal.project.taskfactory.DefaultTaskClassInfoStore$StandardTaskAction.execute(DefaultTaskClassInfoStore.java:121) [gradle-core-4.1.jar:4.1]
22-Aug-2017 08:39:51         at org.gradle.api.internal.AbstractTask$TaskActionWrapper.execute(AbstractTask.java:731) [gradle-core-4.1.jar:4.1]
22-Aug-2017 08:39:51         at org.gradle.api.internal.AbstractTask$TaskActionWrapper.execute(AbstractTask.java:705) [gradle-core-4.1.jar:4.1]
22-Aug-2017 08:39:51         at org.gradle.api.internal.tasks.execution.ExecuteActionsTaskExecuter$1.run(ExecuteActionsTaskExecuter.java:122) [gradle-core-4.1.jar:4.1]
22-Aug-2017 08:39:51         at org.gradle.internal.progress.DefaultBuildOperationExecutor$RunnableBuildOperationWorker.execute(DefaultBuildOperationExecutor.java:336) [gradle-core-4.1.jar:4.1]
22-Aug-2017 08:39:51         at org.gradle.internal.progress.DefaultBuildOperationExecutor$RunnableBuildOperationWorker.execute(DefaultBuildOperationExecutor.java:328) [gradle-core-4.1.jar:4.1]
22-Aug-2017 08:39:51         at org.gradle.internal.progress.DefaultBuildOperationExecutor.execute(DefaultBuildOperationExecutor.java:197) [gradle-core-4.1.jar:4.1]
22-Aug-2017 08:39:51         at org.gradle.internal.progress.DefaultBuildOperationExecutor.run(DefaultBuildOperationExecutor.java:107) [gradle-core-4.1.jar:4.1]
22-Aug-2017 08:39:51         at org.gradle.api.internal.tasks.execution.ExecuteActionsTaskExecuter.executeAction(ExecuteActionsTaskExecuter.java:111) [gradle-core-4.1.jar:4.1]
22-Aug-2017 08:39:51         at org.gradle.api.internal.tasks.execution.ExecuteActionsTaskExecuter.executeActions(ExecuteActionsTaskExecuter.java:92) [gradle-core-4.1.jar:4.1]
22-Aug-2017 08:39:51         at org.gradle.api.internal.tasks.execution.ExecuteActionsTaskExecuter.execute(ExecuteActionsTaskExecuter.java:70) [gradle-core-4.1.jar:4.1]
22-Aug-2017 08:39:51         at org.gradle.api.internal.tasks.execution.SkipUpToDateTaskExecuter.execute(SkipUpToDateTaskExecuter.java:63) [gradle-core-4.1.jar:4.1]
22-Aug-2017 08:39:51         at org.gradle.api.internal.tasks.execution.ResolveTaskOutputCachingStateExecuter.execute(ResolveTaskOutputCachingStateExecuter.java:54) [gradle-core-4.1.jar:4.1]
22-Aug-2017 08:39:51         at org.gradle.api.internal.tasks.execution.ValidatingTaskExecuter.execute(ValidatingTaskExecuter.java:58) [gradle-core-4.1.jar:4.1]
22-Aug-2017 08:39:51         at org.gradle.api.internal.tasks.execution.SkipEmptySourceFilesTaskExecuter.execute(SkipEmptySourceFilesTaskExecuter.java:88) [gradle-core-4.1.jar:4.1]
22-Aug-2017 08:39:51         at org.gradle.api.internal.tasks.execution.ResolveTaskArtifactStateTaskExecuter.execute(ResolveTaskArtifactStateTaskExecuter.java:52) [gradle-core-4.1.jar:4.1]
22-Aug-2017 08:39:51         at org.gradle.api.internal.tasks.execution.SkipTaskWithNoActionsExecuter.execute(SkipTaskWithNoActionsExecuter.java:52) [gradle-core-4.1.jar:4.1]
22-Aug-2017 08:39:51         at org.gradle.api.internal.tasks.execution.SkipOnlyIfTaskExecuter.execute(SkipOnlyIfTaskExecuter.java:54) [gradle-core-4.1.jar:4.1]
22-Aug-2017 08:39:51         at org.gradle.api.internal.tasks.execution.ExecuteAtMostOnceTaskExecuter.execute(ExecuteAtMostOnceTaskExecuter.java:43) [gradle-core-4.1.jar:4.1]
22-Aug-2017 08:39:51         at org.gradle.api.internal.tasks.execution.CatchExceptionTaskExecuter.execute(CatchExceptionTaskExecuter.java:34) [gradle-core-4.1.jar:4.1]
22-Aug-2017 08:39:51         at org.gradle.execution.taskgraph.DefaultTaskGraphExecuter$EventFiringTaskWorker$1.run(DefaultTaskGraphExecuter.java:248) [gradle-core-4.1.jar:4.1]
22-Aug-2017 08:39:51         at org.gradle.internal.progress.DefaultBuildOperationExecutor$RunnableBuildOperationWorker.execute(DefaultBuildOperationExecutor.java:336) [gradle-core-4.1.jar:4.1]
22-Aug-2017 08:39:51         at org.gradle.internal.progress.DefaultBuildOperationExecutor$RunnableBuildOperationWorker.execute(DefaultBuildOperationExecutor.java:328) [gradle-core-4.1.jar:4.1]
22-Aug-2017 08:39:51         at org.gradle.internal.progress.DefaultBuildOperationExecutor.execute(DefaultBuildOperationExecutor.java:197) [gradle-core-4.1.jar:4.1]
22-Aug-2017 08:39:51         at org.gradle.internal.progress.DefaultBuildOperationExecutor.run(DefaultBuildOperationExecutor.java:107) [gradle-core-4.1.jar:4.1]
22-Aug-2017 08:39:51         at org.gradle.execution.taskgraph.DefaultTaskGraphExecuter$EventFiringTaskWorker.execute(DefaultTaskGraphExecuter.java:241) [gradle-core-4.1.jar:4.1]
22-Aug-2017 08:39:51         at org.gradle.execution.taskgraph.DefaultTaskGraphExecuter$EventFiringTaskWorker.execute(DefaultTaskGraphExecuter.java:230) [gradle-core-4.1.jar:4.1]
22-Aug-2017 08:39:51         at org.gradle.execution.taskgraph.DefaultTaskPlanExecutor$TaskExecutorWorker.processTask(DefaultTaskPlanExecutor.java:124) [gradle-core-4.1.jar:4.1]
22-Aug-2017 08:39:51         at org.gradle.execution.taskgraph.DefaultTaskPlanExecutor$TaskExecutorWorker.access$200(DefaultTaskPlanExecutor.java:80) [gradle-core-4.1.jar:4.1]
22-Aug-2017 08:39:51         at org.gradle.execution.taskgraph.DefaultTaskPlanExecutor$TaskExecutorWorker$1.execute(DefaultTaskPlanExecutor.java:105) [gradle-core-4.1.jar:4.1]
22-Aug-2017 08:39:51         at org.gradle.execution.taskgraph.DefaultTaskPlanExecutor$TaskExecutorWorker$1.execute(DefaultTaskPlanExecutor.java:99) [gradle-core-4.1.jar:4.1]
22-Aug-2017 08:39:51         at org.gradle.execution.taskgraph.DefaultTaskExecutionPlan.execute(DefaultTaskExecutionPlan.java:625) [gradle-core-4.1.jar:4.1]
22-Aug-2017 08:39:51         at org.gradle.execution.taskgraph.DefaultTaskExecutionPlan.executeWithTask(DefaultTaskExecutionPlan.java:580) [gradle-core-4.1.jar:4.1]
22-Aug-2017 08:39:51         at org.gradle.execution.taskgraph.DefaultTaskPlanExecutor$TaskExecutorWorker.run(DefaultTaskPlanExecutor.java:99) [gradle-core-4.1.jar:4.1]
22-Aug-2017 08:39:51         at org.gradle.internal.concurrent.ExecutorPolicy$CatchAndRecordFailures.onExecute(ExecutorPolicy.java:63) [gradle-base-services-4.1.jar:4.1]
22-Aug-2017 08:39:51         at org.gradle.internal.concurrent.ManagedExecutorImpl$1.run(ManagedExecutorImpl.java:46) [gradle-base-services-4.1.jar:4.1]
22-Aug-2017 08:39:51         at java.util.concurrent.ThreadPoolExecutor.runWorker(ThreadPoolExecutor.java:1142) [na:1.8.0_121]
22-Aug-2017 08:39:51         at java.util.concurrent.ThreadPoolExecutor$Worker.run(ThreadPoolExecutor.java:617) [na:1.8.0_121]
22-Aug-2017 08:39:51         at org.gradle.internal.concurrent.ThreadFactoryImpl$ManagedThreadRunnable.run(ThreadFactoryImpl.java:55) [gradle-base-services-4.1.jar:4.1]
22-Aug-2017 08:39:51         at java.lang.Thread.run(Thread.java:745) [na:1.8.0_121]
22-Aug-2017 08:39:51 Caused by: java.lang.IllegalStateException: Unable to open /opt/bamboo-home/xml-data/build-dir/SPR-SONAR-JOB1/spring-orm/build/resources/test/order.jar
22-Aug-2017 08:39:51         at org.sonar.java.bytecode.loader.JarLoader.<init>(JarLoader.java:51) ~[java-frontend-4.5.0.8398.jar:na]
22-Aug-2017 08:39:51         at org.sonar.java.bytecode.loader.SquidClassLoader.<init>(SquidClassLoader.java:51) ~[java-frontend-4.5.0.8398.jar:na]
22-Aug-2017 08:39:51         at org.sonar.java.bytecode.ClassLoaderBuilder.create(ClassLoaderBuilder.java:59) ~[java-frontend-4.5.0.8398.jar:na]
22-Aug-2017 08:39:51         ... 87 common frames omitted
22-Aug-2017 08:39:51 Caused by: java.util.zip.ZipException: zip file is empty
22-Aug-2017 08:39:51         at java.util.zip.ZipFile.open(Native Method) ~[na:1.8.0_121]
22-Aug-2017 08:39:51         at java.util.zip.ZipFile.<init>(ZipFile.java:219) ~[na:1.8.0_121]
22-Aug-2017 08:39:51         at java.util.zip.ZipFile.<init>(ZipFile.java:149) ~[na:1.8.0_121]
22-Aug-2017 08:39:51         at java.util.jar.JarFile.<init>(JarFile.java:166) ~[na:1.8.0_121]
22-Aug-2017 08:39:51         at java.util.jar.JarFile.<init>(JarFile.java:130) ~[na:1.8.0_121]
22-Aug-2017 08:39:51         at org.sonar.java.bytecode.loader.JarLoader.<init>(JarLoader.java:48) ~[java-frontend-4.5.0.8398.jar:na]
22-Aug-2017 08:39:51         ... 89 common frames omitted
22-Aug-2017 08:39:51
22-Aug-2017 08:39:51 Unable to create symbol table for : /opt/bamboo-home/xml-data/build-dir/SPR-SONAR-JOB1/spring-aspects/src/test/java/org/springframework/transaction/aspectj/MethodAnnotationOnClassWithNoInterface.java
22-Aug-2017 08:39:51 java.lang.IllegalStateException: Can not create ClassLoader
22-Aug-2017 08:39:51         at org.sonar.java.bytecode.ClassLoaderBuilder.create(ClassLoaderBuilder.java:61) ~[java-frontend-4.5.0.8398.jar:na]
22-Aug-2017 08:39:51         at org.sonar.java.resolve.BytecodeCompleter.getClassLoader(BytecodeCompleter.java:118) ~[java-frontend-4.5.0.8398.jar:na]
22-Aug-2017 08:39:51         at org.sonar.java.resolve.BytecodeCompleter.inputStreamFor(BytecodeCompleter.java:113) ~[java-frontend-4.5.0.8398.jar:na]
22-Aug-2017 08:39:51         at org.sonar.java.resolve.BytecodeCompleter.loadClass(BytecodeCompleter.java:212) ~[java-frontend-4.5.0.8398.jar:na]
22-Aug-2017 08:39:51         at org.sonar.java.resolve.Symbols.<init>(Symbols.java:176) ~[java-frontend-4.5.0.8398.jar:na]
22-Aug-2017 08:39:51         at org.sonar.java.resolve.SemanticModel.createFor(SemanticModel.java:55) ~[java-frontend-4.5.0.8398.jar:na]
22-Aug-2017 08:39:51         at org.sonar.java.model.VisitorsBridge.visitFile(VisitorsBridge.java:105) ~[java-frontend-4.5.0.8398.jar:na]
22-Aug-2017 08:39:51         at org.sonar.java.ast.JavaAstScanner.simpleScan(JavaAstScanner.java:84) [java-frontend-4.5.0.8398.jar:na]
22-Aug-2017 08:39:51         at org.sonar.java.ast.JavaAstScanner.scan(JavaAstScanner.java:67) [java-frontend-4.5.0.8398.jar:na]
22-Aug-2017 08:39:51         at org.sonar.java.JavaSquid.scanTests(JavaSquid.java:120) [java-frontend-4.5.0.8398.jar:na]
22-Aug-2017 08:39:51         at org.sonar.java.JavaSquid.scan(JavaSquid.java:109) [java-frontend-4.5.0.8398.jar:na]
22-Aug-2017 08:39:51         at org.sonar.plugins.java.JavaSquidSensor.execute(JavaSquidSensor.java:87) [sonar-java-plugin-4.5.0.8398.jar:na]
22-Aug-2017 08:39:51         at org.sonar.batch.sensor.SensorWrapper.analyse(SensorWrapper.java:57) [sonar-scanner-engine-shaded-5.6.3.jar:na]
22-Aug-2017 08:39:51         at org.sonar.batch.phases.SensorsExecutor.executeSensor(SensorsExecutor.java:58) [sonar-scanner-engine-shaded-5.6.3.jar:na]
22-Aug-2017 08:39:51         at org.sonar.batch.phases.SensorsExecutor.execute(SensorsExecutor.java:50) [sonar-scanner-engine-shaded-5.6.3.jar:na]
22-Aug-2017 08:39:51         at org.sonar.batch.phases.AbstractPhaseExecutor.execute(AbstractPhaseExecutor.java:83) [sonar-scanner-engine-shaded-5.6.3.jar:na]
22-Aug-2017 08:39:51         at org.sonar.batch.scan.ModuleScanContainer.doAfterStart(ModuleScanContainer.java:192) [sonar-scanner-engine-shaded-5.6.3.jar:na]
22-Aug-2017 08:39:51         at org.sonar.core.platform.ComponentContainer.startComponents(ComponentContainer.java:142) [sonar-scanner-engine-shaded-5.6.3.jar:na]
22-Aug-2017 08:39:51         at org.sonar.core.platform.ComponentContainer.execute(ComponentContainer.java:127) [sonar-scanner-engine-shaded-5.6.3.jar:na]
22-Aug-2017 08:39:51         at org.sonar.batch.scan.ProjectScanContainer.scan(ProjectScanContainer.java:241) [sonar-scanner-engine-shaded-5.6.3.jar:na]
22-Aug-2017 08:39:51         at org.sonar.batch.scan.ProjectScanContainer.scanRecursively(ProjectScanContainer.java:236) [sonar-scanner-engine-shaded-5.6.3.jar:na]
22-Aug-2017 08:39:51         at org.sonar.batch.scan.ProjectScanContainer.scanRecursively(ProjectScanContainer.java:234) [sonar-scanner-engine-shaded-5.6.3.jar:na]
22-Aug-2017 08:39:51         at org.sonar.batch.scan.ProjectScanContainer.doAfterStart(ProjectScanContainer.java:226) [sonar-scanner-engine-shaded-5.6.3.jar:na]
22-Aug-2017 08:39:51         at org.sonar.core.platform.ComponentContainer.startComponents(ComponentContainer.java:142) [sonar-scanner-engine-shaded-5.6.3.jar:na]
22-Aug-2017 08:39:51         at org.sonar.core.platform.ComponentContainer.execute(ComponentContainer.java:127) [sonar-scanner-engine-shaded-5.6.3.jar:na]
22-Aug-2017 08:39:51         at org.sonar.batch.task.ScanTask.execute(ScanTask.java:47) [sonar-scanner-engine-shaded-5.6.3.jar:na]
22-Aug-2017 08:39:51         at org.sonar.batch.task.TaskContainer.doAfterStart(TaskContainer.java:86) [sonar-scanner-engine-shaded-5.6.3.jar:na]
22-Aug-2017 08:39:51         at org.sonar.core.platform.ComponentContainer.startComponents(ComponentContainer.java:142) [sonar-scanner-engine-shaded-5.6.3.jar:na]
22-Aug-2017 08:39:51         at org.sonar.core.platform.ComponentContainer.execute(ComponentContainer.java:127) [sonar-scanner-engine-shaded-5.6.3.jar:na]
22-Aug-2017 08:39:51         at org.sonar.batch.bootstrap.GlobalContainer.executeTask(GlobalContainer.java:106) [sonar-scanner-engine-shaded-5.6.3.jar:na]
22-Aug-2017 08:39:51         at org.sonar.batch.bootstrapper.Batch.executeTask(Batch.java:119) [sonar-scanner-engine-shaded-5.6.3.jar:na]
22-Aug-2017 08:39:51         at org.sonarsource.scanner.api.internal.batch.BatchIsolatedLauncher.execute(BatchIsolatedLauncher.java:63) [sonar-scanner-api-batch9118975001708217432.jar:na]
22-Aug-2017 08:39:51         at sun.reflect.NativeMethodAccessorImpl.invoke0(Native Method) ~[na:1.8.0_121]
22-Aug-2017 08:39:51         at sun.reflect.NativeMethodAccessorImpl.invoke(NativeMethodAccessorImpl.java:62) ~[na:1.8.0_121]
22-Aug-2017 08:39:51         at sun.reflect.DelegatingMethodAccessorImpl.invoke(DelegatingMethodAccessorImpl.java:43) ~[na:1.8.0_121]
22-Aug-2017 08:39:51         at java.lang.reflect.Method.invoke(Method.java:498) ~[na:1.8.0_121]
22-Aug-2017 08:39:51         at org.sonarsource.scanner.api.internal.IsolatedLauncherProxy.invoke(IsolatedLauncherProxy.java:60) [sonar-scanner-api-2.9.0.887.jar:na]
22-Aug-2017 08:39:51         at com.sun.proxy.$Proxy99.execute(Unknown Source) [na:na]
22-Aug-2017 08:39:51         at org.sonarsource.scanner.api.EmbeddedScanner.doExecute(EmbeddedScanner.java:233) [sonar-scanner-api-2.9.0.887.jar:na]
22-Aug-2017 08:39:51         at org.sonarsource.scanner.api.EmbeddedScanner.runAnalysis(EmbeddedScanner.java:151) [sonar-scanner-api-2.9.0.887.jar:na]
22-Aug-2017 08:39:51         at org.sonarqube.gradle.SonarQubeTask.run(SonarQubeTask.java:99) [sonarqube-gradle-plugin-2.5.jar:na]
22-Aug-2017 08:39:51         at sun.reflect.NativeMethodAccessorImpl.invoke0(Native Method) ~[na:1.8.0_121]
22-Aug-2017 08:39:51         at sun.reflect.NativeMethodAccessorImpl.invoke(NativeMethodAccessorImpl.java:62) ~[na:1.8.0_121]
22-Aug-2017 08:39:51         at sun.reflect.DelegatingMethodAccessorImpl.invoke(DelegatingMethodAccessorImpl.java:43) ~[na:1.8.0_121]
22-Aug-2017 08:39:51         at java.lang.reflect.Method.invoke(Method.java:498) ~[na:1.8.0_121]
22-Aug-2017 08:39:51         at org.gradle.internal.reflect.JavaMethod.invoke(JavaMethod.java:73) [gradle-base-services-4.1.jar:4.1]
22-Aug-2017 08:39:51         at org.gradle.api.internal.project.taskfactory.DefaultTaskClassInfoStore$StandardTaskAction.doExecute(DefaultTaskClassInfoStore.java:141) [gradle-core-4.1.jar:4.1]
22-Aug-2017 08:39:51         at org.gradle.api.internal.project.taskfactory.DefaultTaskClassInfoStore$StandardTaskAction.execute(DefaultTaskClassInfoStore.java:134) [gradle-core-4.1.jar:4.1]
22-Aug-2017 08:39:51         at org.gradle.api.internal.project.taskfactory.DefaultTaskClassInfoStore$StandardTaskAction.execute(DefaultTaskClassInfoStore.java:121) [gradle-core-4.1.jar:4.1]
22-Aug-2017 08:39:51         at org.gradle.api.internal.AbstractTask$TaskActionWrapper.execute(AbstractTask.java:731) [gradle-core-4.1.jar:4.1]
22-Aug-2017 08:39:51         at org.gradle.api.internal.AbstractTask$TaskActionWrapper.execute(AbstractTask.java:705) [gradle-core-4.1.jar:4.1]
22-Aug-2017 08:39:51         at org.gradle.api.internal.tasks.execution.ExecuteActionsTaskExecuter$1.run(ExecuteActionsTaskExecuter.java:122) [gradle-core-4.1.jar:4.1]
22-Aug-2017 08:39:51         at org.gradle.internal.progress.DefaultBuildOperationExecutor$RunnableBuildOperationWorker.execute(DefaultBuildOperationExecutor.java:336) [gradle-core-4.1.jar:4.1]
22-Aug-2017 08:39:51         at org.gradle.internal.progress.DefaultBuildOperationExecutor$RunnableBuildOperationWorker.execute(DefaultBuildOperationExecutor.java:328) [gradle-core-4.1.jar:4.1]
22-Aug-2017 08:39:51         at org.gradle.internal.progress.DefaultBuildOperationExecutor.execute(DefaultBuildOperationExecutor.java:197) [gradle-core-4.1.jar:4.1]
22-Aug-2017 08:39:51         at org.gradle.internal.progress.DefaultBuildOperationExecutor.run(DefaultBuildOperationExecutor.java:107) [gradle-core-4.1.jar:4.1]
22-Aug-2017 08:39:51         at org.gradle.api.internal.tasks.execution.ExecuteActionsTaskExecuter.executeAction(ExecuteActionsTaskExecuter.java:111) [gradle-core-4.1.jar:4.1]
22-Aug-2017 08:39:51         at org.gradle.api.internal.tasks.execution.ExecuteActionsTaskExecuter.executeActions(ExecuteActionsTaskExecuter.java:92) [gradle-core-4.1.jar:4.1]
22-Aug-2017 08:39:51         at org.gradle.api.internal.tasks.execution.ExecuteActionsTaskExecuter.execute(ExecuteActionsTaskExecuter.java:70) [gradle-core-4.1.jar:4.1]
22-Aug-2017 08:39:51         at org.gradle.api.internal.tasks.execution.SkipUpToDateTaskExecuter.execute(SkipUpToDateTaskExecuter.java:63) [gradle-core-4.1.jar:4.1]
22-Aug-2017 08:39:51         at org.gradle.api.internal.tasks.execution.ResolveTaskOutputCachingStateExecuter.execute(ResolveTaskOutputCachingStateExecuter.java:54) [gradle-core-4.1.jar:4.1]
22-Aug-2017 08:39:51         at org.gradle.api.internal.tasks.execution.ValidatingTaskExecuter.execute(ValidatingTaskExecuter.java:58) [gradle-core-4.1.jar:4.1]
22-Aug-2017 08:39:51         at org.gradle.api.internal.tasks.execution.SkipEmptySourceFilesTaskExecuter.execute(SkipEmptySourceFilesTaskExecuter.java:88) [gradle-core-4.1.jar:4.1]
22-Aug-2017 08:39:51         at org.gradle.api.internal.tasks.execution.ResolveTaskArtifactStateTaskExecuter.execute(ResolveTaskArtifactStateTaskExecuter.java:52) [gradle-core-4.1.jar:4.1]
22-Aug-2017 08:39:51         at org.gradle.api.internal.tasks.execution.SkipTaskWithNoActionsExecuter.execute(SkipTaskWithNoActionsExecuter.java:52) [gradle-core-4.1.jar:4.1]
22-Aug-2017 08:39:51         at org.gradle.api.internal.tasks.execution.SkipOnlyIfTaskExecuter.execute(SkipOnlyIfTaskExecuter.java:54) [gradle-core-4.1.jar:4.1]
22-Aug-2017 08:39:51         at org.gradle.api.internal.tasks.execution.ExecuteAtMostOnceTaskExecuter.execute(ExecuteAtMostOnceTaskExecuter.java:43) [gradle-core-4.1.jar:4.1]
22-Aug-2017 08:39:51         at org.gradle.api.internal.tasks.execution.CatchExceptionTaskExecuter.execute(CatchExceptionTaskExecuter.java:34) [gradle-core-4.1.jar:4.1]
22-Aug-2017 08:39:51         at org.gradle.execution.taskgraph.DefaultTaskGraphExecuter$EventFiringTaskWorker$1.run(DefaultTaskGraphExecuter.java:248) [gradle-core-4.1.jar:4.1]
22-Aug-2017 08:39:51         at org.gradle.internal.progress.DefaultBuildOperationExecutor$RunnableBuildOperationWorker.execute(DefaultBuildOperationExecutor.java:336) [gradle-core-4.1.jar:4.1]
22-Aug-2017 08:39:51         at org.gradle.internal.progress.DefaultBuildOperationExecutor$RunnableBuildOperationWorker.execute(DefaultBuildOperationExecutor.java:328) [gradle-core-4.1.jar:4.1]
22-Aug-2017 08:39:51         at org.gradle.internal.progress.DefaultBuildOperationExecutor.execute(DefaultBuildOperationExecutor.java:197) [gradle-core-4.1.jar:4.1]
22-Aug-2017 08:39:51         at org.gradle.internal.progress.DefaultBuildOperationExecutor.run(DefaultBuildOperationExecutor.java:107) [gradle-core-4.1.jar:4.1]
22-Aug-2017 08:39:51         at org.gradle.execution.taskgraph.DefaultTaskGraphExecuter$EventFiringTaskWorker.execute(DefaultTaskGraphExecuter.java:241) [gradle-core-4.1.jar:4.1]
22-Aug-2017 08:39:51         at org.gradle.execution.taskgraph.DefaultTaskGraphExecuter$EventFiringTaskWorker.execute(DefaultTaskGraphExecuter.java:230) [gradle-core-4.1.jar:4.1]
22-Aug-2017 08:39:51         at org.gradle.execution.taskgraph.DefaultTaskPlanExecutor$TaskExecutorWorker.processTask(DefaultTaskPlanExecutor.java:124) [gradle-core-4.1.jar:4.1]
22-Aug-2017 08:39:51         at org.gradle.execution.taskgraph.DefaultTaskPlanExecutor$TaskExecutorWorker.access$200(DefaultTaskPlanExecutor.java:80) [gradle-core-4.1.jar:4.1]
22-Aug-2017 08:39:51         at org.gradle.execution.taskgraph.DefaultTaskPlanExecutor$TaskExecutorWorker$1.execute(DefaultTaskPlanExecutor.java:105) [gradle-core-4.1.jar:4.1]
22-Aug-2017 08:39:51         at org.gradle.execution.taskgraph.DefaultTaskPlanExecutor$TaskExecutorWorker$1.execute(DefaultTaskPlanExecutor.java:99) [gradle-core-4.1.jar:4.1]
22-Aug-2017 08:39:51         at org.gradle.execution.taskgraph.DefaultTaskExecutionPlan.execute(DefaultTaskExecutionPlan.java:625) [gradle-core-4.1.jar:4.1]
22-Aug-2017 08:39:51         at org.gradle.execution.taskgraph.DefaultTaskExecutionPlan.executeWithTask(DefaultTaskExecutionPlan.java:580) [gradle-core-4.1.jar:4.1]
22-Aug-2017 08:39:51         at org.gradle.execution.taskgraph.DefaultTaskPlanExecutor$TaskExecutorWorker.run(DefaultTaskPlanExecutor.java:99) [gradle-core-4.1.jar:4.1]
22-Aug-2017 08:39:51         at org.gradle.internal.concurrent.ExecutorPolicy$CatchAndRecordFailures.onExecute(ExecutorPolicy.java:63) [gradle-base-services-4.1.jar:4.1]
22-Aug-2017 08:39:51         at org.gradle.internal.concurrent.ManagedExecutorImpl$1.run(ManagedExecutorImpl.java:46) [gradle-base-services-4.1.jar:4.1]
22-Aug-2017 08:39:51         at java.util.concurrent.ThreadPoolExecutor.runWorker(ThreadPoolExecutor.java:1142) [na:1.8.0_121]
22-Aug-2017 08:39:51         at java.util.concurrent.ThreadPoolExecutor$Worker.run(ThreadPoolExecutor.java:617) [na:1.8.0_121]
22-Aug-2017 08:39:51         at org.gradle.internal.concurrent.ThreadFactoryImpl$ManagedThreadRunnable.run(ThreadFactoryImpl.java:55) [gradle-base-services-4.1.jar:4.1]
22-Aug-2017 08:39:51         at java.lang.Thread.run(Thread.java:745) [na:1.8.0_121]
22-Aug-2017 08:39:51 Caused by: java.lang.IllegalStateException: Unable to open /opt/bamboo-home/xml-data/build-dir/SPR-SONAR-JOB1/spring-orm/build/resources/test/order.jar
22-Aug-2017 08:39:51         at org.sonar.java.bytecode.loader.JarLoader.<init>(JarLoader.java:51) ~[java-frontend-4.5.0.8398.jar:na]
22-Aug-2017 08:39:51         at org.sonar.java.bytecode.loader.SquidClassLoader.<init>(SquidClassLoader.java:51) ~[java-frontend-4.5.0.8398.jar:na]
22-Aug-2017 08:39:51         at org.sonar.java.bytecode.ClassLoaderBuilder.create(ClassLoaderBuilder.java:59) ~[java-frontend-4.5.0.8398.jar:na]
22-Aug-2017 08:39:51         ... 87 common frames omitted
22-Aug-2017 08:39:51 Caused by: java.util.zip.ZipException: zip file is empty
22-Aug-2017 08:39:51         at java.util.zip.ZipFile.open(Native Method) ~[na:1.8.0_121]
22-Aug-2017 08:39:51         at java.util.zip.ZipFile.<init>(ZipFile.java:219) ~[na:1.8.0_121]
22-Aug-2017 08:39:51         at java.util.zip.ZipFile.<init>(ZipFile.java:149) ~[na:1.8.0_121]
22-Aug-2017 08:39:51         at java.util.jar.JarFile.<init>(JarFile.java:166) ~[na:1.8.0_121]
22-Aug-2017 08:39:51         at java.util.jar.JarFile.<init>(JarFile.java:130) ~[na:1.8.0_121]
22-Aug-2017 08:39:51         at org.sonar.java.bytecode.loader.JarLoader.<init>(JarLoader.java:48) ~[java-frontend-4.5.0.8398.jar:na]
22-Aug-2017 08:39:51         ... 89 common frames omitted
22-Aug-2017 08:39:51
22-Aug-2017 08:39:51 Unable to create symbol table for : /opt/bamboo-home/xml-data/build-dir/SPR-SONAR-JOB1/spring-aspects/src/test/java/org/springframework/transaction/aspectj/TransactionAspectTests.java
22-Aug-2017 08:39:51 java.lang.IllegalStateException: Can not create ClassLoader
22-Aug-2017 08:39:51         at org.sonar.java.bytecode.ClassLoaderBuilder.create(ClassLoaderBuilder.java:61) ~[java-frontend-4.5.0.8398.jar:na]
22-Aug-2017 08:39:51         at org.sonar.java.resolve.BytecodeCompleter.getClassLoader(BytecodeCompleter.java:118) ~[java-frontend-4.5.0.8398.jar:na]
22-Aug-2017 08:39:51         at org.sonar.java.resolve.BytecodeCompleter.inputStreamFor(BytecodeCompleter.java:113) ~[java-frontend-4.5.0.8398.jar:na]
22-Aug-2017 08:39:51         at org.sonar.java.resolve.BytecodeCompleter.loadClass(BytecodeCompleter.java:212) ~[java-frontend-4.5.0.8398.jar:na]
22-Aug-2017 08:39:51         at org.sonar.java.resolve.Symbols.<init>(Symbols.java:176) ~[java-frontend-4.5.0.8398.jar:na]
22-Aug-2017 08:39:51         at org.sonar.java.resolve.SemanticModel.createFor(SemanticModel.java:55) ~[java-frontend-4.5.0.8398.jar:na]
22-Aug-2017 08:39:51         at org.sonar.java.model.VisitorsBridge.visitFile(VisitorsBridge.java:105) ~[java-frontend-4.5.0.8398.jar:na]
22-Aug-2017 08:39:51         at org.sonar.java.ast.JavaAstScanner.simpleScan(JavaAstScanner.java:84) [java-frontend-4.5.0.8398.jar:na]
22-Aug-2017 08:39:51         at org.sonar.java.ast.JavaAstScanner.scan(JavaAstScanner.java:67) [java-frontend-4.5.0.8398.jar:na]
22-Aug-2017 08:39:51         at org.sonar.java.JavaSquid.scanTests(JavaSquid.java:120) [java-frontend-4.5.0.8398.jar:na]
22-Aug-2017 08:39:51         at org.sonar.java.JavaSquid.scan(JavaSquid.java:109) [java-frontend-4.5.0.8398.jar:na]
22-Aug-2017 08:39:51         at org.sonar.plugins.java.JavaSquidSensor.execute(JavaSquidSensor.java:87) [sonar-java-plugin-4.5.0.8398.jar:na]
22-Aug-2017 08:39:51         at org.sonar.batch.sensor.SensorWrapper.analyse(SensorWrapper.java:57) [sonar-scanner-engine-shaded-5.6.3.jar:na]
22-Aug-2017 08:39:51         at org.sonar.batch.phases.SensorsExecutor.executeSensor(SensorsExecutor.java:58) [sonar-scanner-engine-shaded-5.6.3.jar:na]
22-Aug-2017 08:39:51         at org.sonar.batch.phases.SensorsExecutor.execute(SensorsExecutor.java:50) [sonar-scanner-engine-shaded-5.6.3.jar:na]
22-Aug-2017 08:39:51         at org.sonar.batch.phases.AbstractPhaseExecutor.execute(AbstractPhaseExecutor.java:83) [sonar-scanner-engine-shaded-5.6.3.jar:na]
22-Aug-2017 08:39:51         at org.sonar.batch.scan.ModuleScanContainer.doAfterStart(ModuleScanContainer.java:192) [sonar-scanner-engine-shaded-5.6.3.jar:na]
22-Aug-2017 08:39:51         at org.sonar.core.platform.ComponentContainer.startComponents(ComponentContainer.java:142) [sonar-scanner-engine-shaded-5.6.3.jar:na]
22-Aug-2017 08:39:51         at org.sonar.core.platform.ComponentContainer.execute(ComponentContainer.java:127) [sonar-scanner-engine-shaded-5.6.3.jar:na]
22-Aug-2017 08:39:51         at org.sonar.batch.scan.ProjectScanContainer.scan(ProjectScanContainer.java:241) [sonar-scanner-engine-shaded-5.6.3.jar:na]
22-Aug-2017 08:39:51         at org.sonar.batch.scan.ProjectScanContainer.scanRecursively(ProjectScanContainer.java:236) [sonar-scanner-engine-shaded-5.6.3.jar:na]
22-Aug-2017 08:39:51         at org.sonar.batch.scan.ProjectScanContainer.scanRecursively(ProjectScanContainer.java:234) [sonar-scanner-engine-shaded-5.6.3.jar:na]
22-Aug-2017 08:39:51         at org.sonar.batch.scan.ProjectScanContainer.doAfterStart(ProjectScanContainer.java:226) [sonar-scanner-engine-shaded-5.6.3.jar:na]
22-Aug-2017 08:39:51         at org.sonar.core.platform.ComponentContainer.startComponents(ComponentContainer.java:142) [sonar-scanner-engine-shaded-5.6.3.jar:na]
22-Aug-2017 08:39:51         at org.sonar.core.platform.ComponentContainer.execute(ComponentContainer.java:127) [sonar-scanner-engine-shaded-5.6.3.jar:na]
22-Aug-2017 08:39:51         at org.sonar.batch.task.ScanTask.execute(ScanTask.java:47) [sonar-scanner-engine-shaded-5.6.3.jar:na]
22-Aug-2017 08:39:51         at org.sonar.batch.task.TaskContainer.doAfterStart(TaskContainer.java:86) [sonar-scanner-engine-shaded-5.6.3.jar:na]
22-Aug-2017 08:39:51         at org.sonar.core.platform.ComponentContainer.startComponents(ComponentContainer.java:142) [sonar-scanner-engine-shaded-5.6.3.jar:na]
22-Aug-2017 08:39:51         at org.sonar.core.platform.ComponentContainer.execute(ComponentContainer.java:127) [sonar-scanner-engine-shaded-5.6.3.jar:na]
22-Aug-2017 08:39:51         at org.sonar.batch.bootstrap.GlobalContainer.executeTask(GlobalContainer.java:106) [sonar-scanner-engine-shaded-5.6.3.jar:na]
22-Aug-2017 08:39:51         at org.sonar.batch.bootstrapper.Batch.executeTask(Batch.java:119) [sonar-scanner-engine-shaded-5.6.3.jar:na]
22-Aug-2017 08:39:51         at org.sonarsource.scanner.api.internal.batch.BatchIsolatedLauncher.execute(BatchIsolatedLauncher.java:63) [sonar-scanner-api-batch9118975001708217432.jar:na]
22-Aug-2017 08:39:51         at sun.reflect.NativeMethodAccessorImpl.invoke0(Native Method) ~[na:1.8.0_121]
22-Aug-2017 08:39:51         at sun.reflect.NativeMethodAccessorImpl.invoke(NativeMethodAccessorImpl.java:62) ~[na:1.8.0_121]
22-Aug-2017 08:39:51         at sun.reflect.DelegatingMethodAccessorImpl.invoke(DelegatingMethodAccessorImpl.java:43) ~[na:1.8.0_121]
22-Aug-2017 08:39:51         at java.lang.reflect.Method.invoke(Method.java:498) ~[na:1.8.0_121]
22-Aug-2017 08:39:51         at org.sonarsource.scanner.api.internal.IsolatedLauncherProxy.invoke(IsolatedLauncherProxy.java:60) [sonar-scanner-api-2.9.0.887.jar:na]
22-Aug-2017 08:39:51         at com.sun.proxy.$Proxy99.execute(Unknown Source) [na:na]
22-Aug-2017 08:39:51         at org.sonarsource.scanner.api.EmbeddedScanner.doExecute(EmbeddedScanner.java:233) [sonar-scanner-api-2.9.0.887.jar:na]
22-Aug-2017 08:39:51         at org.sonarsource.scanner.api.EmbeddedScanner.runAnalysis(EmbeddedScanner.java:151) [sonar-scanner-api-2.9.0.887.jar:na]
22-Aug-2017 08:39:51         at org.sonarqube.gradle.SonarQubeTask.run(SonarQubeTask.java:99) [sonarqube-gradle-plugin-2.5.jar:na]
22-Aug-2017 08:39:51         at sun.reflect.NativeMethodAccessorImpl.invoke0(Native Method) ~[na:1.8.0_121]
22-Aug-2017 08:39:51         at sun.reflect.NativeMethodAccessorImpl.invoke(NativeMethodAccessorImpl.java:62) ~[na:1.8.0_121]
22-Aug-2017 08:39:51         at sun.reflect.DelegatingMethodAccessorImpl.invoke(DelegatingMethodAccessorImpl.java:43) ~[na:1.8.0_121]
22-Aug-2017 08:39:51         at java.lang.reflect.Method.invoke(Method.java:498) ~[na:1.8.0_121]
22-Aug-2017 08:39:51         at org.gradle.internal.reflect.JavaMethod.invoke(JavaMethod.java:73) [gradle-base-services-4.1.jar:4.1]
22-Aug-2017 08:39:51         at org.gradle.api.internal.project.taskfactory.DefaultTaskClassInfoStore$StandardTaskAction.doExecute(DefaultTaskClassInfoStore.java:141) [gradle-core-4.1.jar:4.1]
22-Aug-2017 08:39:51         at org.gradle.api.internal.project.taskfactory.DefaultTaskClassInfoStore$StandardTaskAction.execute(DefaultTaskClassInfoStore.java:134) [gradle-core-4.1.jar:4.1]
22-Aug-2017 08:39:51         at org.gradle.api.internal.project.taskfactory.DefaultTaskClassInfoStore$StandardTaskAction.execute(DefaultTaskClassInfoStore.java:121) [gradle-core-4.1.jar:4.1]
22-Aug-2017 08:39:51         at org.gradle.api.internal.AbstractTask$TaskActionWrapper.execute(AbstractTask.java:731) [gradle-core-4.1.jar:4.1]
22-Aug-2017 08:39:51         at org.gradle.api.internal.AbstractTask$TaskActionWrapper.execute(AbstractTask.java:705) [gradle-core-4.1.jar:4.1]
22-Aug-2017 08:39:51         at org.gradle.api.internal.tasks.execution.ExecuteActionsTaskExecuter$1.run(ExecuteActionsTaskExecuter.java:122) [gradle-core-4.1.jar:4.1]
22-Aug-2017 08:39:51         at org.gradle.internal.progress.DefaultBuildOperationExecutor$RunnableBuildOperationWorker.execute(DefaultBuildOperationExecutor.java:336) [gradle-core-4.1.jar:4.1]
22-Aug-2017 08:39:51         at org.gradle.internal.progress.DefaultBuildOperationExecutor$RunnableBuildOperationWorker.execute(DefaultBuildOperationExecutor.java:328) [gradle-core-4.1.jar:4.1]
22-Aug-2017 08:39:51         at org.gradle.internal.progress.DefaultBuildOperationExecutor.execute(DefaultBuildOperationExecutor.java:197) [gradle-core-4.1.jar:4.1]
22-Aug-2017 08:39:51         at org.gradle.internal.progress.DefaultBuildOperationExecutor.run(DefaultBuildOperationExecutor.java:107) [gradle-core-4.1.jar:4.1]
22-Aug-2017 08:39:51         at org.gradle.api.internal.tasks.execution.ExecuteActionsTaskExecuter.executeAction(ExecuteActionsTaskExecuter.java:111) [gradle-core-4.1.jar:4.1]
22-Aug-2017 08:39:51         at org.gradle.api.internal.tasks.execution.ExecuteActionsTaskExecuter.executeActions(ExecuteActionsTaskExecuter.java:92) [gradle-core-4.1.jar:4.1]
22-Aug-2017 08:39:51         at org.gradle.api.internal.tasks.execution.ExecuteActionsTaskExecuter.execute(ExecuteActionsTaskExecuter.java:70) [gradle-core-4.1.jar:4.1]
22-Aug-2017 08:39:51         at org.gradle.api.internal.tasks.execution.SkipUpToDateTaskExecuter.execute(SkipUpToDateTaskExecuter.java:63) [gradle-core-4.1.jar:4.1]
22-Aug-2017 08:39:51         at org.gradle.api.internal.tasks.execution.ResolveTaskOutputCachingStateExecuter.execute(ResolveTaskOutputCachingStateExecuter.java:54) [gradle-core-4.1.jar:4.1]
22-Aug-2017 08:39:51         at org.gradle.api.internal.tasks.execution.ValidatingTaskExecuter.execute(ValidatingTaskExecuter.java:58) [gradle-core-4.1.jar:4.1]
22-Aug-2017 08:39:51         at org.gradle.api.internal.tasks.execution.SkipEmptySourceFilesTaskExecuter.execute(SkipEmptySourceFilesTaskExecuter.java:88) [gradle-core-4.1.jar:4.1]
22-Aug-2017 08:39:51         at org.gradle.api.internal.tasks.execution.ResolveTaskArtifactStateTaskExecuter.execute(ResolveTaskArtifactStateTaskExecuter.java:52) [gradle-core-4.1.jar:4.1]
22-Aug-2017 08:39:51         at org.gradle.api.internal.tasks.execution.SkipTaskWithNoActionsExecuter.execute(SkipTaskWithNoActionsExecuter.java:52) [gradle-core-4.1.jar:4.1]
22-Aug-2017 08:39:51         at org.gradle.api.internal.tasks.execution.SkipOnlyIfTaskExecuter.execute(SkipOnlyIfTaskExecuter.java:54) [gradle-core-4.1.jar:4.1]
22-Aug-2017 08:39:51         at org.gradle.api.internal.tasks.execution.ExecuteAtMostOnceTaskExecuter.execute(ExecuteAtMostOnceTaskExecuter.java:43) [gradle-core-4.1.jar:4.1]
22-Aug-2017 08:39:51         at org.gradle.api.internal.tasks.execution.CatchExceptionTaskExecuter.execute(CatchExceptionTaskExecuter.java:34) [gradle-core-4.1.jar:4.1]
22-Aug-2017 08:39:51         at org.gradle.execution.taskgraph.DefaultTaskGraphExecuter$EventFiringTaskWorker$1.run(DefaultTaskGraphExecuter.java:248) [gradle-core-4.1.jar:4.1]
22-Aug-2017 08:39:51         at org.gradle.internal.progress.DefaultBuildOperationExecutor$RunnableBuildOperationWorker.execute(DefaultBuildOperationExecutor.java:336) [gradle-core-4.1.jar:4.1]
22-Aug-2017 08:39:51         at org.gradle.internal.progress.DefaultBuildOperationExecutor$RunnableBuildOperationWorker.execute(DefaultBuildOperationExecutor.java:328) [gradle-core-4.1.jar:4.1]
22-Aug-2017 08:39:51         at org.gradle.internal.progress.DefaultBuildOperationExecutor.execute(DefaultBuildOperationExecutor.java:197) [gradle-core-4.1.jar:4.1]
22-Aug-2017 08:39:51         at org.gradle.internal.progress.DefaultBuildOperationExecutor.run(DefaultBuildOperationExecutor.java:107) [gradle-core-4.1.jar:4.1]
22-Aug-2017 08:39:51         at org.gradle.execution.taskgraph.DefaultTaskGraphExecuter$EventFiringTaskWorker.execute(DefaultTaskGraphExecuter.java:241) [gradle-core-4.1.jar:4.1]
22-Aug-2017 08:39:51         at org.gradle.execution.taskgraph.DefaultTaskGraphExecuter$EventFiringTaskWorker.execute(DefaultTaskGraphExecuter.java:230) [gradle-core-4.1.jar:4.1]
22-Aug-2017 08:39:51 Java Test Files AST scan (done) | time=207ms
22-Aug-2017 08:39:51         at org.gradle.execution.taskgraph.DefaultTaskPlanExecutor$TaskExecutorWorker.processTask(DefaultTaskPlanExecutor.java:124) [gradle-core-4.1.jar:4.1]
22-Aug-2017 08:39:51 Sensor JavaSquidSensor (done) | time=410ms
22-Aug-2017 08:39:51         at org.gradle.execution.taskgraph.DefaultTaskPlanExecutor$TaskExecutorWorker.access$200(DefaultTaskPlanExecutor.java:80) [gradle-core-4.1.jar:4.1]
22-Aug-2017 08:39:51 Sensor CoberturaSensor
22-Aug-2017 08:39:51         at org.gradle.execution.taskgraph.DefaultTaskPlanExecutor$TaskExecutorWorker$1.execute(DefaultTaskPlanExecutor.java:105) [gradle-core-4.1.jar:4.1]
22-Aug-2017 08:39:51 Cobertura report not found at /opt/bamboo-home/xml-data/build-dir/SPR-SONAR-JOB1/spring-aspects/target/site/cobertura/coverage.xml
22-Aug-2017 08:39:51         at org.gradle.execution.taskgraph.DefaultTaskPlanExecutor$TaskExecutorWorker$1.execute(DefaultTaskPlanExecutor.java:99) [gradle-core-4.1.jar:4.1]
22-Aug-2017 08:39:51 Sensor CoberturaSensor (done) | time=1ms
22-Aug-2017 08:39:51         at org.gradle.execution.taskgraph.DefaultTaskExecutionPlan.execute(DefaultTaskExecutionPlan.java:625) [gradle-core-4.1.jar:4.1]
22-Aug-2017 08:39:51 Sensor Sonar-Sonargraph-Plugin [3.5]
22-Aug-2017 08:39:51         at org.gradle.execution.taskgraph.DefaultTaskExecutionPlan.executeWithTask(DefaultTaskExecutionPlan.java:580) [gradle-core-4.1.jar:4.1]
22-Aug-2017 08:39:51 ----------------------------------------------------------------
22-Aug-2017 08:39:51         at org.gradle.execution.taskgraph.DefaultTaskPlanExecutor$TaskExecutorWorker.run(DefaultTaskPlanExecutor.java:99) [gradle-core-4.1.jar:4.1]
22-Aug-2017 08:39:51 Sonargraph: Skipping project spring-aspects master [org.springframework:spring:spring-aspects:master], since no Sonargraph report is found.
22-Aug-2017 08:39:51         at org.gradle.internal.concurrent.ExecutorPolicy$CatchAndRecordFailures.onExecute(ExecutorPolicy.java:63) [gradle-base-services-4.1.jar:4.1]
22-Aug-2017 08:39:51 ----------------------------------------------------------------
22-Aug-2017 08:39:51         at org.gradle.internal.concurrent.ManagedExecutorImpl$1.run(ManagedExecutorImpl.java:46) [gradle-base-services-4.1.jar:4.1]
22-Aug-2017 08:39:51 Sensor Sonar-Sonargraph-Plugin [3.5] (done) | time=0ms
22-Aug-2017 08:39:51         at java.util.concurrent.ThreadPoolExecutor.runWorker(ThreadPoolExecutor.java:1142) [na:1.8.0_121]
22-Aug-2017 08:39:51 Sensor SCM Sensor
22-Aug-2017 08:39:51         at java.util.concurrent.ThreadPoolExecutor$Worker.run(ThreadPoolExecutor.java:617) [na:1.8.0_121]
22-Aug-2017 08:39:51 27/27 source files have been analyzed
22-Aug-2017 08:39:51         at org.gradle.internal.concurrent.ThreadFactoryImpl$ManagedThreadRunnable.run(ThreadFactoryImpl.java:55) [gradle-base-services-4.1.jar:4.1]
22-Aug-2017 08:39:51         at java.lang.Thread.run(Thread.java:745) [na:1.8.0_121]
22-Aug-2017 08:39:51 Caused by: java.lang.IllegalStateException: Unable to open /opt/bamboo-home/xml-data/build-dir/SPR-SONAR-JOB1/spring-orm/build/resources/test/order.jar
22-Aug-2017 08:39:51         at org.sonar.java.bytecode.loader.JarLoader.<init>(JarLoader.java:51) ~[java-frontend-4.5.0.8398.jar:na]
22-Aug-2017 08:39:51         at org.sonar.java.bytecode.loader.SquidClassLoader.<init>(SquidClassLoader.java:51) ~[java-frontend-4.5.0.8398.jar:na]
22-Aug-2017 08:39:51         at org.sonar.java.bytecode.ClassLoaderBuilder.create(ClassLoaderBuilder.java:59) ~[java-frontend-4.5.0.8398.jar:na]
22-Aug-2017 08:39:51         ... 87 common frames omitted
22-Aug-2017 08:39:51 Caused by: java.util.zip.ZipException: zip file is empty
22-Aug-2017 08:39:51         at java.util.zip.ZipFile.open(Native Method) ~[na:1.8.0_121]
22-Aug-2017 08:39:51         at java.util.zip.ZipFile.<init>(ZipFile.java:219) ~[na:1.8.0_121]
22-Aug-2017 08:39:51         at java.util.zip.ZipFile.<init>(ZipFile.java:149) ~[na:1.8.0_121]
22-Aug-2017 08:39:51         at java.util.jar.JarFile.<init>(JarFile.java:166) ~[na:1.8.0_121]
22-Aug-2017 08:39:51         at java.util.jar.JarFile.<init>(JarFile.java:130) ~[na:1.8.0_121]
22-Aug-2017 08:39:51         at org.sonar.java.bytecode.loader.JarLoader.<init>(JarLoader.java:48) ~[java-frontend-4.5.0.8398.jar:na]
22-Aug-2017 08:39:51         ... 89 common frames omitted
22-Aug-2017 08:39:51
22-Aug-2017 08:39:51 Unable to create symbol table for : /opt/bamboo-home/xml-data/build-dir/SPR-SONAR-JOB1/spring-aspects/src/test/java/org/springframework/transaction/aspectj/TransactionalAnnotationOnlyOnClassWithNoInterface.java
22-Aug-2017 08:39:51 java.lang.IllegalStateException: Can not create ClassLoader
22-Aug-2017 08:39:51         at org.sonar.java.bytecode.ClassLoaderBuilder.create(ClassLoaderBuilder.java:61) ~[java-frontend-4.5.0.8398.jar:na]
22-Aug-2017 08:39:51         at org.sonar.java.resolve.BytecodeCompleter.getClassLoader(BytecodeCompleter.java:118) ~[java-frontend-4.5.0.8398.jar:na]
22-Aug-2017 08:39:51         at org.sonar.java.resolve.BytecodeCompleter.inputStreamFor(BytecodeCompleter.java:113) ~[java-frontend-4.5.0.8398.jar:na]
22-Aug-2017 08:39:51         at org.sonar.java.resolve.BytecodeCompleter.loadClass(BytecodeCompleter.java:212) ~[java-frontend-4.5.0.8398.jar:na]
22-Aug-2017 08:39:51         at org.sonar.java.resolve.Symbols.<init>(Symbols.java:176) ~[java-frontend-4.5.0.8398.jar:na]
22-Aug-2017 08:39:51         at org.sonar.java.resolve.SemanticModel.createFor(SemanticModel.java:55) ~[java-frontend-4.5.0.8398.jar:na]
22-Aug-2017 08:39:51         at org.sonar.java.model.VisitorsBridge.visitFile(VisitorsBridge.java:105) ~[java-frontend-4.5.0.8398.jar:na]
22-Aug-2017 08:39:51         at org.sonar.java.ast.JavaAstScanner.simpleScan(JavaAstScanner.java:84) [java-frontend-4.5.0.8398.jar:na]
22-Aug-2017 08:39:51         at org.sonar.java.ast.JavaAstScanner.scan(JavaAstScanner.java:67) [java-frontend-4.5.0.8398.jar:na]
22-Aug-2017 08:39:51         at org.sonar.java.JavaSquid.scanTests(JavaSquid.java:120) [java-frontend-4.5.0.8398.jar:na]
22-Aug-2017 08:39:51         at org.sonar.java.JavaSquid.scan(JavaSquid.java:109) [java-frontend-4.5.0.8398.jar:na]
22-Aug-2017 08:39:51         at org.sonar.plugins.java.JavaSquidSensor.execute(JavaSquidSensor.java:87) [sonar-java-plugin-4.5.0.8398.jar:na]
22-Aug-2017 08:39:51         at org.sonar.batch.sensor.SensorWrapper.analyse(SensorWrapper.java:57) [sonar-scanner-engine-shaded-5.6.3.jar:na]
22-Aug-2017 08:39:51         at org.sonar.batch.phases.SensorsExecutor.executeSensor(SensorsExecutor.java:58) [sonar-scanner-engine-shaded-5.6.3.jar:na]
22-Aug-2017 08:39:51         at org.sonar.batch.phases.SensorsExecutor.execute(SensorsExecutor.java:50) [sonar-scanner-engine-shaded-5.6.3.jar:na]
22-Aug-2017 08:39:51         at org.sonar.batch.phases.AbstractPhaseExecutor.execute(AbstractPhaseExecutor.java:83) [sonar-scanner-engine-shaded-5.6.3.jar:na]
22-Aug-2017 08:39:51         at org.sonar.batch.scan.ModuleScanContainer.doAfterStart(ModuleScanContainer.java:192) [sonar-scanner-engine-shaded-5.6.3.jar:na]
22-Aug-2017 08:39:51         at org.sonar.core.platform.ComponentContainer.startComponents(ComponentContainer.java:142) [sonar-scanner-engine-shaded-5.6.3.jar:na]
22-Aug-2017 08:39:51         at org.sonar.core.platform.ComponentContainer.execute(ComponentContainer.java:127) [sonar-scanner-engine-shaded-5.6.3.jar:na]
22-Aug-2017 08:39:51         at org.sonar.batch.scan.ProjectScanContainer.scan(ProjectScanContainer.java:241) [sonar-scanner-engine-shaded-5.6.3.jar:na]
22-Aug-2017 08:39:51         at org.sonar.batch.scan.ProjectScanContainer.scanRecursively(ProjectScanContainer.java:236) [sonar-scanner-engine-shaded-5.6.3.jar:na]
22-Aug-2017 08:39:51         at org.sonar.batch.scan.ProjectScanContainer.scanRecursively(ProjectScanContainer.java:234) [sonar-scanner-engine-shaded-5.6.3.jar:na]
22-Aug-2017 08:39:51         at org.sonar.batch.scan.ProjectScanContainer.doAfterStart(ProjectScanContainer.java:226) [sonar-scanner-engine-shaded-5.6.3.jar:na]
22-Aug-2017 08:39:51         at org.sonar.core.platform.ComponentContainer.startComponents(ComponentContainer.java:142) [sonar-scanner-engine-shaded-5.6.3.jar:na]
22-Aug-2017 08:39:51         at org.sonar.core.platform.ComponentContainer.execute(ComponentContainer.java:127) [sonar-scanner-engine-shaded-5.6.3.jar:na]
22-Aug-2017 08:39:51         at org.sonar.batch.task.ScanTask.execute(ScanTask.java:47) [sonar-scanner-engine-shaded-5.6.3.jar:na]
22-Aug-2017 08:39:51         at org.sonar.batch.task.TaskContainer.doAfterStart(TaskContainer.java:86) [sonar-scanner-engine-shaded-5.6.3.jar:na]
22-Aug-2017 08:39:51         at org.sonar.core.platform.ComponentContainer.startComponents(ComponentContainer.java:142) [sonar-scanner-engine-shaded-5.6.3.jar:na]
22-Aug-2017 08:39:51         at org.sonar.core.platform.ComponentContainer.execute(ComponentContainer.java:127) [sonar-scanner-engine-shaded-5.6.3.jar:na]
22-Aug-2017 08:39:51         at org.sonar.batch.bootstrap.GlobalContainer.executeTask(GlobalContainer.java:106) [sonar-scanner-engine-shaded-5.6.3.jar:na]
22-Aug-2017 08:39:51         at org.sonar.batch.bootstrapper.Batch.executeTask(Batch.java:119) [sonar-scanner-engine-shaded-5.6.3.jar:na]
22-Aug-2017 08:39:51         at org.sonarsource.scanner.api.internal.batch.BatchIsolatedLauncher.execute(BatchIsolatedLauncher.java:63) [sonar-scanner-api-batch9118975001708217432.jar:na]
22-Aug-2017 08:39:51         at sun.reflect.NativeMethodAccessorImpl.invoke0(Native Method) ~[na:1.8.0_121]
22-Aug-2017 08:39:51         at sun.reflect.NativeMethodAccessorImpl.invoke(NativeMethodAccessorImpl.java:62) ~[na:1.8.0_121]
22-Aug-2017 08:39:51         at sun.reflect.DelegatingMethodAccessorImpl.invoke(DelegatingMethodAccessorImpl.java:43) ~[na:1.8.0_121]
22-Aug-2017 08:39:51         at java.lang.reflect.Method.invoke(Method.java:498) ~[na:1.8.0_121]
22-Aug-2017 08:39:51         at org.sonarsource.scanner.api.internal.IsolatedLauncherProxy.invoke(IsolatedLauncherProxy.java:60) [sonar-scanner-api-2.9.0.887.jar:na]
22-Aug-2017 08:39:51         at com.sun.proxy.$Proxy99.execute(Unknown Source) [na:na]
22-Aug-2017 08:39:51         at org.sonarsource.scanner.api.EmbeddedScanner.doExecute(EmbeddedScanner.java:233) [sonar-scanner-api-2.9.0.887.jar:na]
22-Aug-2017 08:39:51         at org.sonarsource.scanner.api.EmbeddedScanner.runAnalysis(EmbeddedScanner.java:151) [sonar-scanner-api-2.9.0.887.jar:na]
22-Aug-2017 08:39:51         at org.sonarqube.gradle.SonarQubeTask.run(SonarQubeTask.java:99) [sonarqube-gradle-plugin-2.5.jar:na]
22-Aug-2017 08:39:51         at sun.reflect.NativeMethodAccessorImpl.invoke0(Native Method) ~[na:1.8.0_121]
22-Aug-2017 08:39:51         at sun.reflect.NativeMethodAccessorImpl.invoke(NativeMethodAccessorImpl.java:62) ~[na:1.8.0_121]
22-Aug-2017 08:39:51         at sun.reflect.DelegatingMethodAccessorImpl.invoke(DelegatingMethodAccessorImpl.java:43) ~[na:1.8.0_121]
22-Aug-2017 08:39:51         at java.lang.reflect.Method.invoke(Method.java:498) ~[na:1.8.0_121]
22-Aug-2017 08:39:51         at org.gradle.internal.reflect.JavaMethod.invoke(JavaMethod.java:73) [gradle-base-services-4.1.jar:4.1]
22-Aug-2017 08:39:51         at org.gradle.api.internal.project.taskfactory.DefaultTaskClassInfoStore$StandardTaskAction.doExecute(DefaultTaskClassInfoStore.java:141) [gradle-core-4.1.jar:4.1]
22-Aug-2017 08:39:51         at org.gradle.api.internal.project.taskfactory.DefaultTaskClassInfoStore$StandardTaskAction.execute(DefaultTaskClassInfoStore.java:134) [gradle-core-4.1.jar:4.1]
22-Aug-2017 08:39:51         at org.gradle.api.internal.project.taskfactory.DefaultTaskClassInfoStore$StandardTaskAction.execute(DefaultTaskClassInfoStore.java:121) [gradle-core-4.1.jar:4.1]
22-Aug-2017 08:39:51         at org.gradle.api.internal.AbstractTask$TaskActionWrapper.execute(AbstractTask.java:731) [gradle-core-4.1.jar:4.1]
22-Aug-2017 08:39:51         at org.gradle.api.internal.AbstractTask$TaskActionWrapper.execute(AbstractTask.java:705) [gradle-core-4.1.jar:4.1]
22-Aug-2017 08:39:51         at org.gradle.api.internal.tasks.execution.ExecuteActionsTaskExecuter$1.run(ExecuteActionsTaskExecuter.java:122) [gradle-core-4.1.jar:4.1]
22-Aug-2017 08:39:51         at org.gradle.internal.progress.DefaultBuildOperationExecutor$RunnableBuildOperationWorker.execute(DefaultBuildOperationExecutor.java:336) [gradle-core-4.1.jar:4.1]
22-Aug-2017 08:39:51         at org.gradle.internal.progress.DefaultBuildOperationExecutor$RunnableBuildOperationWorker.execute(DefaultBuildOperationExecutor.java:328) [gradle-core-4.1.jar:4.1]
22-Aug-2017 08:39:51         at org.gradle.internal.progress.DefaultBuildOperationExecutor.execute(DefaultBuildOperationExecutor.java:197) [gradle-core-4.1.jar:4.1]
22-Aug-2017 08:39:51         at org.gradle.internal.progress.DefaultBuildOperationExecutor.run(DefaultBuildOperationExecutor.java:107) [gradle-core-4.1.jar:4.1]
22-Aug-2017 08:39:51         at org.gradle.api.internal.tasks.execution.ExecuteActionsTaskExecuter.executeAction(ExecuteActionsTaskExecuter.java:111) [gradle-core-4.1.jar:4.1]
22-Aug-2017 08:39:51         at org.gradle.api.internal.tasks.execution.ExecuteActionsTaskExecuter.executeActions(ExecuteActionsTaskExecuter.java:92) [gradle-core-4.1.jar:4.1]
22-Aug-2017 08:39:51         at org.gradle.api.internal.tasks.execution.ExecuteActionsTaskExecuter.execute(ExecuteActionsTaskExecuter.java:70) [gradle-core-4.1.jar:4.1]
22-Aug-2017 08:39:51         at org.gradle.api.internal.tasks.execution.SkipUpToDateTaskExecuter.execute(SkipUpToDateTaskExecuter.java:63) [gradle-core-4.1.jar:4.1]
22-Aug-2017 08:39:51         at org.gradle.api.internal.tasks.execution.ResolveTaskOutputCachingStateExecuter.execute(ResolveTaskOutputCachingStateExecuter.java:54) [gradle-core-4.1.jar:4.1]
22-Aug-2017 08:39:51         at org.gradle.api.internal.tasks.execution.ValidatingTaskExecuter.execute(ValidatingTaskExecuter.java:58) [gradle-core-4.1.jar:4.1]
22-Aug-2017 08:39:51         at org.gradle.api.internal.tasks.execution.SkipEmptySourceFilesTaskExecuter.execute(SkipEmptySourceFilesTaskExecuter.java:88) [gradle-core-4.1.jar:4.1]
22-Aug-2017 08:39:51         at org.gradle.api.internal.tasks.execution.ResolveTaskArtifactStateTaskExecuter.execute(ResolveTaskArtifactStateTaskExecuter.java:52) [gradle-core-4.1.jar:4.1]
22-Aug-2017 08:39:51         at org.gradle.api.internal.tasks.execution.SkipTaskWithNoActionsExecuter.execute(SkipTaskWithNoActionsExecuter.java:52) [gradle-core-4.1.jar:4.1]
22-Aug-2017 08:39:51         at org.gradle.api.internal.tasks.execution.SkipOnlyIfTaskExecuter.execute(SkipOnlyIfTaskExecuter.java:54) [gradle-core-4.1.jar:4.1]
22-Aug-2017 08:39:51         at org.gradle.api.internal.tasks.execution.ExecuteAtMostOnceTaskExecuter.execute(ExecuteAtMostOnceTaskExecuter.java:43) [gradle-core-4.1.jar:4.1]
22-Aug-2017 08:39:51         at org.gradle.api.internal.tasks.execution.CatchExceptionTaskExecuter.execute(CatchExceptionTaskExecuter.java:34) [gradle-core-4.1.jar:4.1]
22-Aug-2017 08:39:51         at org.gradle.execution.taskgraph.DefaultTaskGraphExecuter$EventFiringTaskWorker$1.run(DefaultTaskGraphExecuter.java:248) [gradle-core-4.1.jar:4.1]
22-Aug-2017 08:39:51         at org.gradle.internal.progress.DefaultBuildOperationExecutor$RunnableBuildOperationWorker.execute(DefaultBuildOperationExecutor.java:336) [gradle-core-4.1.jar:4.1]
22-Aug-2017 08:39:51         at org.gradle.internal.progress.DefaultBuildOperationExecutor$RunnableBuildOperationWorker.execute(DefaultBuildOperationExecutor.java:328) [gradle-core-4.1.jar:4.1]
22-Aug-2017 08:39:51         at org.gradle.internal.progress.DefaultBuildOperationExecutor.execute(DefaultBuildOperationExecutor.java:197) [gradle-core-4.1.jar:4.1]
22-Aug-2017 08:39:51         at org.gradle.internal.progress.DefaultBuildOperationExecutor.run(DefaultBuildOperationExecutor.java:107) [gradle-core-4.1.jar:4.1]
22-Aug-2017 08:39:51         at org.gradle.execution.taskgraph.DefaultTaskGraphExecuter$EventFiringTaskWorker.execute(DefaultTaskGraphExecuter.java:241) [gradle-core-4.1.jar:4.1]
22-Aug-2017 08:39:51         at org.gradle.execution.taskgraph.DefaultTaskGraphExecuter$EventFiringTaskWorker.execute(DefaultTaskGraphExecuter.java:230) [gradle-core-4.1.jar:4.1]
22-Aug-2017 08:39:51         at org.gradle.execution.taskgraph.DefaultTaskPlanExecutor$TaskExecutorWorker.processTask(DefaultTaskPlanExecutor.java:124) [gradle-core-4.1.jar:4.1]
22-Aug-2017 08:39:51         at org.gradle.execution.taskgraph.DefaultTaskPlanExecutor$TaskExecutorWorker.access$200(DefaultTaskPlanExecutor.java:80) [gradle-core-4.1.jar:4.1]
22-Aug-2017 08:39:51         at org.gradle.execution.taskgraph.DefaultTaskPlanExecutor$TaskExecutorWorker$1.execute(DefaultTaskPlanExecutor.java:105) [gradle-core-4.1.jar:4.1]
22-Aug-2017 08:39:51         at org.gradle.execution.taskgraph.DefaultTaskPlanExecutor$TaskExecutorWorker$1.execute(DefaultTaskPlanExecutor.java:99) [gradle-core-4.1.jar:4.1]
22-Aug-2017 08:39:51         at org.gradle.execution.taskgraph.DefaultTaskExecutionPlan.execute(DefaultTaskExecutionPlan.java:625) [gradle-core-4.1.jar:4.1]
22-Aug-2017 08:39:51         at org.gradle.execution.taskgraph.DefaultTaskExecutionPlan.executeWithTask(DefaultTaskExecutionPlan.java:580) [gradle-core-4.1.jar:4.1]
22-Aug-2017 08:39:51         at org.gradle.execution.taskgraph.DefaultTaskPlanExecutor$TaskExecutorWorker.run(DefaultTaskPlanExecutor.java:99) [gradle-core-4.1.jar:4.1]
22-Aug-2017 08:39:51         at org.gradle.internal.concurrent.ExecutorPolicy$CatchAndRecordFailures.onExecute(ExecutorPolicy.java:63) [gradle-base-services-4.1.jar:4.1]
22-Aug-2017 08:39:51         at org.gradle.internal.concurrent.ManagedExecutorImpl$1.run(ManagedExecutorImpl.java:46) [gradle-base-services-4.1.jar:4.1]
22-Aug-2017 08:39:51         at java.util.concurrent.ThreadPoolExecutor.runWorker(ThreadPoolExecutor.java:1142) [na:1.8.0_121]
22-Aug-2017 08:39:51         at java.util.concurrent.ThreadPoolExecutor$Worker.run(ThreadPoolExecutor.java:617) [na:1.8.0_121]
22-Aug-2017 08:39:51         at org.gradle.internal.concurrent.ThreadFactoryImpl$ManagedThreadRunnable.run(ThreadFactoryImpl.java:55) [gradle-base-services-4.1.jar:4.1]
22-Aug-2017 08:39:51         at java.lang.Thread.run(Thread.java:745) [na:1.8.0_121]
22-Aug-2017 08:39:51 Caused by: java.lang.IllegalStateException: Unable to open /opt/bamboo-home/xml-data/build-dir/SPR-SONAR-JOB1/spring-orm/build/resources/test/order.jar
22-Aug-2017 08:39:51         at org.sonar.java.bytecode.loader.JarLoader.<init>(JarLoader.java:51) ~[java-frontend-4.5.0.8398.jar:na]
22-Aug-2017 08:39:51         at org.sonar.java.bytecode.loader.SquidClassLoader.<init>(SquidClassLoader.java:51) ~[java-frontend-4.5.0.8398.jar:na]
22-Aug-2017 08:39:51         at org.sonar.java.bytecode.ClassLoaderBuilder.create(ClassLoaderBuilder.java:59) ~[java-frontend-4.5.0.8398.jar:na]
22-Aug-2017 08:39:51         ... 87 common frames omitted
22-Aug-2017 08:39:51 Caused by: java.util.zip.ZipException: zip file is empty
22-Aug-2017 08:39:51         at java.util.zip.ZipFile.open(Native Method) ~[na:1.8.0_121]
22-Aug-2017 08:39:51         at java.util.zip.ZipFile.<init>(ZipFile.java:219) ~[na:1.8.0_121]
22-Aug-2017 08:39:51         at java.util.zip.ZipFile.<init>(ZipFile.java:149) ~[na:1.8.0_121]
22-Aug-2017 08:39:51         at java.util.jar.JarFile.<init>(JarFile.java:166) ~[na:1.8.0_121]
22-Aug-2017 08:39:51         at java.util.jar.JarFile.<init>(JarFile.java:130) ~[na:1.8.0_121]
22-Aug-2017 08:39:51         at org.sonar.java.bytecode.loader.JarLoader.<init>(JarLoader.java:48) ~[java-frontend-4.5.0.8398.jar:na]
22-Aug-2017 08:39:51         ... 89 common frames omitted
22-Aug-2017 08:39:51
22-Aug-2017 08:39:51 SCM provider for this project is: git
22-Aug-2017 08:39:51 1 files to be analyzed
22-Aug-2017 08:39:52 1/1 files analyzed
22-Aug-2017 08:39:52 Sensor SCM Sensor (done) | time=684ms
22-Aug-2017 08:39:52 Sensor FindBugs Sensor
22-Aug-2017 08:39:52 Loading findbugs plugin: /opt/bamboo-home/xml-data/build-dir/SPR-SONAR-JOB1/build/sonar/org.springframework_spring_spring-aspects/findbugs/findsecbugs-plugin.jar
22-Aug-2017 08:39:52 Findbugs output report: /opt/bamboo-home/xml-data/build-dir/SPR-SONAR-JOB1/build/sonar/org.springframework_spring_spring-aspects/findbugs-result.xml
22-Aug-2017 08:39:53 Sensor FindBugs Sensor (done) | time=1310ms
22-Aug-2017 08:39:53 Sensor SurefireSensor
22-Aug-2017 08:39:53 parsing /opt/bamboo-home/xml-data/build-dir/SPR-SONAR-JOB1/spring-aspects/build/test-results
22-Aug-2017 08:39:53 Resource not found: org.springframework.cache.aspectj.AspectJEnableCachingTests
22-Aug-2017 08:39:53 Resource not found: org.springframework.cache.aspectj.JCacheAspectJJavaConfigTests
22-Aug-2017 08:39:53 Resource not found: org.springframework.aop.aspectj.autoproxy.AutoProxyWithCodeStyleAspectsTests
22-Aug-2017 08:39:53 Resource not found: org.springframework.scheduling.aspectj.AnnotationDrivenBeanDefinitionParserTests
22-Aug-2017 08:39:53 Resource not found: org.springframework.cache.aspectj.AspectJEnableCachingIsolatedTests
22-Aug-2017 08:39:53 Resource not found: org.springframework.scheduling.aspectj.AnnotationAsyncExecutionAspectTests
22-Aug-2017 08:39:53 Resource not found: org.springframework.cache.aspectj.JCacheAspectJNamespaceConfigTests
22-Aug-2017 08:39:53 Resource not found: org.springframework.beans.factory.aspectj.XmlBeanConfigurerTests
22-Aug-2017 08:39:53 Resource not found: org.springframework.transaction.aspectj.JtaTransactionAspectsTests
22-Aug-2017 08:39:53 Resource not found: org.springframework.beans.factory.aspectj.SpringConfiguredWithAutoProxyingTests
22-Aug-2017 08:39:53 Resource not found: org.springframework.context.annotation.aspectj.AnnotationBeanConfigurerTests
22-Aug-2017 08:39:53 Resource not found: org.springframework.cache.aspectj.AspectJCacheAnnotationTests
22-Aug-2017 08:39:53 Resource not found: org.springframework.transaction.aspectj.TransactionAspectTests
22-Aug-2017 08:39:53 Sensor SurefireSensor (done) | time=33ms
22-Aug-2017 08:39:53 Sensor JaCoCoSensor
22-Aug-2017 08:39:53 Analysing /opt/bamboo-home/xml-data/build-dir/SPR-SONAR-JOB1/spring-aspects/build/jacoco.exec
22-Aug-2017 08:39:53 No information about coverage per test.
22-Aug-2017 08:39:53 Sensor JaCoCoSensor (done) | time=22ms
22-Aug-2017 08:39:53 Sensor JaCoCoItSensor
22-Aug-2017 08:39:53 JaCoCoItSensor: JaCoCo IT report not found: /opt/bamboo-home/xml-data/build-dir/SPR-SONAR-JOB1/spring-aspects/target/jacoco-it.exec
22-Aug-2017 08:39:53 Sensor JaCoCoItSensor (done) | time=0ms
22-Aug-2017 08:39:53 Sensor JaCoCoOverallSensor
22-Aug-2017 08:39:53 Analysing /opt/bamboo-home/xml-data/build-dir/SPR-SONAR-JOB1/spring-aspects/build/jacoco.exec
22-Aug-2017 08:39:53 Analysing /opt/bamboo-home/xml-data/build-dir/SPR-SONAR-JOB1/build/sonar/org.springframework_spring_spring-aspects/jacoco-overall.exec
22-Aug-2017 08:39:53 No information about coverage per test.
22-Aug-2017 08:39:53 Sensor JaCoCoOverallSensor (done) | time=14ms
22-Aug-2017 08:39:53 Sensor XmlFileSensor
22-Aug-2017 08:39:53 Sensor XmlFileSensor (done) | time=1ms
22-Aug-2017 08:39:53 Sensor Zero Coverage Sensor
22-Aug-2017 08:39:53 Sensor Zero Coverage Sensor (done) | time=2ms
22-Aug-2017 08:39:53 Sensor Code Colorizer Sensor
22-Aug-2017 08:39:53 Sensor Code Colorizer Sensor (done) | time=48ms
22-Aug-2017 08:39:53 Sensor CPD Block Indexer
22-Aug-2017 08:39:53 JavaCpdBlockIndexer is used for java
22-Aug-2017 08:39:53 Sensor CPD Block Indexer (done) | time=3ms
22-Aug-2017 08:39:53 -------------  Scan spring-beans master
22-Aug-2017 08:39:53 Base dir: /opt/bamboo-home/xml-data/build-dir/SPR-SONAR-JOB1/spring-beans
22-Aug-2017 08:39:53 Working dir: /opt/bamboo-home/xml-data/build-dir/SPR-SONAR-JOB1/build/sonar/org.springframework_spring_spring-beans
22-Aug-2017 08:39:53 Source paths: src/main/kotlin, src/main/groovy, src/main/java
22-Aug-2017 08:39:53 Test paths: src/test/java, src/test/kotlin
22-Aug-2017 08:39:53 Source encoding: UTF-8, default locale: en_US
22-Aug-2017 08:39:53 Index files
22-Aug-2017 08:39:54 454 files indexed
22-Aug-2017 08:39:54 Quality profile for grvy: Sonar way
22-Aug-2017 08:39:54 Quality profile for java: Spring Framework
22-Aug-2017 08:39:54 Sensor Lines Sensor
22-Aug-2017 08:39:54 Sensor Lines Sensor (done) | time=6ms
22-Aug-2017 08:39:54 Sensor JavaSquidSensor
22-Aug-2017 08:39:54 Configured Java source version (sonar.java.source): 8
22-Aug-2017 08:39:54 JavaClasspath initialization
22-Aug-2017 08:39:54 JavaClasspath initialization (done) | time=1ms
22-Aug-2017 08:39:54 JavaTestClasspath initialization
22-Aug-2017 08:39:54 JavaTestClasspath initialization (done) | time=7ms
22-Aug-2017 08:39:54 Java Main Files AST scan
22-Aug-2017 08:39:54 297 source files to be analyzed
22-Aug-2017 08:40:04 180/297 files analyzed, current file: /opt/bamboo-home/xml-data/build-dir/SPR-SONAR-JOB1/spring-beans/src/main/java/org/springframework/beans/factory/support/AbstractBeanFactory.java
22-Aug-2017 08:40:10 Java Main Files AST scan (done) | time=16372ms
22-Aug-2017 08:40:10 297/297 source files have been analyzed
22-Aug-2017 08:40:10 Java Test Files AST scan
22-Aug-2017 08:40:10 156 source files to be analyzed
22-Aug-2017 08:40:17 156/156 source files have been analyzed
22-Aug-2017 08:40:17 Java Test Files AST scan (done) | time=6881ms
22-Aug-2017 08:40:17 Sensor JavaSquidSensor (done) | time=23271ms
22-Aug-2017 08:40:17 Sensor CoberturaSensor
22-Aug-2017 08:40:17 Cobertura report not found at /opt/bamboo-home/xml-data/build-dir/SPR-SONAR-JOB1/spring-beans/target/site/cobertura/coverage.xml
22-Aug-2017 08:40:17 Sensor CoberturaSensor (done) | time=0ms
22-Aug-2017 08:40:17 Sensor Sonar-Sonargraph-Plugin [3.5]
22-Aug-2017 08:40:17 ----------------------------------------------------------------
22-Aug-2017 08:40:17 Sonargraph: Skipping project spring-beans master [org.springframework:spring:spring-beans:master], since no Sonargraph report is found.
22-Aug-2017 08:40:17 ----------------------------------------------------------------
22-Aug-2017 08:40:17 Sensor Sonar-Sonargraph-Plugin [3.5] (done) | time=0ms
22-Aug-2017 08:40:17 Sensor SCM Sensor
22-Aug-2017 08:40:17 SCM provider for this project is: git
22-Aug-2017 08:40:17 230 files to be analyzed
22-Aug-2017 08:40:27 53/230 files analyzed
22-Aug-2017 08:40:37 95/230 files analyzed
22-Aug-2017 08:40:47 138/230 files analyzed
22-Aug-2017 08:40:57 177/230 files analyzed
22-Aug-2017 08:41:07 225/230 files analyzed
22-Aug-2017 08:41:08 230/230 files analyzed
22-Aug-2017 08:41:08 Sensor SCM Sensor (done) | time=51297ms
22-Aug-2017 08:41:08 Sensor FindBugs Sensor
22-Aug-2017 08:41:08 Findbugs needs sources to be compiled. Please build project before executing sonar or check the location of compiled classes to make it possible for Findbugs to analyse your project.
22-Aug-2017 08:41:08 :sonarqube FAILED
22-Aug-2017 08:41:08 :sonarqube (Thread[Task worker for ':' Thread 3,5,main]) completed. Took 2 mins 21.749 secs.
22-Aug-2017 08:41:08
22-Aug-2017 08:41:08 FAILURE: Build failed with an exception.
22-Aug-2017 08:41:08
22-Aug-2017 08:41:08 * What went wrong:
22-Aug-2017 08:41:08 Execution failed for task ':sonarqube'.
22-Aug-2017 08:41:08 > Can not execute Findbugs
22-Aug-2017 08:41:08
22-Aug-2017 08:41:08 * Try:
22-Aug-2017 08:41:08 Run with --stacktrace option to get the stack trace. Run with --debug option to get more log output.
22-Aug-2017 08:41:08
22-Aug-2017 08:41:08 163 actionable tasks: 163 executed
22-Aug-2017 08:41:08 * Get more help at https://help.gradle.org
22-Aug-2017 08:41:08
22-Aug-2017 08:41:08 BUILD FAILED in 14m 3s
22-Aug-2017 08:41:08 Stopped 2 worker daemon(s).
22-Aug-2017 08:41:09 Failing task since return code of [./gradlew sonarqube --info --info -Dsonar.host.url=http://sonar.af.pivotal.io:8080 -Dsonar.login=****** -Dsonar.branch=master] was 1 while expected 0
22-Aug-2017 08:42:10 Finished task 'Execute Sonarqube analysis' with result: Failed
22-Aug-2017 08:42:10 Running post build plugin 'Docker Container Cleanup'
22-Aug-2017 08:42:10 Running post build plugin 'NCover Results Collector'
22-Aug-2017 08:42:10 Running post build plugin 'Artifactory Release Management Staging'
22-Aug-2017 08:42:10 Running post build plugin 'Artifactory Build Info Copier'
22-Aug-2017 08:42:10 Running post build plugin 'Artifactory Gradle Properties Info Copier'
22-Aug-2017 08:42:10 Running post build plugin 'Clover Results Collector'
22-Aug-2017 08:42:10 Running post build plugin 'npm Cache Cleanup'
22-Aug-2017 08:42:10 Running post build plugin 'Artifact Copier'
22-Aug-2017 08:42:10 Successfully removed working directory at '/opt/bamboo-home/xml-data/build-dir/SPR-SONAR-JOB1'
22-Aug-2017 08:42:10 Finalising the build...
22-Aug-2017 08:42:10 Stopping timer.
22-Aug-2017 08:42:10 Build SPR-SONAR-JOB1-1132 completed.
22-Aug-2017 08:42:11 Running on server: post build plugin 'NCover Results Collector'
22-Aug-2017 08:42:11 Running on server: post build plugin 'Build Hanging Detection Configuration'
22-Aug-2017 08:42:11 Running on server: post build plugin 'Clover Delta Calculator'
22-Aug-2017 08:42:11 Running on server: post build plugin 'Maven Dependencies Postprocessor'
22-Aug-2017 08:42:11 All post build plugins have finished
22-Aug-2017 08:42:11 Generating build results summary...
22-Aug-2017 08:42:11 Saving build results to disk...
22-Aug-2017 08:42:11 Logging substituted variables...
22-Aug-2017 08:42:11 Indexing build results...
22-Aug-2017 08:42:11 Finished building SPR-SONAR-JOB1-1132.