Build #160

Build: #160 failed Changes by Spring Buildmaster

Build result summary

Details

Completed
Duration
53 seconds
Labels
None
Revision
af8d22f7cac169b4c39812fb66c79e1333e2bedb af8d22f7cac169b4c39812fb66c79e1333e2bedb
Total tests
187
Fixed in
#161 (Changes by Scott Frederick)
No failed tests found, a possible compilation error occurred.

Tests

  • 0 New failures
  • 0 Existing failures
  • 0 Fixed

Responsible

Code commits

Author Commit Message Commit date
Spring Buildmaster Spring Buildmaster af8d22f7cac169b4c39812fb66c79e1333e2bedb af8d22f7cac169b4c39812fb66c79e1333e2bedb [artifactory-release] Release version 2.0.1.RELEASE

Error summary for Default Job

The job generated some errors, drill down into the full build log for more details.

Note: /opt/bamboo-home/xml-data/build-dir/SPRINGCREDHUB-CORE-JOB1/spring-credhub-core/src/main/java/org/springframework/credhub/configuration/ClientHttpRequestFactoryFactory.java uses or overrides a deprecated API.
Note: Recompile with -Xlint:deprecation for details.
Note: /opt/bamboo-home/xml-data/build-dir/SPRINGCREDHUB-CORE-JOB1/spring-credhub-core/src/test/java/org/springframework/credhub/configuration/ClientHttpRequestFactoryFactoryTests.java uses or overrides a deprecated API.
Note: Recompile with -Xlint:deprecation for details.
asciidoctor: WARNING: dropping line containing reference to missing attribute: examples-dir
asciidoctor: WARNING: dropping line containing reference to missing attribute: examples-dir
asciidoctor: WARNING: dropping line containing reference to missing attribute: examples-dir
asciidoctor: WARNING: dropping line containing reference to missing attribute: examples-dir

FAILURE: Build failed with an exception.

* What went wrong:
Execution failed for task ':artifactoryDeploy'.
> java.io.IOException: Failed to deploy file. Status code: 409 Response message: Artifactory returned the following errors:
  The repository 'libs-snapshot-local' rejected the resolution of an artifact 'libs-snapshot-local:org/springframework/credhub/spring-credhub-cloud-connector/2.0.1.RELEASE/spring-credhub-cloud-connector-2.0.1.RELEASE-javadoc.jar' due to conflict in the snapshot release handling policy. Status code: 409

* Try:
Run with --stacktrace option to get the stack trace. Run with --info or --debug option to get more log output. Run with --scan to get full insights.

* Get more help at https://help.gradle.org

BUILD FAILED in 51s