Build #2,359

Build: #2359 failed Child of SPRINGDATACMNS-DATACMNS-2659

Build result summary

Details

Completed
Duration
2 minutes
Labels
None
Agent
bamboo-14.af.pivotal.io
Revision
aa3ed4e22b89fcc6737d7f294a6de4f4c62d76e9 aa3ed4e22b89fcc6737d7f294a6de4f4c62d76e9
Total tests
1652
Fixed in
#2360 (Child of SPRINGDATACMNS-DATACMNS-2660)

Responsible

No one has taken responsibility for this failure

Tests

New test failures 2
Status Test View job Duration
Collapse Failed AsyncCassandraTemplateIntegrationTests shouldPageRequests History
Default Job < 1 sec
java.lang.AssertionError: 
Expected size:<10> but was:<9> in:
<Slice 0 containing org.springframework.data.cassandra.domain.User instances>
java.lang.AssertionError: 

Expected size:<10> but was:<9> in:
<Slice 0 containing org.springframework.data.cassandra.domain.User instances>
	at org.springframework.data.cassandra.core.AsyncCassandraTemplateIntegrationTests.shouldPageRequests(AsyncCassandraTemplateIntegrationTests.java:336)
Collapse Failed AsyncCassandraTemplateEventIntegrationTests truncateShouldEmitEvents History
Default Job < 1 sec
java.lang.AssertionError: 
Expecting:
  <[]>
to contain exactly (and in same order):
  <[users]>
but could not find the following elements:
  <[users]>

(9 more lines...)