Build: #2065 failed Manual run by Oliver Drotbohm

Build result summary

Details

Completed
Duration
2 minutes
Labels
None
Agent
bamboo-12.af.pivotal.io
Revision
9f220d5c159cc78b0d701829b3074366a4e8fa08 9f220d5c159cc78b0d701829b3074366a4e8fa08
Total tests
2326

No failed tests found, a possible compilation error occurred.

Responsible

No one has taken responsibility for this failure

Configuration changes

Plan configuration has changed since the last successful build. See the plan audit log for more details.

Error summary for Default Job

The job generated some errors, drill down into the full build log for more details.

Java HotSpot(TM) 64-Bit Server VM warning: ignoring option PermSize=256m; support was removed in 8.0
/opt/bamboo-home/xml-data/build-dir/SPRINGDATACMNS-COMMONSSONAR-JOB1/src/test/java/org/springframework/data/util/ReflectionUtilsUnitTests.java:27: error: cannot find symbol
import org.springframework.data.mapping.model.TypeCreatingSyntheticClassKt;
                                             ^
  symbol:   class TypeCreatingSyntheticClassKt
  location: package org.springframework.data.mapping.model
/opt/bamboo-home/xml-data/build-dir/SPRINGDATACMNS-COMMONSSONAR-JOB1/src/test/java/org/springframework/data/repository/core/support/EventPublishingRepositoryProxyPostProcessorUnitTests.java:269: error: cannot find symbol
                @Getter(onMethod = @__(@DomainEvents)) Collection<? extends Object> events;
                                    ^
  symbol:   class __
  location: class MultipleEvents
/opt/bamboo-home/xml-data/build-dir/SPRINGDATACMNS-COMMONSSONAR-JOB1/src/test/java/org/springframework/data/repository/core/support/EventPublishingRepositoryProxyPostProcessorUnitTests.java:274: error: cannot find symbol
                @Getter(onMethod = @__(@DomainEvents)) final Collection<? extends Object> events;
                                    ^
  symbol:   class __
  location: class EventsWithClearing
/opt/bamboo-home/xml-data/build-dir/SPRINGDATACMNS-COMMONSSONAR-JOB1/src/test/java/org/springframework/data/repository/core/support/EventPublishingRepositoryProxyPostProcessorUnitTests.java:282: error: cannot find symbol
                @Getter(onMethod = @__(@DomainEvents)) Object event;
                                    ^
  symbol:   class __
  location: class OneEvent
4 errors
Dec 12, 2017 11:11:53 AM org.apache.webbeans.lifecycle.AbstractLifeCycle bootstrapApplication
INFO: OpenWebBeans Container is starting...
Dec 12, 2017 11:11:53 AM org.apache.webbeans.config.BeansDeployer validateInjectionPoints
INFO: All injection points were validated successfully.
Dec 12, 2017 11:11:53 AM org.apache.webbeans.lifecycle.AbstractLifeCycle bootstrapApplication
INFO: OpenWebBeans Container has started, it took [159] ms.
The following classes needed for analysis were missing:
  convert
  apply
  get
  test
  accept
  call
  getLookups
  run
  iterator
  doWith
  toResource
  applyAsDouble
  getJavaType
  doWithAssociation
  doWithPersistentProperty
  bind