Build: #2465 failed Scheduled

Logs

The following logs have been generated by the jobs in this plan.
  • Expand all
  • Collapse all
Job Logs
Collapse Default Job Default Stage Download or View
14-Jan-2019 00:15:04 [INFO] Downloaded: https://repo.spring.io/libs-snapshot/org/springframework/data/build/spring-data-parent/2.2.0.BUILD-SNAPSHOT/maven-metadata.xml (641 B at 1.2 KB/sec)
14-Jan-2019 00:15:04 [INFO] Downloading: https://repo.spring.io/libs-snapshot/org/springframework/data/build/spring-data-build/2.2.0.BUILD-SNAPSHOT/maven-metadata.xml
14-Jan-2019 00:15:04 [INFO] Downloaded: https://repo.spring.io/libs-snapshot/org/springframework/data/build/spring-data-build/2.2.0.BUILD-SNAPSHOT/maven-metadata.xml (640 B at 1.6 KB/sec)
14-Jan-2019 00:15:05 [INFO]                                                                         
14-Jan-2019 00:15:05 [INFO] ------------------------------------------------------------------------
14-Jan-2019 00:15:05 [INFO] Building Spring Data Core 2.2.0.BUILD-SNAPSHOT
14-Jan-2019 00:15:05 [INFO] ------------------------------------------------------------------------
14-Jan-2019 00:15:05 [INFO]
14-Jan-2019 00:15:05 [INFO] --- maven-enforcer-plugin:1.4.1:enforce (enforce-maven-version) @ spring-data-commons ---
14-Jan-2019 00:15:05 [WARNING] Rule 0: org.apache.maven.plugins.enforcer.RequireMavenVersion failed with message:
14-Jan-2019 00:15:05 Detected Maven Version: 3.3.9 is not in the allowed range 3.5.0.
14-Jan-2019 00:15:05 [INFO] ------------------------------------------------------------------------
14-Jan-2019 00:15:05 [INFO] BUILD FAILURE
14-Jan-2019 00:15:05 [INFO] ------------------------------------------------------------------------
14-Jan-2019 00:15:05 [INFO] Total time: 1.935 s
14-Jan-2019 00:15:05 [INFO] Finished at: 2019-01-14T00:15:05+00:00
14-Jan-2019 00:15:05 [INFO] Final Memory: 17M/237M
14-Jan-2019 00:15:05 [INFO] ------------------------------------------------------------------------
14-Jan-2019 00:15:05 [ERROR] Failed to execute goal org.apache.maven.plugins:maven-enforcer-plugin:1.4.1:enforce (enforce-maven-version) on project spring-data-commons: Some Enforcer rules have failed. Look above for specific messages explaining why the rule failed. -> [Help 1]
14-Jan-2019 00:15:05 [ERROR]
14-Jan-2019 00:15:05 [ERROR] To see the full stack trace of the errors, re-run Maven with the -e switch.
14-Jan-2019 00:15:05 [ERROR] Re-run Maven using the -X switch to enable full debug logging.
14-Jan-2019 00:15:05 [ERROR]
14-Jan-2019 00:15:05 [ERROR] For more information about the errors and possible solutions, please read the following articles:
14-Jan-2019 00:15:05 [ERROR] [Help 1] http://cwiki.apache.org/confluence/display/MAVEN/MojoExecutionException