Build: #2560 failed Scheduled

Build result summary

Details

Completed
Duration
2 minutes
Labels
None
Agent
bamboo-09.af.pivotal.io
Revision
21f6b1b4f75f0c1e070aa1525d2f07cbbb7add15 21f6b1b4f75f0c1e070aa1525d2f07cbbb7add15
Total tests
2882
Failing since
#2548 (Scheduled – )

No failed tests found, a possible compilation error occurred.

Responsible

This build has been failing since #2548
No one has taken responsibility

Error summary for Default Job

The job generated some errors, drill down into the full build log for more details.

Java HotSpot(TM) 64-Bit Server VM warning: ignoring option PermSize=256m; support was removed in 8.0
/opt/bamboo-home/xml-data/build-dir/SPRINGDATACMNS-COMMONSSONAR-JOB1/src/test/java/org/springframework/data/convert/ParameterizedKotlinInstantiatorUnitTests.java:35: error: cannot find symbol
import org.springframework.data.mapping.model.With32Args;
                                             ^
  symbol:   class With32Args
  location: package org.springframework.data.mapping.model
/opt/bamboo-home/xml-data/build-dir/SPRINGDATACMNS-COMMONSSONAR-JOB1/src/test/java/org/springframework/data/convert/ParameterizedKotlinInstantiatorUnitTests.java:36: error: cannot find symbol
import org.springframework.data.mapping.model.With33Args;
                                             ^
  symbol:   class With33Args
  location: package org.springframework.data.mapping.model
/opt/bamboo-home/xml-data/build-dir/SPRINGDATACMNS-COMMONSSONAR-JOB1/src/test/java/org/springframework/data/util/ReflectionUtilsUnitTests.java:27: error: cannot find symbol
import org.springframework.data.mapping.model.TypeCreatingSyntheticClassKt;
                                             ^
  symbol:   class TypeCreatingSyntheticClassKt
  location: package org.springframework.data.mapping.model
/opt/bamboo-home/xml-data/build-dir/SPRINGDATACMNS-COMMONSSONAR-JOB1/src/test/java/org/springframework/data/repository/core/support/EventPublishingRepositoryProxyPostProcessorUnitTests.java:269: error: cannot find symbol
                @Getter(onMethod = @__(@DomainEvents)) Collection<? extends Object> events;
                                    ^
  symbol:   class __
  location: class MultipleEvents
/opt/bamboo-home/xml-data/build-dir/SPRINGDATACMNS-COMMONSSONAR-JOB1/src/test/java/org/springframework/data/repository/core/support/EventPublishingRepositoryProxyPostProcessorUnitTests.java:274: error: cannot find symbol
                @Getter(onMethod = @__(@DomainEvents)) final Collection<? extends Object> events;
                                    ^
  symbol:   class __
  location: class EventsWithClearing
/opt/bamboo-home/xml-data/build-dir/SPRINGDATACMNS-COMMONSSONAR-JOB1/src/test/java/org/springframework/data/repository/core/support/EventPublishingRepositoryProxyPostProcessorUnitTests.java:282: error: cannot find symbol
                @Getter(onMethod = @__(@DomainEvents)) Object event;
                                    ^
  symbol:   class __
  location: class OneEvent
6 errors
Apr 17, 2019 12:16:06 AM org.apache.webbeans.lifecycle.AbstractLifeCycle bootstrapApplication
INFO: OpenWebBeans Container is starting...
Apr 17, 2019 12:16:06 AM org.apache.webbeans.config.BeansDeployer validateInjectionPoints
INFO: All injection points were validated successfully.
Apr 17, 2019 12:16:06 AM org.apache.webbeans.lifecycle.AbstractLifeCycle bootstrapApplication
INFO: OpenWebBeans Container has started, it took [123] ms.
Apr 17, 2019 12:16:06 AM org.apache.webbeans.lifecycle.AbstractLifeCycle bootstrapApplication
INFO: OpenWebBeans Container is starting...
Apr 17, 2019 12:16:06 AM org.apache.webbeans.config.BeansDeployer validateInjectionPoints
INFO: All injection points were validated successfully.
Apr 17, 2019 12:16:06 AM org.apache.webbeans.lifecycle.AbstractLifeCycle bootstrapApplication
INFO: OpenWebBeans Container has started, it took [34] ms.
Apr 17, 2019 12:16:07 AM org.apache.webbeans.lifecycle.AbstractLifeCycle bootstrapApplication
INFO: OpenWebBeans Container is starting...
Apr 17, 2019 12:16:07 AM org.apache.webbeans.config.BeansDeployer validateInjectionPoints
INFO: All injection points were validated successfully.
Apr 17, 2019 12:16:07 AM org.apache.webbeans.lifecycle.AbstractLifeCycle bootstrapApplication
INFO: OpenWebBeans Container has started, it took [19] ms.
[Fatal Error] :2:10: DOCTYPE is disallowed when the feature "http://apache.org/xml/features/disallow-doctype-decl" set to true.
The following classes needed for analysis were missing:
  test
  convert
  apply
  get
  getEvaluationContext
  accept
  applyAsInt
  call
  getLookups
  getUserType
  doWithPersistentProperty
  run
  doWith
  iterator
  match
  matches
  toModel
  applyAsDouble
  getJavaType
  doWithAssociation
  bind