Build: #2581 failed Scheduled

Build result summary

Details

Completed
Duration
2 minutes
Labels
None
Revision
a8e90b19320196c202d49d39fd4677c08dde5ddb a8e90b19320196c202d49d39fd4677c08dde5ddb
Total tests
2882
No failed tests found, a possible compilation error occurred.

Tests

Responsible

No one has taken responsibility for this failure

Error summary for Default Job

The job generated some errors, drill down into the full build log for more details.

Java HotSpot(TM) 64-Bit Server VM warning: ignoring option PermSize=256m; support was removed in 8.0
/opt/bamboo-home/xml-data/build-dir/SPRINGDATACMNS-COMMONSSONAR-JOB1/src/test/java/org/springframework/data/convert/ParameterizedKotlinInstantiatorUnitTests.java:35: error: cannot find symbol
import org.springframework.data.mapping.model.With32Args;
                                             ^
  symbol:   class With32Args
  location: package org.springframework.data.mapping.model
/opt/bamboo-home/xml-data/build-dir/SPRINGDATACMNS-COMMONSSONAR-JOB1/src/test/java/org/springframework/data/convert/ParameterizedKotlinInstantiatorUnitTests.java:36: error: cannot find symbol
import org.springframework.data.mapping.model.With33Args;
                                             ^
  symbol:   class With33Args
  location: package org.springframework.data.mapping.model
/opt/bamboo-home/xml-data/build-dir/SPRINGDATACMNS-COMMONSSONAR-JOB1/src/test/java/org/springframework/data/util/ReflectionUtilsUnitTests.java:27: error: cannot find symbol
import org.springframework.data.mapping.model.TypeCreatingSyntheticClassKt;
                                             ^
  symbol:   class TypeCreatingSyntheticClassKt
  location: package org.springframework.data.mapping.model
/opt/bamboo-home/xml-data/build-dir/SPRINGDATACMNS-COMMONSSONAR-JOB1/src/test/java/org/springframework/data/repository/core/support/EventPublishingRepositoryProxyPostProcessorUnitTests.java:269: error: cannot find symbol
                @Getter(onMethod = @__(@DomainEvents)) Collection<? extends Object> events;
                                    ^
  symbol:   class __
  location: class MultipleEvents
/opt/bamboo-home/xml-data/build-dir/SPRINGDATACMNS-COMMONSSONAR-JOB1/src/test/java/org/springframework/data/repository/core/support/EventPublishingRepositoryProxyPostProcessorUnitTests.java:274: error: cannot find symbol
                @Getter(onMethod = @__(@DomainEvents)) final Collection<? extends Object> events;
                                    ^
  symbol:   class __
  location: class EventsWithClearing
/opt/bamboo-home/xml-data/build-dir/SPRINGDATACMNS-COMMONSSONAR-JOB1/src/test/java/org/springframework/data/repository/core/support/EventPublishingRepositoryProxyPostProcessorUnitTests.java:282: error: cannot find symbol
                @Getter(onMethod = @__(@DomainEvents)) Object event;
                                    ^
  symbol:   class __
  location: class OneEvent
6 errors
May 08, 2019 12:15:58 AM org.apache.webbeans.lifecycle.AbstractLifeCycle bootstrapApplication
INFO: OpenWebBeans Container is starting...
May 08, 2019 12:15:58 AM org.apache.webbeans.config.BeansDeployer validateInjectionPoints
INFO: All injection points were validated successfully.
May 08, 2019 12:15:58 AM org.apache.webbeans.lifecycle.AbstractLifeCycle bootstrapApplication
INFO: OpenWebBeans Container has started, it took [120] ms.
May 08, 2019 12:15:58 AM org.apache.webbeans.lifecycle.AbstractLifeCycle bootstrapApplication
INFO: OpenWebBeans Container is starting...
May 08, 2019 12:15:58 AM org.apache.webbeans.config.BeansDeployer validateInjectionPoints
INFO: All injection points were validated successfully.
May 08, 2019 12:15:58 AM org.apache.webbeans.lifecycle.AbstractLifeCycle bootstrapApplication
INFO: OpenWebBeans Container has started, it took [28] ms.
May 08, 2019 12:15:58 AM org.apache.webbeans.lifecycle.AbstractLifeCycle bootstrapApplication
INFO: OpenWebBeans Container is starting...
May 08, 2019 12:15:58 AM org.apache.webbeans.config.BeansDeployer validateInjectionPoints
INFO: All injection points were validated successfully.
May 08, 2019 12:15:58 AM org.apache.webbeans.lifecycle.AbstractLifeCycle bootstrapApplication
INFO: OpenWebBeans Container has started, it took [19] ms.
[Fatal Error] :2:10: DOCTYPE is disallowed when the feature "http://apache.org/xml/features/disallow-doctype-decl" set to true.
The following classes needed for analysis were missing:
  test
  convert
  apply
  get
  getEvaluationContext
  accept
  applyAsInt
  call
  getLookups
  getUserType
  doWithPersistentProperty
  run
  doWith
  iterator
  match
  matches
  toModel
  applyAsDouble
  getJavaType
  doWithAssociation
  bind