Build: #2684 failed Scheduled

Logs

The following logs have been generated by the jobs in this plan.
  • Expand all
  • Collapse all
Job Logs
Collapse Default Job Default Stage Download or View
19-Aug-2019 00:17:00         at org.codehaus.plexus.classworlds.launcher.Launcher.launchEnhanced(Launcher.java:289)
19-Aug-2019 00:17:00         at org.codehaus.plexus.classworlds.launcher.Launcher.launch(Launcher.java:229)
19-Aug-2019 00:17:00         at org.codehaus.plexus.classworlds.launcher.Launcher.mainWithExitCode(Launcher.java:415)
19-Aug-2019 00:17:00         at org.codehaus.plexus.classworlds.launcher.Launcher.main(Launcher.java:356)
19-Aug-2019 00:17:00
19-Aug-2019 00:17:00 [INFO] Sensor FindBugs Sensor [findbugs] (done) | time=17046ms
19-Aug-2019 00:17:00 [INFO] Sensor SurefireSensor [java]
19-Aug-2019 00:17:00 [INFO] parsing [/opt/bamboo-home/xml-data/build-dir/SPRINGDATACMNS-COMMONSSONAR-JOB1/target/surefire-reports]
19-Aug-2019 00:17:01 [INFO] Sensor SurefireSensor [java] (done) | time=227ms
19-Aug-2019 00:17:01 [INFO] Sensor JaCoCoSensor [java]
19-Aug-2019 00:17:01 [WARNING] Property 'sonar.jacoco.reportPaths' is deprecated (JaCoCo binary format). 'sonar.coverage.jacoco.xmlReportPaths' should be used instead (JaCoCo XML format).
19-Aug-2019 00:17:01 [INFO] Analysing /opt/bamboo-home/xml-data/build-dir/SPRINGDATACMNS-COMMONSSONAR-JOB1/target/jacoco.exec
19-Aug-2019 00:17:01 [INFO] ------------------------------------------------------------------------
19-Aug-2019 00:17:01 [INFO] BUILD FAILURE
19-Aug-2019 00:17:01 [INFO] ------------------------------------------------------------------------
19-Aug-2019 00:17:01 [INFO] Total time: 45.432 s
19-Aug-2019 00:17:01 [INFO] Finished at: 2019-08-19T00:17:01Z
19-Aug-2019 00:17:01 [INFO] ------------------------------------------------------------------------
19-Aug-2019 00:17:01 [ERROR] Failed to execute goal org.sonarsource.scanner.maven:sonar-maven-plugin:3.6.0.1398:sonar (default-cli) on project spring-data-commons: Line 568 is out of range in the file target/generated-sources/delombok/org/springframework/data/mapping/model/BasicPersistentEntity.java (lines: 566) -> [Help 1]
19-Aug-2019 00:17:01 [ERROR]
19-Aug-2019 00:17:01 [ERROR] To see the full stack trace of the errors, re-run Maven with the -e switch.
19-Aug-2019 00:17:01 [ERROR] Re-run Maven using the -X switch to enable full debug logging.
19-Aug-2019 00:17:01 [ERROR]
19-Aug-2019 00:17:01 [ERROR] For more information about the errors and possible solutions, please read the following articles:
19-Aug-2019 00:17:01 [ERROR] [Help 1] http://cwiki.apache.org/confluence/display/MAVEN/MojoExecutionException