Build: #2684 failed

Job: Default Job failed

Stages & jobs

  1. Default Stage

Job result summary

Completed
Duration
1 minute
Agent
bamboo-22.af.pivotal.io
Revision
34c683bc57245102797f7c7d1568de1936b9b03e 34c683bc57245102797f7c7d1568de1936b9b03e
Total tests
2917
Failing since
#2581 (Scheduled – )
No failed tests found, a possible compilation error occurred.

Tests

  • 2,917 tests in total
  • 2 tests were quarantined / skipped
  • 25 seconds taken in total.

Error summary

The build generated some errors. See the full build log for more details.

OpenJDK 64-Bit Server VM warning: ignoring option PermSize=256m; support was removed in 8.0
/opt/bamboo-home/xml-data/build-dir/SPRINGDATACMNS-COMMONSSONAR-JOB1/src/test/java/org/springframework/data/convert/ParameterizedKotlinInstantiatorUnitTests.java:35: error: cannot find symbol
import org.springframework.data.mapping.model.With32Args;
                                             ^
  symbol:   class With32Args
  location: package org.springframework.data.mapping.model
/opt/bamboo-home/xml-data/build-dir/SPRINGDATACMNS-COMMONSSONAR-JOB1/src/test/java/org/springframework/data/convert/ParameterizedKotlinInstantiatorUnitTests.java:36: error: cannot find symbol
import org.springframework.data.mapping.model.With33Args;
                                             ^
  symbol:   class With33Args
  location: package org.springframework.data.mapping.model
/opt/bamboo-home/xml-data/build-dir/SPRINGDATACMNS-COMMONSSONAR-JOB1/src/test/java/org/springframework/data/util/ReflectionUtilsUnitTests.java:27: error: cannot find symbol
import org.springframework.data.mapping.model.TypeCreatingSyntheticClassKt;
                                             ^
  symbol:   class TypeCreatingSyntheticClassKt
  location: package org.springframework.data.mapping.model
/opt/bamboo-home/xml-data/build-dir/SPRINGDATACMNS-COMMONSSONAR-JOB1/src/test/java/org/springframework/data/repository/core/support/EventPublishingRepositoryProxyPostProcessorUnitTests.java:270: error: cannot find symbol
                @Getter(onMethod = @__(@DomainEvents)) Collection<? extends Object> events;
                                    ^
  symbol:   class __
  location: class MultipleEvents
/opt/bamboo-home/xml-data/build-dir/SPRINGDATACMNS-COMMONSSONAR-JOB1/src/test/java/org/springframework/data/repository/core/support/EventPublishingRepositoryProxyPostProcessorUnitTests.java:275: error: cannot find symbol
                @Getter(onMethod = @__(@DomainEvents)) final Collection<? extends Object> events;
                                    ^
  symbol:   class __
  location: class EventsWithClearing
/opt/bamboo-home/xml-data/build-dir/SPRINGDATACMNS-COMMONSSONAR-JOB1/src/test/java/org/springframework/data/repository/core/support/EventPublishingRepositoryProxyPostProcessorUnitTests.java:283: error: cannot find symbol
                @Getter(onMethod = @__(@DomainEvents)) Object event;
                                    ^
  symbol:   class __
  location: class OneEvent
6 errors
Aug 19, 2019 12:15:48 AM org.apache.webbeans.lifecycle.AbstractLifeCycle bootstrapApplication
INFO: OpenWebBeans Container is starting...
Aug 19, 2019 12:15:48 AM org.apache.webbeans.config.BeansDeployer validateInjectionPoints
INFO: All injection points were validated successfully.
Aug 19, 2019 12:15:48 AM org.apache.webbeans.lifecycle.AbstractLifeCycle bootstrapApplication
INFO: OpenWebBeans Container has started, it took [126] ms.
Aug 19, 2019 12:15:48 AM org.apache.webbeans.lifecycle.AbstractLifeCycle bootstrapApplication
INFO: OpenWebBeans Container is starting...
Aug 19, 2019 12:15:48 AM org.apache.webbeans.config.BeansDeployer validateInjectionPoints
INFO: All injection points were validated successfully.
Aug 19, 2019 12:15:48 AM org.apache.webbeans.lifecycle.AbstractLifeCycle bootstrapApplication
INFO: OpenWebBeans Container has started, it took [30] ms.
Aug 19, 2019 12:15:48 AM org.apache.webbeans.lifecycle.AbstractLifeCycle bootstrapApplication
INFO: OpenWebBeans Container is starting...
Aug 19, 2019 12:15:48 AM org.apache.webbeans.config.BeansDeployer validateInjectionPoints
INFO: All injection points were validated successfully.
Aug 19, 2019 12:15:48 AM org.apache.webbeans.lifecycle.AbstractLifeCycle bootstrapApplication
INFO: OpenWebBeans Container has started, it took [21] ms.
[Fatal Error] :2:10: DOCTYPE is disallowed when the feature "http://apache.org/xml/features/disallow-doctype-decl" set to true.
The following classes needed for analysis were missing:
  apply
  test
  convert
  get
  getEvaluationContext
  accept
  applyAsInt
  call
  getLookups
  getUserType
  doWith
  doWithPersistentProperty
  matches
  run
  iterator
  match
  toModel
  applyAsDouble
  getJavaType
  doWithAssociation
  bind