Build: #2684 failed

Job: Default Job failed

Stages & jobs

  1. Default Stage

Build log

The build generated 1,199 lines of output.The output is too long and has been truncated to the last 1,000 lines. Download or view full build log

19-Aug-2019 00:15:33 [INFO]  T E S T S
19-Aug-2019 00:15:33 [INFO] -------------------------------------------------------
19-Aug-2019 00:15:34 [INFO] Running org.springframework.data.config.TypeFilterParserUnitTests
19-Aug-2019 00:15:35 [INFO] Tests run: 2, Failures: 0, Errors: 0, Skipped: 0, Time elapsed: 1.01 s - in org.springframework.data.config.TypeFilterParserUnitTests
19-Aug-2019 00:15:35 [INFO] Running org.springframework.data.type.classreading.DefaultMethodsMetadataReaderUnitTests
19-Aug-2019 00:15:35 [INFO] Tests run: 4, Failures: 0, Errors: 0, Skipped: 0, Time elapsed: 0.085 s - in org.springframework.data.type.classreading.DefaultMethodsMetadataReaderUnitTests
19-Aug-2019 00:15:35 [INFO] Running org.springframework.data.type.classreading.MethodsMetadataReaderFactoryUnitTests
19-Aug-2019 00:15:35 [INFO] Tests run: 4, Failures: 0, Errors: 0, Skipped: 0, Time elapsed: 0.013 s - in org.springframework.data.type.classreading.MethodsMetadataReaderFactoryUnitTests
19-Aug-2019 00:15:35 [INFO] Running org.springframework.data.auditing.config.AuditingBeanDefinitionRegistrarSupportUnitTests
19-Aug-2019 00:15:35 [INFO] Tests run: 3, Failures: 0, Errors: 0, Skipped: 0, Time elapsed: 0.055 s - in org.springframework.data.auditing.config.AuditingBeanDefinitionRegistrarSupportUnitTests
19-Aug-2019 00:15:35 [INFO] Running org.springframework.data.auditing.AnnotationAuditingMetadataUnitTests
19-Aug-2019 00:15:35 [INFO] Tests run: 4, Failures: 0, Errors: 0, Skipped: 0, Time elapsed: 0.047 s - in org.springframework.data.auditing.AnnotationAuditingMetadataUnitTests
19-Aug-2019 00:15:35 [INFO] Running org.springframework.data.auditing.IsNewAwareAuditingHandlerUnitTests
19-Aug-2019 00:15:36 [INFO] Tests run: 13, Failures: 0, Errors: 0, Skipped: 0, Time elapsed: 0.344 s - in org.springframework.data.auditing.IsNewAwareAuditingHandlerUnitTests
19-Aug-2019 00:15:36 [INFO] Running org.springframework.data.auditing.DefaultAuditableBeanWrapperFactoryUnitTests
19-Aug-2019 00:15:36 [INFO] Tests run: 10, Failures: 0, Errors: 0, Skipped: 0, Time elapsed: 0.074 s - in org.springframework.data.auditing.DefaultAuditableBeanWrapperFactoryUnitTests
19-Aug-2019 00:15:36 [INFO] Running org.springframework.data.auditing.AuditingHandlerUnitTests
19-Aug-2019 00:15:36 [INFO] Tests run: 7, Failures: 0, Errors: 0, Skipped: 0, Time elapsed: 0.007 s - in org.springframework.data.auditing.AuditingHandlerUnitTests
19-Aug-2019 00:15:36 [INFO] Running org.springframework.data.auditing.ReflectionAuditingBeanWrapperUnitTests
19-Aug-2019 00:15:36 [INFO] Tests run: 4, Failures: 0, Errors: 0, Skipped: 0, Time elapsed: 0.062 s - in org.springframework.data.auditing.ReflectionAuditingBeanWrapperUnitTests
19-Aug-2019 00:15:36 [INFO] Running org.springframework.data.auditing.MappingAuditableBeanWrapperFactoryUnitTests
19-Aug-2019 00:15:36 [INFO] Tests run: 13, Failures: 0, Errors: 0, Skipped: 0, Time elapsed: 0.187 s - in org.springframework.data.auditing.MappingAuditableBeanWrapperFactoryUnitTests
19-Aug-2019 00:15:36 [INFO] Running org.springframework.data.domain.PageRequestUnitTests
19-Aug-2019 00:15:36 [INFO] Tests run: 7, Failures: 0, Errors: 0, Skipped: 0, Time elapsed: 0.012 s - in org.springframework.data.domain.PageRequestUnitTests
19-Aug-2019 00:15:36 [INFO] Running org.springframework.data.domain.SortUnitTests
19-Aug-2019 00:15:36 [INFO] Tests run: 18, Failures: 0, Errors: 0, Skipped: 0, Time elapsed: 0.133 s - in org.springframework.data.domain.SortUnitTests
19-Aug-2019 00:15:36 [INFO] Running org.springframework.data.domain.ExampleUnitTests
19-Aug-2019 00:15:36 [INFO] Tests run: 3, Failures: 0, Errors: 0, Skipped: 0, Time elapsed: 0.01 s - in org.springframework.data.domain.ExampleUnitTests
19-Aug-2019 00:15:36 [INFO] Running org.springframework.data.domain.DirectionUnitTests
19-Aug-2019 00:15:36 [INFO] Tests run: 2, Failures: 0, Errors: 0, Skipped: 0, Time elapsed: 0 s - in org.springframework.data.domain.DirectionUnitTests
19-Aug-2019 00:15:36 [INFO] Running org.springframework.data.domain.PageImplUnitTests
19-Aug-2019 00:15:36 [INFO] Tests run: 15, Failures: 0, Errors: 0, Skipped: 0, Time elapsed: 0.009 s - in org.springframework.data.domain.PageImplUnitTests
19-Aug-2019 00:15:36 [INFO] Running org.springframework.data.domain.ExampleMatcherUnitTests
19-Aug-2019 00:15:36 [INFO] Tests run: 17, Failures: 0, Errors: 0, Skipped: 0, Time elapsed: 0.004 s - in org.springframework.data.domain.ExampleMatcherUnitTests
19-Aug-2019 00:15:36 [INFO] Running org.springframework.data.domain.jaxb.SpringDataJaxbUnitTests
19-Aug-2019 00:15:37 [INFO] Tests run: 3, Failures: 0, Errors: 0, Skipped: 0, Time elapsed: 0.29 s - in org.springframework.data.domain.jaxb.SpringDataJaxbUnitTests
19-Aug-2019 00:15:37 [INFO] Running org.springframework.data.domain.RangeUnitTests
19-Aug-2019 00:15:37 [INFO] Tests run: 18, Failures: 0, Errors: 0, Skipped: 0, Time elapsed: 0.007 s - in org.springframework.data.domain.RangeUnitTests
19-Aug-2019 00:15:37 [INFO] Running org.springframework.data.domain.AbstractAggregateRootUnitTests
19-Aug-2019 00:15:37 [INFO] Tests run: 7, Failures: 0, Errors: 0, Skipped: 0, Time elapsed: 0 s - in org.springframework.data.domain.AbstractAggregateRootUnitTests
19-Aug-2019 00:15:37 [INFO] Running org.springframework.data.support.PersistableIsNewStrategyUnitTests
19-Aug-2019 00:15:37 [INFO] Tests run: 2, Failures: 0, Errors: 0, Skipped: 0, Time elapsed: 0.002 s - in org.springframework.data.support.PersistableIsNewStrategyUnitTests
19-Aug-2019 00:15:37 [INFO] Running org.springframework.data.annotation.TypeAliasUnitTests
19-Aug-2019 00:15:37 [INFO] Tests run: 1, Failures: 0, Errors: 0, Skipped: 0, Time elapsed: 0.048 s - in org.springframework.data.annotation.TypeAliasUnitTests
19-Aug-2019 00:15:37 [INFO] Running org.springframework.data.DependencyTests
19-Aug-2019 00:15:40 [INFO] Tests run: 1, Failures: 0, Errors: 0, Skipped: 0, Time elapsed: 3.697 s - in org.springframework.data.DependencyTests
19-Aug-2019 00:15:40 [INFO] Running org.springframework.data.history.RevisionsUnitTests
19-Aug-2019 00:15:40 [INFO] Tests run: 5, Failures: 0, Errors: 0, Skipped: 0, Time elapsed: 0.023 s - in org.springframework.data.history.RevisionsUnitTests
19-Aug-2019 00:15:40 [INFO] Running org.springframework.data.history.AnnotationRevisionMetadataUnitTests
19-Aug-2019 00:15:41 [INFO] Tests run: 7, Failures: 0, Errors: 0, Skipped: 0, Time elapsed: 1.03 s - in org.springframework.data.history.AnnotationRevisionMetadataUnitTests
19-Aug-2019 00:15:41 [INFO] Running org.springframework.data.history.RevisionUnitTests
19-Aug-2019 00:15:41 [INFO] Tests run: 4, Failures: 0, Errors: 0, Skipped: 0, Time elapsed: 0.008 s - in org.springframework.data.history.RevisionUnitTests
19-Aug-2019 00:15:41 [INFO] Running org.springframework.data.repository.config.RepositoryConfigurationExtensionSupportUnitTests
19-Aug-2019 00:15:42 [INFO] Tests run: 4, Failures: 0, Errors: 0, Skipped: 0, Time elapsed: 0.349 s - in org.springframework.data.repository.config.RepositoryConfigurationExtensionSupportUnitTests
19-Aug-2019 00:15:42 [INFO] Running org.springframework.data.repository.config.RepositoryConfigurationDelegateUnitTests
19-Aug-2019 00:15:42 [INFO] Tests run: 3, Failures: 0, Errors: 0, Skipped: 0, Time elapsed: 0.519 s - in org.springframework.data.repository.config.RepositoryConfigurationDelegateUnitTests
19-Aug-2019 00:15:42 [INFO] Running org.springframework.data.repository.config.AnnotationRepositoryConfigurationSourceUnitTests
19-Aug-2019 00:15:42 [INFO] Tests run: 12, Failures: 0, Errors: 0, Skipped: 0, Time elapsed: 0.054 s - in org.springframework.data.repository.config.AnnotationRepositoryConfigurationSourceUnitTests
19-Aug-2019 00:15:42 [INFO] Running org.springframework.data.repository.config.XmlRepositoryConfigurationSourceUnitTests
19-Aug-2019 00:15:42 [INFO] Tests run: 1, Failures: 0, Errors: 0, Skipped: 0, Time elapsed: 0.079 s - in org.springframework.data.repository.config.XmlRepositoryConfigurationSourceUnitTests
19-Aug-2019 00:15:42 [INFO] Running org.springframework.data.repository.config.SelectionSetUnitTests
19-Aug-2019 00:15:42 [INFO] Tests run: 7, Failures: 0, Errors: 0, Skipped: 0, Time elapsed: 0.005 s - in org.springframework.data.repository.config.SelectionSetUnitTests
19-Aug-2019 00:15:42 [INFO] Running org.springframework.data.repository.config.DefaultRepositoryConfigurationUnitTests
19-Aug-2019 00:15:42 [INFO] Tests run: 3, Failures: 0, Errors: 0, Skipped: 0, Time elapsed: 0.02 s - in org.springframework.data.repository.config.DefaultRepositoryConfigurationUnitTests
19-Aug-2019 00:15:42 [INFO] Running org.springframework.data.repository.config.ImplementationDetectionConfigurationUnitTests
19-Aug-2019 00:15:42 [INFO] Tests run: 1, Failures: 0, Errors: 0, Skipped: 0, Time elapsed: 0.001 s - in org.springframework.data.repository.config.ImplementationDetectionConfigurationUnitTests
19-Aug-2019 00:15:42 [INFO] Running org.springframework.data.repository.config.RepositoryBeanDefinitionRegistrarSupportUnitTests
19-Aug-2019 00:15:43 [INFO] Tests run: 5, Failures: 0, Errors: 0, Skipped: 0, Time elapsed: 0.121 s - in org.springframework.data.repository.config.RepositoryBeanDefinitionRegistrarSupportUnitTests
19-Aug-2019 00:15:43 [INFO] Running org.springframework.data.repository.config.RepositoryFragmentConfigurationUnitTests
19-Aug-2019 00:15:43 [INFO] Tests run: 1, Failures: 0, Errors: 0, Skipped: 0, Time elapsed: 0.001 s - in org.springframework.data.repository.config.RepositoryFragmentConfigurationUnitTests
19-Aug-2019 00:15:43 [INFO] Running org.springframework.data.repository.config.CustomRepositoryImplementationDetectorUnitTests
19-Aug-2019 00:15:43 [INFO] Tests run: 4, Failures: 0, Errors: 0, Skipped: 0, Time elapsed: 0.1 s - in org.springframework.data.repository.config.CustomRepositoryImplementationDetectorUnitTests
19-Aug-2019 00:15:43 [INFO] Running org.springframework.data.repository.config.DefaultImplementationLookupConfigurationUnitTests
19-Aug-2019 00:15:43 [INFO] Tests run: 1, Failures: 0, Errors: 0, Skipped: 0, Time elapsed: 0 s - in org.springframework.data.repository.config.DefaultImplementationLookupConfigurationUnitTests
19-Aug-2019 00:15:43 [INFO] Running org.springframework.data.repository.config.RepositoryBeanNameGeneratorUnitTests
19-Aug-2019 00:15:43 [INFO] Tests run: 4, Failures: 0, Errors: 0, Skipped: 0, Time elapsed: 0.005 s - in org.springframework.data.repository.config.RepositoryBeanNameGeneratorUnitTests
19-Aug-2019 00:15:43 [INFO] Running org.springframework.data.repository.config.ResourceReaderRepositoryPopulatorBeanDefinitionParserIntegrationTests
19-Aug-2019 00:15:43 [INFO] Tests run: 2, Failures: 0, Errors: 0, Skipped: 0, Time elapsed: 0.386 s - in org.springframework.data.repository.config.ResourceReaderRepositoryPopulatorBeanDefinitionParserIntegrationTests
19-Aug-2019 00:15:43 [INFO] Running org.springframework.data.repository.config.RepositoryBeanDefinitionRegistrarSupportIntegrationTests
19-Aug-2019 00:15:43 [INFO] Tests run: 5, Failures: 0, Errors: 0, Skipped: 0, Time elapsed: 0.339 s - in org.springframework.data.repository.config.RepositoryBeanDefinitionRegistrarSupportIntegrationTests
19-Aug-2019 00:15:43 [INFO] Running org.springframework.data.repository.config.RepositoryComponentProviderUnitTests
19-Aug-2019 00:15:44 [INFO] Tests run: 5, Failures: 0, Errors: 0, Skipped: 0, Time elapsed: 0.123 s - in org.springframework.data.repository.config.RepositoryComponentProviderUnitTests
19-Aug-2019 00:15:44 [INFO] Running org.springframework.data.repository.support.RepositoriesUnitTests
19-Aug-2019 00:15:44 [INFO] Tests run: 9, Failures: 0, Errors: 0, Skipped: 0, Time elapsed: 0.126 s - in org.springframework.data.repository.support.RepositoriesUnitTests
19-Aug-2019 00:15:44 [INFO] Running org.springframework.data.repository.support.CrudRepositoryInvokerUnitTests
19-Aug-2019 00:15:44 [INFO] Tests run: 9, Failures: 0, Errors: 0, Skipped: 0, Time elapsed: 0.096 s - in org.springframework.data.repository.support.CrudRepositoryInvokerUnitTests
19-Aug-2019 00:15:44 [INFO] Running org.springframework.data.repository.support.PaginginAndSortingRepositoryInvokerUnitTests
19-Aug-2019 00:15:44 [INFO] Tests run: 4, Failures: 0, Errors: 0, Skipped: 0, Time elapsed: 0.057 s - in org.springframework.data.repository.support.PaginginAndSortingRepositoryInvokerUnitTests
19-Aug-2019 00:15:44 [INFO] Running org.springframework.data.repository.support.RepositoriesIntegrationTests
19-Aug-2019 00:15:44 [INFO] Tests run: 2, Failures: 0, Errors: 0, Skipped: 0, Time elapsed: 0.1 s - in org.springframework.data.repository.support.RepositoriesIntegrationTests
19-Aug-2019 00:15:44 [INFO] Running org.springframework.data.repository.support.DomainClassConverterUnitTests
19-Aug-2019 00:15:44 [INFO] Tests run: 10, Failures: 0, Errors: 0, Skipped: 0, Time elapsed: 0.098 s - in org.springframework.data.repository.support.DomainClassConverterUnitTests
19-Aug-2019 00:15:44 [INFO] Running org.springframework.data.repository.support.ReflectionRepositoryInvokerUnitTests
19-Aug-2019 00:15:44 [INFO] Tests run: 19, Failures: 0, Errors: 0, Skipped: 0, Time elapsed: 0.154 s - in org.springframework.data.repository.support.ReflectionRepositoryInvokerUnitTests
19-Aug-2019 00:15:44 [INFO] Running org.springframework.data.repository.support.PageableExecutionUtilsUnitTests
19-Aug-2019 00:15:44 [INFO] Tests run: 6, Failures: 0, Errors: 0, Skipped: 0, Time elapsed: 0.012 s - in org.springframework.data.repository.support.PageableExecutionUtilsUnitTests
19-Aug-2019 00:15:44 [INFO] Running org.springframework.data.repository.support.MethodParametersUnitTests
19-Aug-2019 00:15:44 [INFO] Tests run: 2, Failures: 0, Errors: 0, Skipped: 0, Time elapsed: 0.004 s - in org.springframework.data.repository.support.MethodParametersUnitTests
19-Aug-2019 00:15:44 [INFO] Running org.springframework.data.repository.support.DefaultRepositoryInvokerFactoryIntegrationTests
19-Aug-2019 00:15:44 [INFO] Tests run: 5, Failures: 0, Errors: 0, Skipped: 0, Time elapsed: 0.012 s - in org.springframework.data.repository.support.DefaultRepositoryInvokerFactoryIntegrationTests
19-Aug-2019 00:15:44 [INFO] Running org.springframework.data.repository.support.DomainClassConverterIntegrationTests
19-Aug-2019 00:15:44 [INFO] Tests run: 1, Failures: 0, Errors: 0, Skipped: 0, Time elapsed: 0.065 s - in org.springframework.data.repository.support.DomainClassConverterIntegrationTests
19-Aug-2019 00:15:44 [INFO] Running org.springframework.data.repository.support.AnnotationAttributeUnitTests
19-Aug-2019 00:15:44 [INFO] Tests run: 3, Failures: 0, Errors: 0, Skipped: 0, Time elapsed: 0.001 s - in org.springframework.data.repository.support.AnnotationAttributeUnitTests
19-Aug-2019 00:15:44 [INFO] Running org.springframework.data.repository.core.support.TransactionRepositoryFactoryBeanSupportUnitTests
19-Aug-2019 00:15:44 [INFO] Tests run: 2, Failures: 0, Errors: 0, Skipped: 0, Time elapsed: 0.031 s - in org.springframework.data.repository.core.support.TransactionRepositoryFactoryBeanSupportUnitTests
19-Aug-2019 00:15:44 [INFO] Running org.springframework.data.repository.core.support.TransactionRepositoryProxyPostProcessorUnitTests
19-Aug-2019 00:15:44 [INFO] Tests run: 6, Failures: 0, Errors: 0, Skipped: 0, Time elapsed: 0.102 s - in org.springframework.data.repository.core.support.TransactionRepositoryProxyPostProcessorUnitTests
19-Aug-2019 00:15:44 [INFO] Running org.springframework.data.repository.core.support.DefaultRepositoryInformationUnitTests
19-Aug-2019 00:15:44 [INFO] Tests run: 18, Failures: 0, Errors: 0, Skipped: 0, Time elapsed: 0.027 s - in org.springframework.data.repository.core.support.DefaultRepositoryInformationUnitTests
19-Aug-2019 00:15:44 [INFO] Running org.springframework.data.repository.core.support.DefaultCrudMethodsUnitTests
19-Aug-2019 00:15:44 [INFO] Tests run: 11, Failures: 0, Errors: 0, Skipped: 0, Time elapsed: 0.01 s - in org.springframework.data.repository.core.support.DefaultCrudMethodsUnitTests
19-Aug-2019 00:15:44 [INFO] Running org.springframework.data.repository.core.support.PersistentEntityInformationUnitTests
19-Aug-2019 00:15:44 [INFO] Tests run: 2, Failures: 0, Errors: 0, Skipped: 0, Time elapsed: 0.007 s - in org.springframework.data.repository.core.support.PersistentEntityInformationUnitTests
19-Aug-2019 00:15:44 [INFO] Running org.springframework.data.repository.core.support.QueryExecutorMethodInterceptorUnitTests
19-Aug-2019 00:15:45 [INFO] Tests run: 2, Failures: 0, Errors: 0, Skipped: 0, Time elapsed: 0.033 s - in org.springframework.data.repository.core.support.QueryExecutorMethodInterceptorUnitTests
19-Aug-2019 00:15:45 [INFO] Running org.springframework.data.repository.core.support.PersistenceExceptionTranslationRepositoryProxyPostProcessorUnitTests
19-Aug-2019 00:15:45 [INFO] Tests run: 2, Failures: 0, Errors: 0, Skipped: 0, Time elapsed: 0.003 s - in org.springframework.data.repository.core.support.PersistenceExceptionTranslationRepositoryProxyPostProcessorUnitTests
19-Aug-2019 00:15:45 [INFO] Running org.springframework.data.repository.core.support.RepositoryCompositionUnitTests
19-Aug-2019 00:15:45 [INFO] Tests run: 8, Failures: 0, Errors: 0, Skipped: 0, Time elapsed: 0.026 s - in org.springframework.data.repository.core.support.RepositoryCompositionUnitTests
19-Aug-2019 00:15:45 [INFO] Running org.springframework.data.repository.core.support.RepositoryFactorySupportUnitTests
19-Aug-2019 00:15:47 [INFO] Tests run: 25, Failures: 0, Errors: 0, Skipped: 0, Time elapsed: 2.486 s - in org.springframework.data.repository.core.support.RepositoryFactorySupportUnitTests
19-Aug-2019 00:15:47 [INFO] Running org.springframework.data.repository.core.support.AbstractEntityInformationUnitTests
19-Aug-2019 00:15:47 [INFO] Tests run: 5, Failures: 0, Errors: 0, Skipped: 0, Time elapsed: 0.002 s - in org.springframework.data.repository.core.support.AbstractEntityInformationUnitTests
19-Aug-2019 00:15:47 [INFO] Running org.springframework.data.repository.core.support.ReactiveRepositoryInformationUnitTests
19-Aug-2019 00:15:47 [INFO] Tests run: 8, Failures: 0, Errors: 0, Skipped: 0, Time elapsed: 0.013 s - in org.springframework.data.repository.core.support.ReactiveRepositoryInformationUnitTests
19-Aug-2019 00:15:47 [INFO] Running org.springframework.data.repository.core.support.ReactiveWrapperRepositoryFactorySupportUnitTests
19-Aug-2019 00:15:47 [INFO] Tests run: 5, Failures: 0, Errors: 0, Skipped: 0, Time elapsed: 0.063 s - in org.springframework.data.repository.core.support.ReactiveWrapperRepositoryFactorySupportUnitTests
19-Aug-2019 00:15:47 [INFO] Running org.springframework.data.repository.core.support.RepositoryFactoryBeanSupportUnitTests
19-Aug-2019 00:15:47 [INFO] Tests run: 4, Failures: 0, Errors: 0, Skipped: 0, Time elapsed: 0.02 s - in org.springframework.data.repository.core.support.RepositoryFactoryBeanSupportUnitTests
19-Aug-2019 00:15:47 [INFO] Running org.springframework.data.repository.core.support.CustomAnnotationTransactionAttributeSourceUnitTests
19-Aug-2019 00:15:47 [INFO] Tests run: 1, Failures: 0, Errors: 0, Skipped: 0, Time elapsed: 0.001 s - in org.springframework.data.repository.core.support.CustomAnnotationTransactionAttributeSourceUnitTests
19-Aug-2019 00:15:47 [INFO] Running org.springframework.data.repository.core.support.AbstractRepositoryMetadataUnitTests
19-Aug-2019 00:15:47 [INFO] Tests run: 9, Failures: 0, Errors: 0, Skipped: 0, Time elapsed: 0.007 s - in org.springframework.data.repository.core.support.AbstractRepositoryMetadataUnitTests
19-Aug-2019 00:15:47 [INFO] Running org.springframework.data.repository.core.support.RepositoryFragmentUnitTests
19-Aug-2019 00:15:47 [INFO] Tests run: 2, Failures: 0, Errors: 0, Skipped: 0, Time elapsed: 0.002 s - in org.springframework.data.repository.core.support.RepositoryFragmentUnitTests
19-Aug-2019 00:15:47 [INFO] Running org.springframework.data.repository.core.support.ExampleSpecificationAccessorUnitTests
19-Aug-2019 00:15:47 [INFO] Tests run: 20, Failures: 0, Errors: 0, Skipped: 0, Time elapsed: 0.007 s - in org.springframework.data.repository.core.support.ExampleSpecificationAccessorUnitTests
19-Aug-2019 00:15:47 [INFO] Running org.springframework.data.repository.core.support.SurroundingTransactionDetectorMethodInterceptorUnitTests
19-Aug-2019 00:15:47 [INFO] Tests run: 2, Failures: 0, Errors: 0, Skipped: 0, Time elapsed: 0.002 s - in org.springframework.data.repository.core.support.SurroundingTransactionDetectorMethodInterceptorUnitTests
19-Aug-2019 00:15:47 [INFO] Running org.springframework.data.repository.core.support.QueryExecutionResultHandlerUnitTests
19-Aug-2019 00:15:47 [INFO] Tests run: 30, Failures: 0, Errors: 0, Skipped: 0, Time elapsed: 0.342 s - in org.springframework.data.repository.core.support.QueryExecutionResultHandlerUnitTests
19-Aug-2019 00:15:47 [INFO] Running org.springframework.data.repository.core.support.DefaultRepositoryMetadataUnitTests
19-Aug-2019 00:15:48 [INFO] Tests run: 12, Failures: 0, Errors: 0, Skipped: 0, Time elapsed: 0.007 s - in org.springframework.data.repository.core.support.DefaultRepositoryMetadataUnitTests
19-Aug-2019 00:15:48 [INFO] Running org.springframework.data.repository.core.support.AnnotationRepositoryMetadataUnitTests
19-Aug-2019 00:15:48 [INFO] Tests run: 2, Failures: 0, Errors: 0, Skipped: 0, Time elapsed: 0.002 s - in org.springframework.data.repository.core.support.AnnotationRepositoryMetadataUnitTests
19-Aug-2019 00:15:48 [INFO] Running org.springframework.data.repository.core.support.EventPublishingRepositoryProxyPostProcessorUnitTests
19-Aug-2019 00:15:48 [INFO] Tests run: 17, Failures: 0, Errors: 0, Skipped: 0, Time elapsed: 0.041 s - in org.springframework.data.repository.core.support.EventPublishingRepositoryProxyPostProcessorUnitTests
19-Aug-2019 00:15:48 [INFO] Running org.springframework.data.repository.cdi.CdiRepositoryBeanUnitTests
19-Aug-2019 00:15:48 [INFO] Tests run: 10, Failures: 0, Errors: 0, Skipped: 0, Time elapsed: 0.079 s - in org.springframework.data.repository.cdi.CdiRepositoryBeanUnitTests
19-Aug-2019 00:15:48 [INFO] Running org.springframework.data.repository.cdi.CdiConfigurationIntegrationTests
19-Aug-2019 00:15:48 Aug 19, 2019 12:15:48 AM org.apache.webbeans.lifecycle.AbstractLifeCycle bootstrapApplication
19-Aug-2019 00:15:48 INFO: OpenWebBeans Container is starting...
19-Aug-2019 00:15:48 Aug 19, 2019 12:15:48 AM org.apache.webbeans.config.BeansDeployer validateInjectionPoints
19-Aug-2019 00:15:48 INFO: All injection points were validated successfully.
19-Aug-2019 00:15:48 Aug 19, 2019 12:15:48 AM org.apache.webbeans.lifecycle.AbstractLifeCycle bootstrapApplication
19-Aug-2019 00:15:48 INFO: OpenWebBeans Container has started, it took [126] ms.
19-Aug-2019 00:15:48 [INFO] Tests run: 1, Failures: 0, Errors: 0, Skipped: 0, Time elapsed: 0.324 s - in org.springframework.data.repository.cdi.CdiConfigurationIntegrationTests
19-Aug-2019 00:15:48 [INFO] Running org.springframework.data.repository.cdi.RepositoryFragmentsIntegrationTests
19-Aug-2019 00:15:48 Aug 19, 2019 12:15:48 AM org.apache.webbeans.lifecycle.AbstractLifeCycle bootstrapApplication
19-Aug-2019 00:15:48 INFO: OpenWebBeans Container is starting...
19-Aug-2019 00:15:48 Aug 19, 2019 12:15:48 AM org.apache.webbeans.config.BeansDeployer validateInjectionPoints
19-Aug-2019 00:15:48 INFO: All injection points were validated successfully.
19-Aug-2019 00:15:48 Aug 19, 2019 12:15:48 AM org.apache.webbeans.lifecycle.AbstractLifeCycle bootstrapApplication
19-Aug-2019 00:15:48 INFO: OpenWebBeans Container has started, it took [30] ms.
19-Aug-2019 00:15:48 [INFO] Tests run: 2, Failures: 0, Errors: 0, Skipped: 0, Time elapsed: 0.068 s - in org.springframework.data.repository.cdi.RepositoryFragmentsIntegrationTests
19-Aug-2019 00:15:48 [INFO] Running org.springframework.data.repository.cdi.WebbeansCdiRepositoryExtensionSupportIntegrationTests
19-Aug-2019 00:15:48 Aug 19, 2019 12:15:48 AM org.apache.webbeans.lifecycle.AbstractLifeCycle bootstrapApplication
19-Aug-2019 00:15:48 INFO: OpenWebBeans Container is starting...
19-Aug-2019 00:15:48 Aug 19, 2019 12:15:48 AM org.apache.webbeans.config.BeansDeployer validateInjectionPoints
19-Aug-2019 00:15:48 INFO: All injection points were validated successfully.
19-Aug-2019 00:15:48 Aug 19, 2019 12:15:48 AM org.apache.webbeans.lifecycle.AbstractLifeCycle bootstrapApplication
19-Aug-2019 00:15:48 INFO: OpenWebBeans Container has started, it took [21] ms.
19-Aug-2019 00:15:48 [INFO] Tests run: 2, Failures: 0, Errors: 0, Skipped: 0, Time elapsed: 0.055 s - in org.springframework.data.repository.cdi.WebbeansCdiRepositoryExtensionSupportIntegrationTests
19-Aug-2019 00:15:48 [INFO] Running org.springframework.data.repository.init.ResourceReaderRepositoryInitializerUnitTests
19-Aug-2019 00:15:48 [INFO] Tests run: 3, Failures: 0, Errors: 0, Skipped: 0, Time elapsed: 0.024 s - in org.springframework.data.repository.init.ResourceReaderRepositoryInitializerUnitTests
19-Aug-2019 00:15:48 [INFO] Running org.springframework.data.repository.init.Jackson2ResourceReaderIntegrationTests
19-Aug-2019 00:15:48 [INFO] Tests run: 1, Failures: 0, Errors: 0, Skipped: 0, Time elapsed: 0.092 s - in org.springframework.data.repository.init.Jackson2ResourceReaderIntegrationTests
19-Aug-2019 00:15:48 [INFO] Running org.springframework.data.repository.CrudRepositoryExtensionsTests
19-Aug-2019 00:15:50 [INFO] Tests run: 1, Failures: 0, Errors: 0, Skipped: 0, Time elapsed: 1.461 s - in org.springframework.data.repository.CrudRepositoryExtensionsTests
19-Aug-2019 00:15:50 [INFO] Running org.springframework.data.repository.util.ReactiveWrapperConvertersUnitTests
19-Aug-2019 00:15:50 [INFO] Tests run: 30, Failures: 0, Errors: 0, Skipped: 0, Time elapsed: 0.159 s - in org.springframework.data.repository.util.ReactiveWrapperConvertersUnitTests
19-Aug-2019 00:15:50 [INFO] Running org.springframework.data.repository.util.ClassUtilsUnitTests
19-Aug-2019 00:15:50 [INFO] Tests run: 3, Failures: 0, Errors: 0, Skipped: 0, Time elapsed: 0.009 s - in org.springframework.data.repository.util.ClassUtilsUnitTests
19-Aug-2019 00:15:50 [INFO] Running org.springframework.data.repository.util.QueryExecutionConvertersUnitTests
19-Aug-2019 00:15:50 [INFO] Tests run: 33, Failures: 0, Errors: 0, Skipped: 0, Time elapsed: 0.177 s - in org.springframework.data.repository.util.QueryExecutionConvertersUnitTests
19-Aug-2019 00:15:50 [INFO] Running org.springframework.data.repository.util.ReactiveWrappersUnitTests
19-Aug-2019 00:15:50 [INFO] Tests run: 3, Failures: 0, Errors: 0, Skipped: 0, Time elapsed: 0.005 s - in org.springframework.data.repository.util.ReactiveWrappersUnitTests
19-Aug-2019 00:15:50 [INFO] Running org.springframework.data.repository.query.ParametersParameterAccessorUnitTests
19-Aug-2019 00:15:50 [INFO] Tests run: 3, Failures: 0, Errors: 0, Skipped: 0, Time elapsed: 0.015 s - in org.springframework.data.repository.query.ParametersParameterAccessorUnitTests
19-Aug-2019 00:15:50 [INFO] Running org.springframework.data.repository.query.ParametersUnitTests
19-Aug-2019 00:15:50 [INFO] Tests run: 16, Failures: 0, Errors: 0, Skipped: 0, Time elapsed: 0.036 s - in org.springframework.data.repository.query.ParametersUnitTests
19-Aug-2019 00:15:50 [INFO] Running org.springframework.data.repository.query.ReturnedTypeUnitTests
19-Aug-2019 00:15:50 [INFO] Tests run: 13, Failures: 0, Errors: 0, Skipped: 0, Time elapsed: 0.1 s - in org.springframework.data.repository.query.ReturnedTypeUnitTests
19-Aug-2019 00:15:50 [INFO] Running org.springframework.data.repository.query.SpelQueryContextUnitTests
19-Aug-2019 00:15:50 [INFO] Tests run: 4, Failures: 0, Errors: 0, Skipped: 0, Time elapsed: 0.014 s - in org.springframework.data.repository.query.SpelQueryContextUnitTests
19-Aug-2019 00:15:50 [INFO] Running org.springframework.data.repository.query.ResultProcessorUnitTests
19-Aug-2019 00:15:51 [INFO] Tests run: 20, Failures: 0, Errors: 0, Skipped: 0, Time elapsed: 0.464 s - in org.springframework.data.repository.query.ResultProcessorUnitTests
19-Aug-2019 00:15:51 [INFO] Running org.springframework.data.repository.query.SimpleParameterAccessorUnitTests
19-Aug-2019 00:15:51 [INFO] Tests run: 9, Failures: 0, Errors: 0, Skipped: 0, Time elapsed: 0.019 s - in org.springframework.data.repository.query.SimpleParameterAccessorUnitTests
19-Aug-2019 00:15:51 [INFO] Running org.springframework.data.repository.query.ExtensionAwareEvaluationContextProviderUnitTests
19-Aug-2019 00:15:51 [INFO] Tests run: 20, Failures: 0, Errors: 0, Skipped: 0, Time elapsed: 0.147 s - in org.springframework.data.repository.query.ExtensionAwareEvaluationContextProviderUnitTests
19-Aug-2019 00:15:51 [INFO] Running org.springframework.data.repository.query.parser.PartTreeUnitTests
19-Aug-2019 00:15:51 [INFO] Tests run: 72, Failures: 0, Errors: 0, Skipped: 0, Time elapsed: 0.147 s - in org.springframework.data.repository.query.parser.PartTreeUnitTests
19-Aug-2019 00:15:51 [INFO] Running org.springframework.data.repository.query.parser.OrderBySourceUnitTests
19-Aug-2019 00:15:51 [INFO] Tests run: 7, Failures: 0, Errors: 0, Skipped: 0, Time elapsed: 0.014 s - in org.springframework.data.repository.query.parser.OrderBySourceUnitTests
19-Aug-2019 00:15:51 [INFO] Running org.springframework.data.repository.query.SpelExtractorUnitTests
19-Aug-2019 00:15:52 [INFO] Tests run: 5, Failures: 0, Errors: 0, Skipped: 0, Time elapsed: 0.98 s - in org.springframework.data.repository.query.SpelExtractorUnitTests
19-Aug-2019 00:15:52 [INFO] Running org.springframework.data.repository.query.QuotationMapUnitTests
19-Aug-2019 00:15:52 [INFO] Tests run: 10, Failures: 0, Errors: 0, Skipped: 0, Time elapsed: 0.012 s - in org.springframework.data.repository.query.QuotationMapUnitTests
19-Aug-2019 00:15:52 [INFO] Running org.springframework.data.repository.query.QueryMethodUnitTests
19-Aug-2019 00:15:52 [INFO] Tests run: 20, Failures: 0, Errors: 0, Skipped: 0, Time elapsed: 0.033 s - in org.springframework.data.repository.query.QueryMethodUnitTests
19-Aug-2019 00:15:52 [INFO] Running org.springframework.data.repository.query.ParameterUnitTests
19-Aug-2019 00:15:52 [INFO] Tests run: 2, Failures: 0, Errors: 0, Skipped: 0, Time elapsed: 0.007 s - in org.springframework.data.repository.query.ParameterUnitTests
19-Aug-2019 00:15:52 [INFO] Running org.springframework.data.mapping.MappingMetadataTests
19-Aug-2019 00:15:52 [INFO] Tests run: 2, Failures: 0, Errors: 0, Skipped: 0, Time elapsed: 0.019 s - in org.springframework.data.mapping.MappingMetadataTests
19-Aug-2019 00:15:52 [INFO] Running org.springframework.data.mapping.model.IdPropertyIdentifierAccessorUnitTests
19-Aug-2019 00:15:52 [INFO] Tests run: 3, Failures: 0, Errors: 0, Skipped: 0, Time elapsed: 0.012 s - in org.springframework.data.mapping.model.IdPropertyIdentifierAccessorUnitTests
19-Aug-2019 00:15:52 [INFO] Running org.springframework.data.mapping.model.SnakeCaseFieldNamingStrategyUnitTests
19-Aug-2019 00:15:52 [INFO] Tests run: 1, Failures: 0, Errors: 0, Skipped: 0, Time elapsed: 0.072 s - in org.springframework.data.mapping.model.SnakeCaseFieldNamingStrategyUnitTests
19-Aug-2019 00:15:52 [INFO] Running org.springframework.data.mapping.model.ClassGeneratingPropertyAccessorFactoryDatatypeTests
19-Aug-2019 00:15:55 [INFO] Tests run: 272, Failures: 0, Errors: 0, Skipped: 0, Time elapsed: 2.541 s - in org.springframework.data.mapping.model.ClassGeneratingPropertyAccessorFactoryDatatypeTests
19-Aug-2019 00:15:55 [INFO] Running org.springframework.data.mapping.model.PersistentEntityParameterValueProviderUnitTests
19-Aug-2019 00:15:55 [INFO] Tests run: 2, Failures: 0, Errors: 0, Skipped: 0, Time elapsed: 0.026 s - in org.springframework.data.mapping.model.PersistentEntityParameterValueProviderUnitTests
19-Aug-2019 00:15:55 [INFO] Running org.springframework.data.mapping.model.PreferredConstructorDiscovererUnitTests
19-Aug-2019 00:15:55 [INFO] Tests run: 7, Failures: 0, Errors: 0, Skipped: 0, Time elapsed: 0.027 s - in org.springframework.data.mapping.model.PreferredConstructorDiscovererUnitTests
19-Aug-2019 00:15:55 [INFO] Running org.springframework.data.mapping.model.CamelCaseAbbreviatingFieldNamingStrategyUnitTests
19-Aug-2019 00:15:55 [INFO] Tests run: 1, Failures: 0, Errors: 0, Skipped: 0, Time elapsed: 0.001 s - in org.springframework.data.mapping.model.CamelCaseAbbreviatingFieldNamingStrategyUnitTests
19-Aug-2019 00:15:55 [INFO] Running org.springframework.data.mapping.model.PersistentEntityIsNewStrategyUnitTests
19-Aug-2019 00:15:55 [INFO] Tests run: 9, Failures: 0, Errors: 0, Skipped: 0, Time elapsed: 0.028 s - in org.springframework.data.mapping.model.PersistentEntityIsNewStrategyUnitTests
19-Aug-2019 00:15:55 [INFO] Running org.springframework.data.mapping.model.BasicPersistentEntityUnitTests
19-Aug-2019 00:15:55 [INFO] Tests run: 24, Failures: 0, Errors: 0, Skipped: 0, Time elapsed: 0.053 s - in org.springframework.data.mapping.model.BasicPersistentEntityUnitTests
19-Aug-2019 00:15:55 [INFO] Running org.springframework.data.mapping.model.PropertyUnitTests
19-Aug-2019 00:15:55 [INFO] Tests run: 4, Failures: 0, Errors: 0, Skipped: 0, Time elapsed: 0.004 s - in org.springframework.data.mapping.model.PropertyUnitTests
19-Aug-2019 00:15:55 [INFO] Running org.springframework.data.mapping.model.SpelExpressionParameterProviderUnitTests
19-Aug-2019 00:15:55 [INFO] Tests run: 5, Failures: 0, Errors: 0, Skipped: 0, Time elapsed: 0.058 s - in org.springframework.data.mapping.model.SpelExpressionParameterProviderUnitTests
19-Aug-2019 00:15:55 [INFO] Running org.springframework.data.mapping.model.ConvertingPropertyAccessorUnitTests
19-Aug-2019 00:15:55 [INFO] Tests run: 8, Failures: 0, Errors: 0, Skipped: 0, Time elapsed: 0.009 s - in org.springframework.data.mapping.model.ConvertingPropertyAccessorUnitTests
19-Aug-2019 00:15:55 [INFO] Running org.springframework.data.mapping.model.ClassGeneratingPropertyAccessorFactoryEntityTypeTests
19-Aug-2019 00:15:55 [INFO] Tests run: 2, Failures: 0, Errors: 0, Skipped: 0, Time elapsed: 0.012 s - in org.springframework.data.mapping.model.ClassGeneratingPropertyAccessorFactoryEntityTypeTests
19-Aug-2019 00:15:55 [INFO] Running org.springframework.data.mapping.model.ClassGeneratingPropertyAccessorFactoryTests
19-Aug-2019 00:15:55 [WARNING] Tests run: 623, Failures: 0, Errors: 0, Skipped: 1, Time elapsed: 0.248 s - in org.springframework.data.mapping.model.ClassGeneratingPropertyAccessorFactoryTests
19-Aug-2019 00:15:55 [INFO] Running org.springframework.data.mapping.model.PersistentPropertyAccessorTests
19-Aug-2019 00:15:55 [INFO] Tests run: 20, Failures: 0, Errors: 0, Skipped: 0, Time elapsed: 0.18 s - in org.springframework.data.mapping.model.PersistentPropertyAccessorTests
19-Aug-2019 00:15:55 [INFO] Running org.springframework.data.mapping.model.AnnotationBasedPersistentPropertyUnitTests
19-Aug-2019 00:15:55 [INFO] Tests run: 27, Failures: 0, Errors: 0, Skipped: 0, Time elapsed: 0.118 s - in org.springframework.data.mapping.model.AnnotationBasedPersistentPropertyUnitTests
19-Aug-2019 00:15:55 [INFO] Running org.springframework.data.mapping.model.AbstractPersistentPropertyUnitTests
19-Aug-2019 00:15:56 [INFO] Tests run: 20, Failures: 0, Errors: 0, Skipped: 0, Time elapsed: 0.033 s - in org.springframework.data.mapping.model.AbstractPersistentPropertyUnitTests
19-Aug-2019 00:15:56 [INFO] Running org.springframework.data.mapping.context.PersistentEntitiesUnitTests
19-Aug-2019 00:15:56 [INFO] Tests run: 7, Failures: 0, Errors: 0, Skipped: 0, Time elapsed: 0.079 s - in org.springframework.data.mapping.context.PersistentEntitiesUnitTests
19-Aug-2019 00:15:56 [INFO] Running org.springframework.data.mapping.context.AbstractMappingContextUnitTests
19-Aug-2019 00:15:56 [INFO] Tests run: 16, Failures: 0, Errors: 0, Skipped: 0, Time elapsed: 0.062 s - in org.springframework.data.mapping.context.AbstractMappingContextUnitTests
19-Aug-2019 00:15:56 [INFO] Running org.springframework.data.mapping.context.PersistentPropertyPathFactoryUnitTests
19-Aug-2019 00:15:56 [INFO] Tests run: 14, Failures: 0, Errors: 0, Skipped: 0, Time elapsed: 0.043 s - in org.springframework.data.mapping.context.PersistentPropertyPathFactoryUnitTests
19-Aug-2019 00:15:56 [INFO] Running org.springframework.data.mapping.context.AbstractMappingContextIntegrationTests
19-Aug-2019 00:15:57 [INFO] Tests run: 4, Failures: 0, Errors: 0, Skipped: 0, Time elapsed: 1.462 s - in org.springframework.data.mapping.context.AbstractMappingContextIntegrationTests
19-Aug-2019 00:15:57 [INFO] Running org.springframework.data.mapping.context.MappingContextEventUnitTests
19-Aug-2019 00:15:57 [INFO] Tests run: 3, Failures: 0, Errors: 0, Skipped: 0, Time elapsed: 0.041 s - in org.springframework.data.mapping.context.MappingContextEventUnitTests
19-Aug-2019 00:15:57 [INFO] Running org.springframework.data.mapping.context.PropertyMatchUnitTests
19-Aug-2019 00:15:57 [INFO] Tests run: 5, Failures: 0, Errors: 0, Skipped: 0, Time elapsed: 0 s - in org.springframework.data.mapping.context.PropertyMatchUnitTests
19-Aug-2019 00:15:57 [INFO] Running org.springframework.data.mapping.context.DefaultPersistentPropertyPathUnitTests
19-Aug-2019 00:15:57 [INFO] Tests run: 15, Failures: 0, Errors: 0, Skipped: 0, Time elapsed: 0.015 s - in org.springframework.data.mapping.context.DefaultPersistentPropertyPathUnitTests
19-Aug-2019 00:15:57 [INFO] Running org.springframework.data.mapping.PreferredConstructorDiscovererUnitTests
19-Aug-2019 00:15:57 [INFO] Tests run: 6, Failures: 0, Errors: 0, Skipped: 0, Time elapsed: 0.006 s - in org.springframework.data.mapping.PreferredConstructorDiscovererUnitTests
19-Aug-2019 00:15:57 [INFO] Running org.springframework.data.mapping.TargetAwareIdentifierAccessorUnitTests
19-Aug-2019 00:15:57 [INFO] Tests run: 1, Failures: 0, Errors: 0, Skipped: 0, Time elapsed: 0 s - in org.springframework.data.mapping.TargetAwareIdentifierAccessorUnitTests
19-Aug-2019 00:15:57 [INFO] Running org.springframework.data.mapping.PersistentPropertyAccessorUnitTests
19-Aug-2019 00:15:57 [INFO] Tests run: 9, Failures: 0, Errors: 0, Skipped: 0, Time elapsed: 0.034 s - in org.springframework.data.mapping.PersistentPropertyAccessorUnitTests
19-Aug-2019 00:15:57 [INFO] Running org.springframework.data.mapping.PropertyReferenceExceptionUnitTests
19-Aug-2019 00:15:57 [INFO] Tests run: 4, Failures: 0, Errors: 0, Skipped: 0, Time elapsed: 0.002 s - in org.springframework.data.mapping.PropertyReferenceExceptionUnitTests
19-Aug-2019 00:15:57 [INFO] Running org.springframework.data.mapping.callback.EntityCallbackDiscovererUnitTests
19-Aug-2019 00:15:57 [INFO] Tests run: 5, Failures: 0, Errors: 0, Skipped: 0, Time elapsed: 0.06 s - in org.springframework.data.mapping.callback.EntityCallbackDiscovererUnitTests
19-Aug-2019 00:15:57 [INFO] Running org.springframework.data.mapping.callback.DefaultEntityCallbacksUnitTests
19-Aug-2019 00:15:57 [INFO] Tests run: 9, Failures: 0, Errors: 0, Skipped: 0, Time elapsed: 0.048 s - in org.springframework.data.mapping.callback.DefaultEntityCallbacksUnitTests
19-Aug-2019 00:15:57 [INFO] Running org.springframework.data.mapping.callback.DefaultReactiveEntityCallbacksUnitTests
19-Aug-2019 00:15:57 [INFO] Tests run: 5, Failures: 0, Errors: 0, Skipped: 0, Time elapsed: 0.049 s - in org.springframework.data.mapping.callback.DefaultReactiveEntityCallbacksUnitTests
19-Aug-2019 00:15:57 [INFO] Running org.springframework.data.mapping.ParameterUnitTests
19-Aug-2019 00:15:57 [INFO] Tests run: 5, Failures: 0, Errors: 0, Skipped: 0, Time elapsed: 0.001 s - in org.springframework.data.mapping.ParameterUnitTests
19-Aug-2019 00:15:57 [INFO] Running org.springframework.data.mapping.SimpleTypeHolderUnitTests
19-Aug-2019 00:15:57 [INFO] Tests run: 15, Failures: 0, Errors: 0, Skipped: 0, Time elapsed: 0.006 s - in org.springframework.data.mapping.SimpleTypeHolderUnitTests
19-Aug-2019 00:15:57 [INFO] Running org.springframework.data.mapping.PropertyPathUnitTests
19-Aug-2019 00:15:57 [INFO] Tests run: 41, Failures: 0, Errors: 0, Skipped: 0, Time elapsed: 0.036 s - in org.springframework.data.mapping.PropertyPathUnitTests
19-Aug-2019 00:15:57 [INFO] Running org.springframework.data.web.config.SpringDataWebConfigurationIntegrationTests
19-Aug-2019 00:15:58 [INFO] Tests run: 6, Failures: 0, Errors: 0, Skipped: 0, Time elapsed: 0.203 s - in org.springframework.data.web.config.SpringDataWebConfigurationIntegrationTests
19-Aug-2019 00:15:58 [INFO] Running org.springframework.data.web.config.EnableSpringDataWebSupportIntegrationTests
19-Aug-2019 00:15:59 [INFO] Tests run: 12, Failures: 0, Errors: 0, Skipped: 0, Time elapsed: 0.881 s - in org.springframework.data.web.config.EnableSpringDataWebSupportIntegrationTests
19-Aug-2019 00:15:59 [INFO] Running org.springframework.data.web.config.PageableResourcesAssemblerIntegrationTests
19-Aug-2019 00:15:59 [INFO] Tests run: 3, Failures: 0, Errors: 0, Skipped: 0, Time elapsed: 0.085 s - in org.springframework.data.web.config.PageableResourcesAssemblerIntegrationTests
19-Aug-2019 00:15:59 [INFO] Running org.springframework.data.web.JsonProjectingMethodInterceptorFactoryUnitTests
19-Aug-2019 00:15:59 [INFO] Tests run: 14, Failures: 0, Errors: 0, Skipped: 0, Time elapsed: 0.113 s - in org.springframework.data.web.JsonProjectingMethodInterceptorFactoryUnitTests
19-Aug-2019 00:15:59 [INFO] Running org.springframework.data.web.MapDataBinderUnitTests
19-Aug-2019 00:15:59 [INFO] Tests run: 6, Failures: 0, Errors: 0, Skipped: 0, Time elapsed: 0.017 s - in org.springframework.data.web.MapDataBinderUnitTests
19-Aug-2019 00:15:59 [INFO] Running org.springframework.data.web.HateoasPageableHandlerMethodArgumentResolverUnitTests
19-Aug-2019 00:15:59 [INFO] Tests run: 36, Failures: 0, Errors: 0, Skipped: 0, Time elapsed: 0.024 s - in org.springframework.data.web.HateoasPageableHandlerMethodArgumentResolverUnitTests
19-Aug-2019 00:15:59 [INFO] Running org.springframework.data.web.SortHandlerMethodArgumentResolverUnitTests
19-Aug-2019 00:15:59 [INFO] Tests run: 22, Failures: 0, Errors: 0, Skipped: 0, Time elapsed: 0.013 s - in org.springframework.data.web.SortHandlerMethodArgumentResolverUnitTests
19-Aug-2019 00:15:59 [INFO] Running org.springframework.data.web.PagedResourcesAssemblerArgumentResolverUnitTests
19-Aug-2019 00:15:59 [INFO] Tests run: 10, Failures: 0, Errors: 0, Skipped: 0, Time elapsed: 0.03 s - in org.springframework.data.web.PagedResourcesAssemblerArgumentResolverUnitTests
19-Aug-2019 00:15:59 [INFO] Running org.springframework.data.web.HateoasSortHandlerMethodArgumentResolverUnitTests
19-Aug-2019 00:15:59 [INFO] Tests run: 25, Failures: 0, Errors: 0, Skipped: 0, Time elapsed: 0.008 s - in org.springframework.data.web.HateoasSortHandlerMethodArgumentResolverUnitTests
19-Aug-2019 00:15:59 [INFO] Running org.springframework.data.web.XmlBeamHttpMessageConverterUnitTests
19-Aug-2019 00:15:59 [Fatal Error] :2:10: DOCTYPE is disallowed when the feature "http://apache.org/xml/features/disallow-doctype-decl" set to true.
19-Aug-2019 00:15:59 [INFO] Tests run: 7, Failures: 0, Errors: 0, Skipped: 0, Time elapsed: 0.126 s - in org.springframework.data.web.XmlBeamHttpMessageConverterUnitTests
19-Aug-2019 00:15:59 [INFO] Running org.springframework.data.web.PageableHandlerMethodArgumentResolverUnitTests
19-Aug-2019 00:15:59 [INFO] Tests run: 29, Failures: 0, Errors: 0, Skipped: 0, Time elapsed: 0.008 s - in org.springframework.data.web.PageableHandlerMethodArgumentResolverUnitTests
19-Aug-2019 00:15:59 [INFO] Running org.springframework.data.web.ProxyingHandlerMethodArgumentResolverUnitTests
19-Aug-2019 00:15:59 [INFO] Tests run: 4, Failures: 0, Errors: 0, Skipped: 0, Time elapsed: 0.002 s - in org.springframework.data.web.ProxyingHandlerMethodArgumentResolverUnitTests
19-Aug-2019 00:15:59 [INFO] Running org.springframework.data.web.PagedResourcesAssemblerUnitTests
19-Aug-2019 00:15:59 [INFO] Tests run: 19, Failures: 0, Errors: 0, Skipped: 0, Time elapsed: 0 s - in org.springframework.data.web.PagedResourcesAssemblerUnitTests
19-Aug-2019 00:15:59 [INFO] Running org.springframework.data.web.querydsl.QuerydslPredicateArgumentResolverUnitTests
19-Aug-2019 00:15:59 [INFO] Tests run: 14, Failures: 0, Errors: 0, Skipped: 0, Time elapsed: 0.145 s - in org.springframework.data.web.querydsl.QuerydslPredicateArgumentResolverUnitTests
19-Aug-2019 00:15:59 [INFO] Running org.springframework.data.web.ProjectingJackson2HttpMessageConverterUnitTests
19-Aug-2019 00:15:59 [INFO] Tests run: 5, Failures: 0, Errors: 0, Skipped: 0, Time elapsed: 0.004 s - in org.springframework.data.web.ProjectingJackson2HttpMessageConverterUnitTests
19-Aug-2019 00:15:59 [INFO] Running org.springframework.data.spel.spi.FunctionUnitTests
19-Aug-2019 00:15:59 [INFO] Tests run: 2, Failures: 0, Errors: 0, Skipped: 0, Time elapsed: 0 s - in org.springframework.data.spel.spi.FunctionUnitTests
19-Aug-2019 00:15:59 [INFO] Running org.springframework.data.spel.EvaluationContextExtensionInformationUnitTests
19-Aug-2019 00:15:59 [INFO] Tests run: 1, Failures: 0, Errors: 0, Skipped: 0, Time elapsed: 0 s - in org.springframework.data.spel.EvaluationContextExtensionInformationUnitTests
19-Aug-2019 00:15:59 [INFO] Running org.springframework.data.convert.SimpleTypeInformationMapperUnitTests
19-Aug-2019 00:15:59 [INFO] Tests run: 5, Failures: 0, Errors: 0, Skipped: 0, Time elapsed: 0.001 s - in org.springframework.data.convert.SimpleTypeInformationMapperUnitTests
19-Aug-2019 00:15:59 [INFO] Running org.springframework.data.convert.ParameterizedKotlinInstantiatorUnitTests
19-Aug-2019 00:16:00 [INFO] Tests run: 260, Failures: 0, Errors: 0, Skipped: 0, Time elapsed: 0.284 s - in org.springframework.data.convert.ParameterizedKotlinInstantiatorUnitTests
19-Aug-2019 00:16:00 [INFO] Running org.springframework.data.convert.KotlinClassGeneratingEntityInstantiatorUnitTests
19-Aug-2019 00:16:00 [INFO] Tests run: 5, Failures: 0, Errors: 0, Skipped: 0, Time elapsed: 0.767 s - in org.springframework.data.convert.KotlinClassGeneratingEntityInstantiatorUnitTests
19-Aug-2019 00:16:00 [INFO] Running org.springframework.data.convert.ReflectionEntityInstantiatorUnitTests
19-Aug-2019 00:16:00 [INFO] Tests run: 6, Failures: 0, Errors: 0, Skipped: 0, Time elapsed: 0.015 s - in org.springframework.data.convert.ReflectionEntityInstantiatorUnitTests
19-Aug-2019 00:16:00 [INFO] Running org.springframework.data.convert.ClassGeneratingEntityInstantiatorUnitTests
19-Aug-2019 00:16:00 [INFO] Tests run: 21, Failures: 0, Errors: 0, Skipped: 0, Time elapsed: 0.04 s - in org.springframework.data.convert.ClassGeneratingEntityInstantiatorUnitTests
19-Aug-2019 00:16:00 [INFO] Running org.springframework.data.convert.ConverterBuilderUnitTests
19-Aug-2019 00:16:00 [INFO] Tests run: 4, Failures: 0, Errors: 0, Skipped: 0, Time elapsed: 0.008 s - in org.springframework.data.convert.ConverterBuilderUnitTests
19-Aug-2019 00:16:00 [INFO] Running org.springframework.data.convert.MappingContextTypeInformationMapperUnitTests
19-Aug-2019 00:16:00 [INFO] Tests run: 6, Failures: 0, Errors: 0, Skipped: 0, Time elapsed: 0.048 s - in org.springframework.data.convert.MappingContextTypeInformationMapperUnitTests
19-Aug-2019 00:16:00 [INFO] Running org.springframework.data.convert.DefaultTypeMapperUnitTests
19-Aug-2019 00:16:00 [INFO] Tests run: 3, Failures: 0, Errors: 0, Skipped: 0, Time elapsed: 0.02 s - in org.springframework.data.convert.DefaultTypeMapperUnitTests
19-Aug-2019 00:16:00 [INFO] Running org.springframework.data.convert.ReflectionEntityInstantiatorDataClassUnitTests
19-Aug-2019 00:16:00 [INFO] Tests run: 2, Failures: 0, Errors: 0, Skipped: 0, Time elapsed: 0.013 s - in org.springframework.data.convert.ReflectionEntityInstantiatorDataClassUnitTests
19-Aug-2019 00:16:00 [INFO] Running org.springframework.data.convert.ConfigurableTypeInformationMapperUnitTests
19-Aug-2019 00:16:00 [INFO] Tests run: 4, Failures: 0, Errors: 0, Skipped: 0, Time elapsed: 0.002 s - in org.springframework.data.convert.ConfigurableTypeInformationMapperUnitTests
19-Aug-2019 00:16:00 [INFO] Running org.springframework.data.convert.CustomConversionsUnitTests
19-Aug-2019 00:16:01 [INFO] Tests run: 14, Failures: 0, Errors: 0, Skipped: 0, Time elapsed: 0.044 s - in org.springframework.data.convert.CustomConversionsUnitTests
19-Aug-2019 00:16:01 [INFO] Running org.springframework.data.convert.ThreeTenBackPortConvertersUnitTests
19-Aug-2019 00:16:01 [INFO] Tests run: 9, Failures: 0, Errors: 0, Skipped: 0, Time elapsed: 0.006 s - in org.springframework.data.convert.ThreeTenBackPortConvertersUnitTests
19-Aug-2019 00:16:01 [INFO] Running org.springframework.data.convert.Jsr310ConvertersUnitTests
19-Aug-2019 00:16:01 [INFO] Tests run: 23, Failures: 0, Errors: 0, Skipped: 0, Time elapsed: 0.028 s - in org.springframework.data.convert.Jsr310ConvertersUnitTests
19-Aug-2019 00:16:01 [INFO] Running org.springframework.data.convert.EntityInstantiatorsUnitTests
19-Aug-2019 00:16:01 [INFO] Tests run: 4, Failures: 0, Errors: 0, Skipped: 0, Time elapsed: 0.01 s - in org.springframework.data.convert.EntityInstantiatorsUnitTests
19-Aug-2019 00:16:01 [INFO] Running org.springframework.data.transaction.ChainedTransactionManagerTests
19-Aug-2019 00:16:01 [INFO] Tests run: 7, Failures: 0, Errors: 0, Skipped: 0, Time elapsed: 0.009 s - in org.springframework.data.transaction.ChainedTransactionManagerTests
19-Aug-2019 00:16:01 [INFO] Running org.springframework.data.util.AnnotationDetectionFieldCallbackUnitTests
19-Aug-2019 00:16:01 [INFO] Tests run: 3, Failures: 0, Errors: 0, Skipped: 0, Time elapsed: 0.002 s - in org.springframework.data.util.AnnotationDetectionFieldCallbackUnitTests
19-Aug-2019 00:16:01 [INFO] Running org.springframework.data.util.ParameterTypesUnitTests
19-Aug-2019 00:16:01 [INFO] Tests run: 5, Failures: 0, Errors: 0, Skipped: 0, Time elapsed: 0.004 s - in org.springframework.data.util.ParameterTypesUnitTests
19-Aug-2019 00:16:01 [INFO] Running org.springframework.data.util.ReflectionUtilsUnitTests
19-Aug-2019 00:16:01 [INFO] Tests run: 17, Failures: 0, Errors: 0, Skipped: 0, Time elapsed: 0.012 s - in org.springframework.data.util.ReflectionUtilsUnitTests
19-Aug-2019 00:16:01 [INFO] Running org.springframework.data.util.BeanLookupUnitTests
19-Aug-2019 00:16:01 [INFO] Tests run: 3, Failures: 0, Errors: 0, Skipped: 0, Time elapsed: 0.005 s - in org.springframework.data.util.BeanLookupUnitTests
19-Aug-2019 00:16:01 [INFO] Running org.springframework.data.util.LazyUnitTests
19-Aug-2019 00:16:01 [INFO] Tests run: 9, Failures: 0, Errors: 0, Skipped: 0, Time elapsed: 0.014 s - in org.springframework.data.util.LazyUnitTests
19-Aug-2019 00:16:01 [INFO] Running org.springframework.data.util.AnnotatedTypeScannerUnitTests
19-Aug-2019 00:16:01 [INFO] Tests run: 1, Failures: 0, Errors: 0, Skipped: 0, Time elapsed: 0.028 s - in org.springframework.data.util.AnnotatedTypeScannerUnitTests
19-Aug-2019 00:16:01 [INFO] Running org.springframework.data.util.ClassTypeInformationUnitTests
19-Aug-2019 00:16:01 [INFO] Tests run: 32, Failures: 0, Errors: 0, Skipped: 0, Time elapsed: 0.04 s - in org.springframework.data.util.ClassTypeInformationUnitTests
19-Aug-2019 00:16:01 [INFO] Running org.springframework.data.util.DirectFieldAccessFallbackBeanWrapperUnitTests
19-Aug-2019 00:16:01 [INFO] Tests run: 4, Failures: 0, Errors: 0, Skipped: 0, Time elapsed: 0.003 s - in org.springframework.data.util.DirectFieldAccessFallbackBeanWrapperUnitTests
19-Aug-2019 00:16:01 [INFO] Running org.springframework.data.util.NullableUtilsUnitTests
19-Aug-2019 00:16:01 [INFO] Tests run: 10, Failures: 0, Errors: 0, Skipped: 0, Time elapsed: 0.007 s - in org.springframework.data.util.NullableUtilsUnitTests
19-Aug-2019 00:16:01 [INFO] Running org.springframework.data.util.VersionUnitTests
19-Aug-2019 00:16:01 [INFO] Tests run: 13, Failures: 0, Errors: 0, Skipped: 0, Time elapsed: 0.005 s - in org.springframework.data.util.VersionUnitTests
19-Aug-2019 00:16:01 [INFO] Running org.springframework.data.util.ParsingUtilsUnitTests
19-Aug-2019 00:16:01 [INFO] Tests run: 2, Failures: 0, Errors: 0, Skipped: 0, Time elapsed: 0.002 s - in org.springframework.data.util.ParsingUtilsUnitTests
19-Aug-2019 00:16:01 [INFO] Running org.springframework.data.util.StreamableUnitTests
19-Aug-2019 00:16:01 [INFO] Tests run: 5, Failures: 0, Errors: 0, Skipped: 0, Time elapsed: 0.004 s - in org.springframework.data.util.StreamableUnitTests
19-Aug-2019 00:16:01 [INFO] Running org.springframework.data.util.MethodInvocationRecorderUnitTests
19-Aug-2019 00:16:01 [INFO] Tests run: 7, Failures: 0, Errors: 0, Skipped: 0, Time elapsed: 0.026 s - in org.springframework.data.util.MethodInvocationRecorderUnitTests
19-Aug-2019 00:16:01 [INFO] Running org.springframework.data.util.ParameterizedTypeInformationUnitTests
19-Aug-2019 00:16:01 [INFO] Tests run: 10, Failures: 0, Errors: 0, Skipped: 0, Time elapsed: 0.024 s - in org.springframework.data.util.ParameterizedTypeInformationUnitTests
19-Aug-2019 00:16:01 [INFO] Running org.springframework.data.util.DataCmns511Tests
19-Aug-2019 00:16:01 [INFO] Tests run: 1, Failures: 0, Errors: 0, Skipped: 0, Time elapsed: 0.001 s - in org.springframework.data.util.DataCmns511Tests
19-Aug-2019 00:16:01 [INFO] Running org.springframework.data.util.TypeDiscovererUnitTests
19-Aug-2019 00:16:01 [INFO] Tests run: 13, Failures: 0, Errors: 0, Skipped: 0, Time elapsed: 0.03 s - in org.springframework.data.util.TypeDiscovererUnitTests
19-Aug-2019 00:16:01 [INFO] Running org.springframework.data.util.PairUnitTests
19-Aug-2019 00:16:01 [INFO] Tests run: 5, Failures: 0, Errors: 0, Skipped: 0, Time elapsed: 0.001 s - in org.springframework.data.util.PairUnitTests
19-Aug-2019 00:16:01 [INFO] Running org.springframework.data.util.ProxyUtilsUnitTests
19-Aug-2019 00:16:01 [INFO] Tests run: 3, Failures: 0, Errors: 0, Skipped: 0, Time elapsed: 0.013 s - in org.springframework.data.util.ProxyUtilsUnitTests
19-Aug-2019 00:16:01 [INFO] Running org.springframework.data.util.StreamUtilsTests
19-Aug-2019 00:16:01 [INFO] Tests run: 1, Failures: 0, Errors: 0, Skipped: 0, Time elapsed: 0 s - in org.springframework.data.util.StreamUtilsTests
19-Aug-2019 00:16:01 [INFO] Running org.springframework.data.util.AnnotationDetectionMethodCallbackUnitTests
19-Aug-2019 00:16:01 [INFO] Tests run: 2, Failures: 0, Errors: 0, Skipped: 0, Time elapsed: 0.001 s - in org.springframework.data.util.AnnotationDetectionMethodCallbackUnitTests
19-Aug-2019 00:16:01 [INFO] Running org.springframework.data.querydsl.SimpleEntityPathResolverUnitTests
19-Aug-2019 00:16:01 [INFO] Tests run: 4, Failures: 0, Errors: 0, Skipped: 0, Time elapsed: 0.003 s - in org.springframework.data.querydsl.SimpleEntityPathResolverUnitTests
19-Aug-2019 00:16:01 [INFO] Running org.springframework.data.querydsl.binding.QuerydslPredicateBuilderUnitTests
19-Aug-2019 00:16:02 [INFO] Tests run: 15, Failures: 0, Errors: 0, Skipped: 0, Time elapsed: 1.145 s - in org.springframework.data.querydsl.binding.QuerydslPredicateBuilderUnitTests
19-Aug-2019 00:16:02 [INFO] Running org.springframework.data.querydsl.binding.QuerydslBindingsUnitTests
19-Aug-2019 00:16:02 [INFO] Tests run: 22, Failures: 0, Errors: 0, Skipped: 0, Time elapsed: 0.012 s - in org.springframework.data.querydsl.binding.QuerydslBindingsUnitTests
19-Aug-2019 00:16:02 [INFO] Running org.springframework.data.querydsl.binding.QuerydslDefaultBindingUnitTests
19-Aug-2019 00:16:02 [INFO] Tests run: 5, Failures: 0, Errors: 0, Skipped: 0, Time elapsed: 0.001 s - in org.springframework.data.querydsl.binding.QuerydslDefaultBindingUnitTests
19-Aug-2019 00:16:02 [INFO] Running org.springframework.data.querydsl.binding.QuerydslBindingsFactoryUnitTests
19-Aug-2019 00:16:02 [INFO] Tests run: 3, Failures: 0, Errors: 0, Skipped: 0, Time elapsed: 0.039 s - in org.springframework.data.querydsl.binding.QuerydslBindingsFactoryUnitTests
19-Aug-2019 00:16:02 [INFO] Running org.springframework.data.querydsl.QSortUnitTests
19-Aug-2019 00:16:02 [INFO] Tests run: 12, Failures: 0, Errors: 0, Skipped: 0, Time elapsed: 0.037 s - in org.springframework.data.querydsl.QSortUnitTests
19-Aug-2019 00:16:02 [INFO] Running org.springframework.data.querydsl.QPageRequestUnitTests
19-Aug-2019 00:16:02 [INFO] Tests run: 8, Failures: 0, Errors: 0, Skipped: 0, Time elapsed: 0 s - in org.springframework.data.querydsl.QPageRequestUnitTests
19-Aug-2019 00:16:02 [INFO] Running org.springframework.data.querydsl.QuerydslUtilsUnitTests
19-Aug-2019 00:16:02 [INFO] Tests run: 2, Failures: 0, Errors: 0, Skipped: 0, Time elapsed: 0 s - in org.springframework.data.querydsl.QuerydslUtilsUnitTests
19-Aug-2019 00:16:02 [INFO] Running org.springframework.data.querydsl.QuerydslRepositoryInvokerAdapterUnitTests
19-Aug-2019 00:16:02 [INFO] Tests run: 3, Failures: 0, Errors: 0, Skipped: 0, Time elapsed: 0.015 s - in org.springframework.data.querydsl.QuerydslRepositoryInvokerAdapterUnitTests
19-Aug-2019 00:16:02 [INFO] Running org.springframework.data.projection.SpelEvaluatingMethodInterceptorUnitTests
19-Aug-2019 00:16:02 [INFO] Tests run: 6, Failures: 0, Errors: 0, Skipped: 0, Time elapsed: 0.013 s - in org.springframework.data.projection.SpelEvaluatingMethodInterceptorUnitTests
19-Aug-2019 00:16:02 [INFO] Running org.springframework.data.projection.ProjectionIntegrationTests
19-Aug-2019 00:16:02 [INFO] Tests run: 1, Failures: 0, Errors: 0, Skipped: 0, Time elapsed: 0.02 s - in org.springframework.data.projection.ProjectionIntegrationTests
19-Aug-2019 00:16:02 [INFO] Running org.springframework.data.projection.SpelAwareProxyProjectionFactoryUnitTests
19-Aug-2019 00:16:02 [INFO] Tests run: 5, Failures: 0, Errors: 0, Skipped: 0, Time elapsed: 0.008 s - in org.springframework.data.projection.SpelAwareProxyProjectionFactoryUnitTests
19-Aug-2019 00:16:02 [INFO] Running org.springframework.data.projection.MapAccessingMethodInterceptorUnitTests
19-Aug-2019 00:16:02 [INFO] Tests run: 6, Failures: 0, Errors: 0, Skipped: 0, Time elapsed: 0.004 s - in org.springframework.data.projection.MapAccessingMethodInterceptorUnitTests
19-Aug-2019 00:16:02 [INFO] Running org.springframework.data.projection.DefaultProjectionInformationUnitTests
19-Aug-2019 00:16:02 [INFO] Tests run: 6, Failures: 0, Errors: 0, Skipped: 0, Time elapsed: 0.012 s - in org.springframework.data.projection.DefaultProjectionInformationUnitTests
19-Aug-2019 00:16:02 [INFO] Running org.springframework.data.projection.DefaultMethodInvokingMethodInterceptorUnitTests
19-Aug-2019 00:16:02 [WARNING] Tests run: 2, Failures: 0, Errors: 0, Skipped: 1, Time elapsed: 0 s - in org.springframework.data.projection.DefaultMethodInvokingMethodInterceptorUnitTests
19-Aug-2019 00:16:02 [INFO] Running org.springframework.data.projection.ProxyProjectionFactoryUnitTests
19-Aug-2019 00:16:02 [INFO] Tests run: 17, Failures: 0, Errors: 0, Skipped: 0, Time elapsed: 0.018 s - in org.springframework.data.projection.ProxyProjectionFactoryUnitTests
19-Aug-2019 00:16:02 [INFO] Running org.springframework.data.projection.ProjectingMethodInterceptorUnitTests
19-Aug-2019 00:16:02 [INFO] Tests run: 9, Failures: 0, Errors: 0, Skipped: 0, Time elapsed: 0.024 s - in org.springframework.data.projection.ProjectingMethodInterceptorUnitTests
19-Aug-2019 00:16:02 [INFO] Running org.springframework.data.projection.PropertyAccessingMethodInterceptorUnitTests
19-Aug-2019 00:16:02 [INFO] Tests run: 7, Failures: 0, Errors: 0, Skipped: 0, Time elapsed: 0.008 s - in org.springframework.data.projection.PropertyAccessingMethodInterceptorUnitTests
19-Aug-2019 00:16:02 [INFO] Running org.springframework.data.geo.GeoResultUnitTests
19-Aug-2019 00:16:02 [INFO] Tests run: 4, Failures: 0, Errors: 0, Skipped: 0, Time elapsed: 0.008 s - in org.springframework.data.geo.GeoResultUnitTests
19-Aug-2019 00:16:02 [INFO] Running org.springframework.data.geo.GeoModuleIntegrationTests
19-Aug-2019 00:16:02 [INFO] Tests run: 5, Failures: 0, Errors: 0, Skipped: 0, Time elapsed: 0.062 s - in org.springframework.data.geo.GeoModuleIntegrationTests
19-Aug-2019 00:16:02 [INFO] Running org.springframework.data.geo.DistanceUnitTests
19-Aug-2019 00:16:02 [INFO] Tests run: 12, Failures: 0, Errors: 0, Skipped: 0, Time elapsed: 0.002 s - in org.springframework.data.geo.DistanceUnitTests
19-Aug-2019 00:16:02 [INFO] Running org.springframework.data.geo.PointUnitTests
19-Aug-2019 00:16:02 [INFO] Tests run: 4, Failures: 0, Errors: 0, Skipped: 0, Time elapsed: 0.003 s - in org.springframework.data.geo.PointUnitTests
19-Aug-2019 00:16:02 [INFO] Running org.springframework.data.geo.PolygonUnitTests
19-Aug-2019 00:16:02 [INFO] Tests run: 5, Failures: 0, Errors: 0, Skipped: 0, Time elapsed: 0.005 s - in org.springframework.data.geo.PolygonUnitTests
19-Aug-2019 00:16:02 [INFO] Running org.springframework.data.geo.format.PointFormatterUnitTests
19-Aug-2019 00:16:02 [INFO] Tests run: 11, Failures: 0, Errors: 0, Skipped: 0, Time elapsed: 0.009 s - in org.springframework.data.geo.format.PointFormatterUnitTests
19-Aug-2019 00:16:02 [INFO] Running org.springframework.data.geo.format.DistanceFormatterUnitTests
19-Aug-2019 00:16:02 [INFO] Tests run: 19, Failures: 0, Errors: 0, Skipped: 0, Time elapsed: 0.011 s - in org.springframework.data.geo.format.DistanceFormatterUnitTests
19-Aug-2019 00:16:02 [INFO] Running org.springframework.data.geo.BoxUnitTests
19-Aug-2019 00:16:02 [INFO] Tests run: 4, Failures: 0, Errors: 0, Skipped: 0, Time elapsed: 0.003 s - in org.springframework.data.geo.BoxUnitTests
19-Aug-2019 00:16:02 [INFO] Running org.springframework.data.geo.GeoResultsUnitTests
19-Aug-2019 00:16:02 [INFO] Tests run: 2, Failures: 0, Errors: 0, Skipped: 0, Time elapsed: 0.008 s - in org.springframework.data.geo.GeoResultsUnitTests
19-Aug-2019 00:16:02 [INFO] Running org.springframework.data.geo.CircleUnitTests
19-Aug-2019 00:16:02 [INFO] Tests run: 5, Failures: 0, Errors: 0, Skipped: 0, Time elapsed: 0.002 s - in org.springframework.data.geo.CircleUnitTests
19-Aug-2019 00:16:03 [INFO]
19-Aug-2019 00:16:03 [INFO] Results:
19-Aug-2019 00:16:03 [INFO]
19-Aug-2019 00:16:03 [WARNING] Tests run: 2917, Failures: 0, Errors: 0, Skipped: 2
19-Aug-2019 00:16:03 [INFO]
19-Aug-2019 00:16:03 [INFO]
19-Aug-2019 00:16:03 [INFO] --- build-helper-maven-plugin:3.0.0:add-source (add-kotlin-source) @ spring-data-commons ---
19-Aug-2019 00:16:03 [INFO] Source directory: /opt/bamboo-home/xml-data/build-dir/SPRINGDATACMNS-COMMONSSONAR-JOB1/src/main/kotlin added.
19-Aug-2019 00:16:03 [INFO]
19-Aug-2019 00:16:03 [INFO] --- maven-jar-plugin:3.1.0:jar (default-jar) @ spring-data-commons ---
19-Aug-2019 00:16:03 [INFO] Building jar: /opt/bamboo-home/xml-data/build-dir/SPRINGDATACMNS-COMMONSSONAR-JOB1/target/spring-data-commons-2.2.0.BUILD-SNAPSHOT.jar
19-Aug-2019 00:16:03 [INFO]
19-Aug-2019 00:16:03 [INFO] >>> maven-source-plugin:3.1.0:jar (attach-sources) > generate-sources @ spring-data-commons >>>
19-Aug-2019 00:16:03 [INFO]
19-Aug-2019 00:16:03 [INFO] --- maven-enforcer-plugin:1.4.1:enforce (enforce-maven-version) @ spring-data-commons ---
19-Aug-2019 00:16:03 [INFO]
19-Aug-2019 00:16:03 [INFO] --- maven-enforcer-plugin:1.4.1:enforce (enforce-rules) @ spring-data-commons ---
19-Aug-2019 00:16:03 [INFO]
19-Aug-2019 00:16:03 [INFO] --- maven-checkstyle-plugin:3.1.0:check (default) @ spring-data-commons ---
19-Aug-2019 00:16:03 [INFO]
19-Aug-2019 00:16:03 [INFO] --- jacoco-maven-plugin:0.8.2:prepare-agent (jacoco-initialize) @ spring-data-commons ---
19-Aug-2019 00:16:03 [INFO] argLine set to -javaagent:/home/bamboo/.m2/repository/org/jacoco/org.jacoco.agent/0.8.2/org.jacoco.agent-0.8.2-runtime.jar=destfile=/opt/bamboo-home/xml-data/build-dir/SPRINGDATACMNS-COMMONSSONAR-JOB1/target/jacoco.exec
19-Aug-2019 00:16:03 [INFO]
19-Aug-2019 00:16:03 [INFO] --- lombok-maven-plugin:1.18.4.0:delombok (default) @ spring-data-commons ---
19-Aug-2019 00:16:07 [INFO] Delombok complete.
19-Aug-2019 00:16:07 [INFO]
19-Aug-2019 00:16:07 [INFO] <<< maven-source-plugin:3.1.0:jar (attach-sources) < generate-sources @ spring-data-commons <<<
19-Aug-2019 00:16:07 [INFO]
19-Aug-2019 00:16:07 [INFO]
19-Aug-2019 00:16:07 [INFO] --- maven-source-plugin:3.1.0:jar (attach-sources) @ spring-data-commons ---
19-Aug-2019 00:16:07 [INFO] Building jar: /opt/bamboo-home/xml-data/build-dir/SPRINGDATACMNS-COMMONSSONAR-JOB1/target/spring-data-commons-2.2.0.BUILD-SNAPSHOT-sources.jar
19-Aug-2019 00:16:07 [INFO]
19-Aug-2019 00:16:07 [INFO] --- maven-javadoc-plugin:3.1.0:jar (package-javadoc) @ spring-data-commons ---
19-Aug-2019 00:16:09 [WARNING] Unable to find the resource '${shared.resources}/javadoc/spring-javadoc.css'. Using default Javadoc resources.
19-Aug-2019 00:16:14 [INFO]
19-Aug-2019 00:16:14 100 warnings
19-Aug-2019 00:16:14 [WARNING] Javadoc Warnings
19-Aug-2019 00:16:14 [WARNING] /opt/bamboo-home/xml-data/build-dir/SPRINGDATACMNS-COMMONSSONAR-JOB1/target/generated-sources/delombok/org/springframework/data/spel/EvaluationContextProvider.java:45: warning - @return tag has no arguments.
19-Aug-2019 00:16:14 [WARNING] /opt/bamboo-home/xml-data/build-dir/SPRINGDATACMNS-COMMONSSONAR-JOB1/target/generated-sources/delombok/org/springframework/data/repository/CrudRepository.java:78: warning - @return tag has no arguments.
19-Aug-2019 00:16:14 [WARNING] /opt/bamboo-home/xml-data/build-dir/SPRINGDATACMNS-COMMONSSONAR-JOB1/target/generated-sources/delombok/org/springframework/data/repository/RepositoryDefinition.java:47: warning - @return tag has no arguments.
19-Aug-2019 00:16:14 [WARNING] /opt/bamboo-home/xml-data/build-dir/SPRINGDATACMNS-COMMONSSONAR-JOB1/target/generated-sources/delombok/org/springframework/data/repository/RepositoryDefinition.java:55: warning - @return tag has no arguments.
19-Aug-2019 00:16:14 [WARNING] /opt/bamboo-home/xml-data/build-dir/SPRINGDATACMNS-COMMONSSONAR-JOB1/target/generated-sources/delombok/org/springframework/data/mapping/Alias.java:121: warning - @return tag has no arguments.
19-Aug-2019 00:16:14 [WARNING] /opt/bamboo-home/xml-data/build-dir/SPRINGDATACMNS-COMMONSSONAR-JOB1/target/generated-sources/delombok/org/springframework/data/mapping/PersistentEntity.java:215: warning - @return tag has no arguments.
19-Aug-2019 00:16:14 [WARNING] /opt/bamboo-home/xml-data/build-dir/SPRINGDATACMNS-COMMONSSONAR-JOB1/target/generated-sources/delombok/org/springframework/data/mapping/PersistentEntity.java:222: warning - @return tag has no arguments.
19-Aug-2019 00:16:14 [WARNING] /opt/bamboo-home/xml-data/build-dir/SPRINGDATACMNS-COMMONSSONAR-JOB1/target/generated-sources/delombok/org/springframework/data/mapping/PersistentEntity.java:318: warning - @return tag has no arguments.
19-Aug-2019 00:16:14 [WARNING] /opt/bamboo-home/xml-data/build-dir/SPRINGDATACMNS-COMMONSSONAR-JOB1/target/generated-sources/delombok/org/springframework/data/mapping/PersistentEntity.java:327: warning - @return tag has no arguments.
19-Aug-2019 00:16:14 [WARNING] /opt/bamboo-home/xml-data/build-dir/SPRINGDATACMNS-COMMONSSONAR-JOB1/target/generated-sources/delombok/org/springframework/data/mapping/PersistentProperty.java:65: warning - @return tag has no arguments.
19-Aug-2019 00:16:14 [WARNING] /opt/bamboo-home/xml-data/build-dir/SPRINGDATACMNS-COMMONSSONAR-JOB1/target/generated-sources/delombok/org/springframework/data/mapping/PersistentProperty.java:74: warning - @return tag has no arguments.
19-Aug-2019 00:16:14 [WARNING] /opt/bamboo-home/xml-data/build-dir/SPRINGDATACMNS-COMMONSSONAR-JOB1/target/generated-sources/delombok/org/springframework/data/mapping/PersistentProperty.java:224: warning - @return tag has no arguments.
19-Aug-2019 00:16:14 [WARNING] /opt/bamboo-home/xml-data/build-dir/SPRINGDATACMNS-COMMONSSONAR-JOB1/target/generated-sources/delombok/org/springframework/data/mapping/PersistentProperty.java:231: warning - @return tag has no arguments.
19-Aug-2019 00:16:14 [WARNING] /opt/bamboo-home/xml-data/build-dir/SPRINGDATACMNS-COMMONSSONAR-JOB1/target/generated-sources/delombok/org/springframework/data/mapping/PersistentProperty.java:238: warning - @return tag has no arguments.
19-Aug-2019 00:16:14 [WARNING] /opt/bamboo-home/xml-data/build-dir/SPRINGDATACMNS-COMMONSSONAR-JOB1/target/generated-sources/delombok/org/springframework/data/mapping/PersistentProperty.java:245: warning - @return tag has no arguments.
19-Aug-2019 00:16:14 [WARNING] /opt/bamboo-home/xml-data/build-dir/SPRINGDATACMNS-COMMONSSONAR-JOB1/target/generated-sources/delombok/org/springframework/data/mapping/PersistentProperty.java:252: warning - @return tag has no arguments.
19-Aug-2019 00:16:14 [WARNING] /opt/bamboo-home/xml-data/build-dir/SPRINGDATACMNS-COMMONSSONAR-JOB1/target/generated-sources/delombok/org/springframework/data/mapping/PersistentProperty.java:260: warning - @return tag has no arguments.
19-Aug-2019 00:16:14 [WARNING] /opt/bamboo-home/xml-data/build-dir/SPRINGDATACMNS-COMMONSSONAR-JOB1/target/generated-sources/delombok/org/springframework/data/mapping/PersistentProperty.java:270: warning - @return tag has no arguments.
19-Aug-2019 00:16:14 [WARNING] /opt/bamboo-home/xml-data/build-dir/SPRINGDATACMNS-COMMONSSONAR-JOB1/target/generated-sources/delombok/org/springframework/data/mapping/PersistentProperty.java:277: warning - @return tag has no arguments.
19-Aug-2019 00:16:14 [WARNING] /opt/bamboo-home/xml-data/build-dir/SPRINGDATACMNS-COMMONSSONAR-JOB1/target/generated-sources/delombok/org/springframework/data/mapping/PersistentProperty.java:310: warning - @return tag has no arguments.
19-Aug-2019 00:16:14 [WARNING] /opt/bamboo-home/xml-data/build-dir/SPRINGDATACMNS-COMMONSSONAR-JOB1/target/generated-sources/delombok/org/springframework/data/mapping/PersistentProperty.java:368: warning - @return tag has no arguments.
19-Aug-2019 00:16:14 [WARNING] /opt/bamboo-home/xml-data/build-dir/SPRINGDATACMNS-COMMONSSONAR-JOB1/target/generated-sources/delombok/org/springframework/data/mapping/PersistentProperty.java:378: warning - @return tag has no arguments.
19-Aug-2019 00:16:14 [WARNING] /opt/bamboo-home/xml-data/build-dir/SPRINGDATACMNS-COMMONSSONAR-JOB1/target/generated-sources/delombok/org/springframework/data/mapping/PersistentPropertyAccessor.java:109: warning - @return tag has no arguments.
19-Aug-2019 00:16:14 [WARNING] /opt/bamboo-home/xml-data/build-dir/SPRINGDATACMNS-COMMONSSONAR-JOB1/target/generated-sources/delombok/org/springframework/data/mapping/PersistentPropertyAccessor.java:125: warning - @return tag has no arguments.
19-Aug-2019 00:16:14 [WARNING] /opt/bamboo-home/xml-data/build-dir/SPRINGDATACMNS-COMMONSSONAR-JOB1/target/generated-sources/delombok/org/springframework/data/mapping/PersistentPropertyPath.java:35: warning - @return tag has no arguments.
19-Aug-2019 00:16:14 [WARNING] /opt/bamboo-home/xml-data/build-dir/SPRINGDATACMNS-COMMONSSONAR-JOB1/target/generated-sources/delombok/org/springframework/data/mapping/PersistentPropertyPath.java:45: warning - @return tag has no arguments.
19-Aug-2019 00:16:14 [WARNING] /opt/bamboo-home/xml-data/build-dir/SPRINGDATACMNS-COMMONSSONAR-JOB1/target/generated-sources/delombok/org/springframework/data/mapping/PersistentPropertyPath.java:54: warning - @return tag has no arguments.
19-Aug-2019 00:16:14 [WARNING] /opt/bamboo-home/xml-data/build-dir/SPRINGDATACMNS-COMMONSSONAR-JOB1/target/generated-sources/delombok/org/springframework/data/mapping/PersistentPropertyPath.java:65: warning - @return tag has no arguments.
19-Aug-2019 00:16:14 [WARNING] /opt/bamboo-home/xml-data/build-dir/SPRINGDATACMNS-COMMONSSONAR-JOB1/target/generated-sources/delombok/org/springframework/data/mapping/PersistentPropertyPath.java:75: warning - @return tag has no arguments.
19-Aug-2019 00:16:14 [WARNING] /opt/bamboo-home/xml-data/build-dir/SPRINGDATACMNS-COMMONSSONAR-JOB1/target/generated-sources/delombok/org/springframework/data/mapping/PersistentPropertyPath.java:96: warning - @return tag has no arguments.
19-Aug-2019 00:16:14 [WARNING] /opt/bamboo-home/xml-data/build-dir/SPRINGDATACMNS-COMMONSSONAR-JOB1/target/generated-sources/delombok/org/springframework/data/mapping/PersistentPropertyPath.java:105: warning - @return tag has no arguments.
19-Aug-2019 00:16:14 [WARNING] /opt/bamboo-home/xml-data/build-dir/SPRINGDATACMNS-COMMONSSONAR-JOB1/target/generated-sources/delombok/org/springframework/data/mapping/PersistentPropertyPath.java:115: warning - @return tag has no arguments.
19-Aug-2019 00:16:14 [WARNING] /opt/bamboo-home/xml-data/build-dir/SPRINGDATACMNS-COMMONSSONAR-JOB1/target/generated-sources/delombok/org/springframework/data/mapping/PersistentPropertyPath.java:124: warning - @return tag has no arguments.
19-Aug-2019 00:16:14 [WARNING] /opt/bamboo-home/xml-data/build-dir/SPRINGDATACMNS-COMMONSSONAR-JOB1/target/generated-sources/delombok/org/springframework/data/mapping/PersistentPropertyPath.java:131: warning - @return tag has no arguments.
19-Aug-2019 00:16:14 [WARNING] /opt/bamboo-home/xml-data/build-dir/SPRINGDATACMNS-COMMONSSONAR-JOB1/target/generated-sources/delombok/org/springframework/data/util/Streamable.java:60: warning - @return tag has no arguments.
19-Aug-2019 00:16:14 [WARNING] /opt/bamboo-home/xml-data/build-dir/SPRINGDATACMNS-COMMONSSONAR-JOB1/target/generated-sources/delombok/org/springframework/data/util/Streamable.java:70: warning - @return tag has no arguments.
19-Aug-2019 00:16:14 [WARNING] /opt/bamboo-home/xml-data/build-dir/SPRINGDATACMNS-COMMONSSONAR-JOB1/target/generated-sources/delombok/org/springframework/data/util/Streamable.java:97: warning - @return tag has no arguments.
19-Aug-2019 00:16:14 [WARNING] /opt/bamboo-home/xml-data/build-dir/SPRINGDATACMNS-COMMONSSONAR-JOB1/target/generated-sources/delombok/org/springframework/data/util/Streamable.java:111: warning - @return tag has no arguments.
19-Aug-2019 00:16:14 [WARNING] /opt/bamboo-home/xml-data/build-dir/SPRINGDATACMNS-COMMONSSONAR-JOB1/target/generated-sources/delombok/org/springframework/data/util/Streamable.java:125: warning - @return tag has no arguments.
19-Aug-2019 00:16:14 [WARNING] /opt/bamboo-home/xml-data/build-dir/SPRINGDATACMNS-COMMONSSONAR-JOB1/target/generated-sources/delombok/org/springframework/data/util/Streamable.java:137: warning - @return tag has no arguments.
19-Aug-2019 00:16:14 [WARNING] /opt/bamboo-home/xml-data/build-dir/SPRINGDATACMNS-COMMONSSONAR-JOB1/target/generated-sources/delombok/org/springframework/data/util/Streamable.java:148: warning - @return tag has no arguments.
19-Aug-2019 00:16:14 [WARNING] /opt/bamboo-home/xml-data/build-dir/SPRINGDATACMNS-COMMONSSONAR-JOB1/target/generated-sources/delombok/org/springframework/data/util/Streamable.java:232: warning - @return tag has no arguments.
19-Aug-2019 00:16:14 [WARNING] /opt/bamboo-home/xml-data/build-dir/SPRINGDATACMNS-COMMONSSONAR-JOB1/target/generated-sources/delombok/org/springframework/data/util/Streamable.java:243: warning - @return tag has no arguments.
19-Aug-2019 00:16:14 [WARNING] /opt/bamboo-home/xml-data/build-dir/SPRINGDATACMNS-COMMONSSONAR-JOB1/target/generated-sources/delombok/org/springframework/data/mapping/PersistentPropertyPaths.java:37: warning - @return tag has no arguments.
19-Aug-2019 00:16:14 [WARNING] /opt/bamboo-home/xml-data/build-dir/SPRINGDATACMNS-COMMONSSONAR-JOB1/target/generated-sources/delombok/org/springframework/data/mapping/PersistentPropertyPaths.java:45: warning - @return tag has no arguments.
19-Aug-2019 00:16:14 [WARNING] /opt/bamboo-home/xml-data/build-dir/SPRINGDATACMNS-COMMONSSONAR-JOB1/target/generated-sources/delombok/org/springframework/data/mapping/PersistentPropertyPaths.java:53: warning - @return tag has no arguments.
19-Aug-2019 00:16:14 [WARNING] /opt/bamboo-home/xml-data/build-dir/SPRINGDATACMNS-COMMONSSONAR-JOB1/target/generated-sources/delombok/org/springframework/data/mapping/PersistentPropertyPaths.java:29: warning - @soundtrack is an unknown tag.
19-Aug-2019 00:16:14 [WARNING] /opt/bamboo-home/xml-data/build-dir/SPRINGDATACMNS-COMMONSSONAR-JOB1/target/generated-sources/delombok/org/springframework/data/mapping/PreferredConstructor.java:73: warning - @return tag has no arguments.
19-Aug-2019 00:16:14 [WARNING] /opt/bamboo-home/xml-data/build-dir/SPRINGDATACMNS-COMMONSSONAR-JOB1/target/generated-sources/delombok/org/springframework/data/mapping/PreferredConstructor.java:82: warning - @return tag has no arguments.
19-Aug-2019 00:16:14 [WARNING] /opt/bamboo-home/xml-data/build-dir/SPRINGDATACMNS-COMMONSSONAR-JOB1/target/generated-sources/delombok/org/springframework/data/mapping/PreferredConstructor.java:92: warning - @return tag has no arguments.
19-Aug-2019 00:16:14 [WARNING] /opt/bamboo-home/xml-data/build-dir/SPRINGDATACMNS-COMMONSSONAR-JOB1/target/generated-sources/delombok/org/springframework/data/mapping/PreferredConstructor.java:102: warning - @return tag has no arguments.
19-Aug-2019 00:16:14 [WARNING] /opt/bamboo-home/xml-data/build-dir/SPRINGDATACMNS-COMMONSSONAR-JOB1/target/generated-sources/delombok/org/springframework/data/mapping/PreferredConstructor.java:111: warning - @return tag has no arguments.
19-Aug-2019 00:16:14 [WARNING] /opt/bamboo-home/xml-data/build-dir/SPRINGDATACMNS-COMMONSSONAR-JOB1/target/generated-sources/delombok/org/springframework/data/mapping/PreferredConstructor.java:122: warning - @return tag has no arguments.
19-Aug-2019 00:16:14 [WARNING] /opt/bamboo-home/xml-data/build-dir/SPRINGDATACMNS-COMMONSSONAR-JOB1/target/generated-sources/delombok/org/springframework/data/mapping/PreferredConstructor.java:156: warning - @return tag has no arguments.
19-Aug-2019 00:16:14 [WARNING] /opt/bamboo-home/xml-data/build-dir/SPRINGDATACMNS-COMMONSSONAR-JOB1/target/generated-sources/delombok/org/springframework/data/mapping/PreferredConstructor.java:221: warning - @return tag has no arguments.
19-Aug-2019 00:16:14 [WARNING] /opt/bamboo-home/xml-data/build-dir/SPRINGDATACMNS-COMMONSSONAR-JOB1/target/generated-sources/delombok/org/springframework/data/mapping/PreferredConstructor.java:230: warning - @return tag has no arguments.
19-Aug-2019 00:16:14 [WARNING] /opt/bamboo-home/xml-data/build-dir/SPRINGDATACMNS-COMMONSSONAR-JOB1/target/generated-sources/delombok/org/springframework/data/mapping/PreferredConstructor.java:239: warning - @return tag has no arguments.
19-Aug-2019 00:16:14 [WARNING] /opt/bamboo-home/xml-data/build-dir/SPRINGDATACMNS-COMMONSSONAR-JOB1/target/generated-sources/delombok/org/springframework/data/mapping/PreferredConstructor.java:248: warning - @return tag has no arguments.
19-Aug-2019 00:16:14 [WARNING] /opt/bamboo-home/xml-data/build-dir/SPRINGDATACMNS-COMMONSSONAR-JOB1/target/generated-sources/delombok/org/springframework/data/mapping/PreferredConstructor.java:257: warning - @return tag has no arguments.
19-Aug-2019 00:16:14 [WARNING] /opt/bamboo-home/xml-data/build-dir/SPRINGDATACMNS-COMMONSSONAR-JOB1/target/generated-sources/delombok/org/springframework/data/mapping/PropertyPath.java:138: warning - @return tag has no arguments.
19-Aug-2019 00:16:14 [WARNING] /opt/bamboo-home/xml-data/build-dir/SPRINGDATACMNS-COMMONSSONAR-JOB1/target/generated-sources/delombok/org/springframework/data/mapping/PropertyPath.java:159: warning - @return tag has no arguments.
19-Aug-2019 00:16:14 [WARNING] /opt/bamboo-home/xml-data/build-dir/SPRINGDATACMNS-COMMONSSONAR-JOB1/target/generated-sources/delombok/org/springframework/data/mapping/PropertyPath.java:168: warning - @return tag has no arguments.
19-Aug-2019 00:16:14 [WARNING] /opt/bamboo-home/xml-data/build-dir/SPRINGDATACMNS-COMMONSSONAR-JOB1/target/generated-sources/delombok/org/springframework/data/mapping/PropertyPath.java:180: warning - @return tag has no arguments.
19-Aug-2019 00:16:14 [WARNING] /opt/bamboo-home/xml-data/build-dir/SPRINGDATACMNS-COMMONSSONAR-JOB1/target/generated-sources/delombok/org/springframework/data/mapping/PropertyPath.java:243: warning - @return tag has no arguments.
19-Aug-2019 00:16:14 [WARNING] /opt/bamboo-home/xml-data/build-dir/SPRINGDATACMNS-COMMONSSONAR-JOB1/target/generated-sources/delombok/org/springframework/data/mapping/PropertyPath.java:256: warning - @return tag has no arguments.
19-Aug-2019 00:16:14 [WARNING] /opt/bamboo-home/xml-data/build-dir/SPRINGDATACMNS-COMMONSSONAR-JOB1/target/generated-sources/delombok/org/springframework/data/mapping/PropertyReferenceException.java:123: warning - @return tag has no arguments.
19-Aug-2019 00:16:14 [WARNING] /opt/bamboo-home/xml-data/build-dir/SPRINGDATACMNS-COMMONSSONAR-JOB1/target/generated-sources/delombok/org/springframework/data/mapping/PropertyReferenceException.java:134: warning - @return tag has no arguments.
19-Aug-2019 00:16:14 [WARNING] /opt/bamboo-home/xml-data/build-dir/SPRINGDATACMNS-COMMONSSONAR-JOB1/target/generated-sources/delombok/org/springframework/data/mapping/TargetAwareIdentifierAccessor.java:28: warning - @soundtrack is an unknown tag.
19-Aug-2019 00:16:14 [WARNING] /opt/bamboo-home/xml-data/build-dir/SPRINGDATACMNS-COMMONSSONAR-JOB1/target/generated-sources/delombok/org/springframework/data/mapping/TraversalContext.java:50: warning - @return tag has no arguments.
19-Aug-2019 00:16:14 [WARNING] /opt/bamboo-home/xml-data/build-dir/SPRINGDATACMNS-COMMONSSONAR-JOB1/target/generated-sources/delombok/org/springframework/data/mapping/TraversalContext.java:68: warning - @return tag has no arguments.
19-Aug-2019 00:16:14 [WARNING] /opt/bamboo-home/xml-data/build-dir/SPRINGDATACMNS-COMMONSSONAR-JOB1/target/generated-sources/delombok/org/springframework/data/mapping/TraversalContext.java:81: warning - @return tag has no arguments.
19-Aug-2019 00:16:14 [WARNING] /opt/bamboo-home/xml-data/build-dir/SPRINGDATACMNS-COMMONSSONAR-JOB1/target/generated-sources/delombok/org/springframework/data/mapping/TraversalContext.java:94: warning - @return tag has no arguments.
19-Aug-2019 00:16:14 [WARNING] /opt/bamboo-home/xml-data/build-dir/SPRINGDATACMNS-COMMONSSONAR-JOB1/target/generated-sources/delombok/org/springframework/data/mapping/TraversalContext.java:106: warning - @return tag has no arguments.
19-Aug-2019 00:16:14 [WARNING] /opt/bamboo-home/xml-data/build-dir/SPRINGDATACMNS-COMMONSSONAR-JOB1/target/generated-sources/delombok/org/springframework/data/mapping/TraversalContext.java:121: warning - @return tag has no arguments.
19-Aug-2019 00:16:14 [WARNING] /opt/bamboo-home/xml-data/build-dir/SPRINGDATACMNS-COMMONSSONAR-JOB1/target/generated-sources/delombok/org/springframework/data/mapping/TraversalContext.java:39: warning - @soundtrack is an unknown tag.
19-Aug-2019 00:16:14 [WARNING] /opt/bamboo-home/xml-data/build-dir/SPRINGDATACMNS-COMMONSSONAR-JOB1/target/generated-sources/delombok/org/springframework/data/repository/core/EntityInformation.java:36: warning - @return tag has no arguments.
19-Aug-2019 00:16:14 [WARNING] /opt/bamboo-home/xml-data/build-dir/SPRINGDATACMNS-COMMONSSONAR-JOB1/target/generated-sources/delombok/org/springframework/data/repository/core/EntityInformation.java:45: warning - @return tag has no arguments.
19-Aug-2019 00:16:14 [WARNING] /opt/bamboo-home/xml-data/build-dir/SPRINGDATACMNS-COMMONSSONAR-JOB1/target/generated-sources/delombok/org/springframework/data/repository/core/EntityInformation.java:73: warning - @return tag has no arguments.
19-Aug-2019 00:16:14 [WARNING] /opt/bamboo-home/xml-data/build-dir/SPRINGDATACMNS-COMMONSSONAR-JOB1/target/generated-sources/delombok/org/springframework/data/repository/core/EntityMetadata.java:30: warning - @return tag has no arguments.
19-Aug-2019 00:16:14 [WARNING] /opt/bamboo-home/xml-data/build-dir/SPRINGDATACMNS-COMMONSSONAR-JOB1/target/generated-sources/delombok/org/springframework/data/repository/core/support/AbstractRepositoryMetadata.java:69: warning - @return tag has no arguments.
19-Aug-2019 00:16:14 [WARNING] /opt/bamboo-home/xml-data/build-dir/SPRINGDATACMNS-COMMONSSONAR-JOB1/target/generated-sources/delombok/org/springframework/data/repository/core/RepositoryMetadata.java:50: warning - @return tag has no arguments.
19-Aug-2019 00:16:14 [WARNING] /opt/bamboo-home/xml-data/build-dir/SPRINGDATACMNS-COMMONSSONAR-JOB1/target/generated-sources/delombok/org/springframework/data/repository/core/RepositoryMetadata.java:59: warning - @return tag has no arguments.
19-Aug-2019 00:16:14 [WARNING] /opt/bamboo-home/xml-data/build-dir/SPRINGDATACMNS-COMMONSSONAR-JOB1/target/generated-sources/delombok/org/springframework/data/repository/core/RepositoryMetadata.java:66: warning - @return tag has no arguments.
19-Aug-2019 00:16:14 [WARNING] /opt/bamboo-home/xml-data/build-dir/SPRINGDATACMNS-COMMONSSONAR-JOB1/target/generated-sources/delombok/org/springframework/data/repository/core/RepositoryMetadata.java:73: warning - @return tag has no arguments.
19-Aug-2019 00:16:14 [WARNING] /opt/bamboo-home/xml-data/build-dir/SPRINGDATACMNS-COMMONSSONAR-JOB1/target/generated-sources/delombok/org/springframework/data/repository/core/RepositoryMetadata.java:92: warning - @return tag has no arguments.
19-Aug-2019 00:16:14 [WARNING] /opt/bamboo-home/xml-data/build-dir/SPRINGDATACMNS-COMMONSSONAR-JOB1/target/generated-sources/delombok/org/springframework/data/repository/core/CrudMethods.java:48: warning - @return tag has no arguments.
19-Aug-2019 00:16:14 [WARNING] /opt/bamboo-home/xml-data/build-dir/SPRINGDATACMNS-COMMONSSONAR-JOB1/target/generated-sources/delombok/org/springframework/data/repository/core/CrudMethods.java:64: warning - @return tag has no arguments.
19-Aug-2019 00:16:14 [WARNING] /opt/bamboo-home/xml-data/build-dir/SPRINGDATACMNS-COMMONSSONAR-JOB1/target/generated-sources/delombok/org/springframework/data/repository/core/CrudMethods.java:80: warning - @return tag has no arguments.
19-Aug-2019 00:16:14 [WARNING] /opt/bamboo-home/xml-data/build-dir/SPRINGDATACMNS-COMMONSSONAR-JOB1/target/generated-sources/delombok/org/springframework/data/repository/core/CrudMethods.java:95: warning - @return tag has no arguments.
19-Aug-2019 00:16:14 [WARNING] /opt/bamboo-home/xml-data/build-dir/SPRINGDATACMNS-COMMONSSONAR-JOB1/target/generated-sources/delombok/org/springframework/data/repository/core/support/EventPublishingRepositoryProxyPostProcessor.java:52: warning - @soundtrack is an unknown tag.
19-Aug-2019 00:16:14 [WARNING] /opt/bamboo-home/xml-data/build-dir/SPRINGDATACMNS-COMMONSSONAR-JOB1/target/generated-sources/delombok/org/springframework/data/repository/core/NamedQueries.java:33: warning - @return tag has no arguments.
19-Aug-2019 00:16:14 [WARNING] /opt/bamboo-home/xml-data/build-dir/SPRINGDATACMNS-COMMONSSONAR-JOB1/target/generated-sources/delombok/org/springframework/data/repository/core/NamedQueries.java:42: warning - @return tag has no arguments.
19-Aug-2019 00:16:14 [WARNING] /opt/bamboo-home/xml-data/build-dir/SPRINGDATACMNS-COMMONSSONAR-JOB1/target/generated-sources/delombok/org/springframework/data/repository/core/support/RepositoryFactorySupport.java:220: warning - @return tag has no arguments.
19-Aug-2019 00:16:14 [WARNING] /opt/bamboo-home/xml-data/build-dir/SPRINGDATACMNS-COMMONSSONAR-JOB1/target/generated-sources/delombok/org/springframework/data/repository/core/support/RepositoryFactorySupport.java:244: warning - @return tag has no arguments.
19-Aug-2019 00:16:14 [WARNING] /opt/bamboo-home/xml-data/build-dir/SPRINGDATACMNS-COMMONSSONAR-JOB1/target/generated-sources/delombok/org/springframework/data/repository/core/support/RepositoryFactorySupport.java:256: warning - @return tag has no arguments.
19-Aug-2019 00:16:14 [WARNING] /opt/bamboo-home/xml-data/build-dir/SPRINGDATACMNS-COMMONSSONAR-JOB1/target/generated-sources/delombok/org/springframework/data/repository/core/support/RepositoryFactorySupport.java:270: warning - @return tag has no arguments.
19-Aug-2019 00:16:14 [WARNING] /opt/bamboo-home/xml-data/build-dir/SPRINGDATACMNS-COMMONSSONAR-JOB1/target/generated-sources/delombok/org/springframework/data/repository/core/support/RepositoryFactorySupport.java:324: warning - @return tag has no arguments.
19-Aug-2019 00:16:14 [WARNING] /opt/bamboo-home/xml-data/build-dir/SPRINGDATACMNS-COMMONSSONAR-JOB1/target/generated-sources/delombok/org/springframework/data/repository/core/support/RepositoryFactorySupport.java:383: warning - @return tag has no arguments.
19-Aug-2019 00:16:14 [WARNING] /opt/bamboo-home/xml-data/build-dir/SPRINGDATACMNS-COMMONSSONAR-JOB1/target/generated-sources/delombok/org/springframework/data/repository/core/support/RepositoryFactorySupport.java:391: warning - @return tag has no arguments.
19-Aug-2019 00:16:14 [WARNING] /opt/bamboo-home/xml-data/build-dir/SPRINGDATACMNS-COMMONSSONAR-JOB1/target/generated-sources/delombok/org/springframework/data/repository/core/support/RepositoryFactorySupport.java:400: warning - @return tag has no arguments.
19-Aug-2019 00:16:14 [INFO] Building jar: /opt/bamboo-home/xml-data/build-dir/SPRINGDATACMNS-COMMONSSONAR-JOB1/target/spring-data-commons-2.2.0.BUILD-SNAPSHOT-javadoc.jar
19-Aug-2019 00:16:14 [INFO] ------------------------------------------------------------------------
19-Aug-2019 00:16:14 [INFO] BUILD SUCCESS
19-Aug-2019 00:16:14 [INFO] ------------------------------------------------------------------------
19-Aug-2019 00:16:14 [INFO] Total time: 01:10 min
19-Aug-2019 00:16:14 [INFO] Finished at: 2019-08-19T00:16:14Z
19-Aug-2019 00:16:14 [INFO] ------------------------------------------------------------------------
19-Aug-2019 00:16:14 Parsing test results under /opt/bamboo-home/xml-data/build-dir/SPRINGDATACMNS-COMMONSSONAR-JOB1...
19-Aug-2019 00:16:15 Finished task 'Sonar (preparation)' with result: Success
19-Aug-2019 00:16:15 Starting task 'SonarQube' of type 'ch.mibex.bamboo.sonar4bamboo:sonar4bamboo.maven3task'
19-Aug-2019 00:16:15
Substituting password variable: ${bamboo.sonar.token.password}
19-Aug-2019 00:16:15 SONAR4BAMBOO: Going to use executable home /opt/maven-3.5
19-Aug-2019 00:16:15
Beginning to execute external process for build 'Spring Data Commons - Spring Data Commons - Sonar - Default Job #2684 (SPRINGDATACMNS-COMMONSSONAR-JOB1-2684)'
... running command line:
/opt/maven-3.5/bin/mvn sonar:sonar -B -Dsonar.sources=target/generated-sources/delombok -Dsonar.host.url=http://sonar.af.pivotal.io:8080 -Dsonar.login=****** ... in: /opt/bamboo-home/xml-data/build-dir/SPRINGDATACMNS-COMMONSSONAR-JOB1
... using extra environment variables:
bamboo_planRepository_1_branch=master
bamboo_********_username_password=********
bamboo_signing_store_password=********
bamboo_capability_system_builder_ant_Ant_1_9=/opt/ant-1.9
bamboo_capability_system_builder_ant_Ant_1_8=/opt/ant-1.8
bamboo_planRepository_1_branchDisplayName=master
bamboo_artifactory_override_resolve_repo=libs-milestone
bamboo_capability_system_builder_node_Node_js_10_16=/opt/node-10.16/bin/node
bamboo_repository_revision_number=34c683bc57245102797f7c7d1568de1936b9b03e
MAVEN2_HOME=/opt/maven-3.5
bamboo_RIAK_BIN=/usr/sbin/riak
bamboo_buildKey=SPRINGDATACMNS-COMMONSSONAR-JOB1
bamboo_bintray_password=********
bamboo_sonar_token_password=********
bamboo_shortJobName=Default Job
bamboo_artifactory_override_resolver_password=********
bamboo_sonatype_token=RSJChaox
bamboo_capability_system_builder_gradle___gradlew=./gradlew
bamboo_buildResultsUrl=https://build.spring.io/browse/SPRINGDATACMNS-COMMONSSONAR-JOB1-2684
bamboo_capability_system_builder_mvn3_Maven_3_3=/opt/maven-3.3
bamboo_capability_system_builder_mvn3_Maven_3_2=/opt/maven-3.2
bamboo_capability_system_builder_mvn3_Maven_3_1=/opt/maven-3.1
bamboo_planRepository_repositoryUrl=git://github.com/spring-projects/spring-data-commons.git
bamboo_capability_system_builder_mvn3_Maven_3_6=/opt/maven-3.6
bamboo_agentId=286195714
bamboo_capability_system_builder_mvn3_Maven_3_5=/opt/maven-3.5
bamboo_capability_system_builder_mvn3_Maven_3_0=/opt/maven-3.0
bamboo_planRepository_revision=34c683bc57245102797f7c7d1568de1936b9b03e
bamboo_planRepository_previousRevision=34c683bc57245102797f7c7d1568de1936b9b03e
bamboo_repository_215253006_git_repositoryUrl=git://github.com/spring-projects/spring-data-commons.git
bamboo_capability_remote_build=true
bamboo_repository_branch_name=master
bamboo_sonatype_token_password=********
bamboo_sonatype_user=springsource
bamboo_scdf_acceptance_tests_password=********
JAVA_HOME=/opt/jdk-8
bamboo_planRepository_branch=master
bamboo_planRepository_1_type=gitv2
bamboo_planRepository_branchName=master
bamboo_capability_system_jdk_JDK_12=/opt/jdk-12
bamboo_capability_system_builder_gradlew_gradlew=./
bamboo_capability_system_builder_ant_Ant_1_10=/opt/ant-1.10
bamboo_repository_215253006_git_username=
bamboo_sonar_password=********
bamboo_hg_cache_directory=/opt/bamboo-home/xml-data/build-dir/_hg-repositories-cache
bamboo_planRepository_1_username=
bamboo_planRepository_type=gitv2
bamboo_git_cache_directory=/opt/bamboo-home/xml-data/build-dir/_git-repositories-cache
bamboo_build_commandline_com_atlassian_bamboo_plugins_maven_task_builder_mvn3_3=/opt/maven-3.5/bin/mvn -Djava.io.tmpdir=/tmp/SPRINGDATACMNS-COMMONSSONAR-JOB1 verify -Dbundlor.failOnWarnings=false -Djava.awt.headless=true -Dmaven.test.failure.ignore=true -B -Pci,sonarcube
bamboo_artifactory_username=buildmaster
bamboo_tmp_directory=/opt/bamboo-home/temp
bamboo_planKey=SPRINGDATACMNS-COMMONSSONAR
bamboo_repository_215253006_revision_number=34c683bc57245102797f7c7d1568de1936b9b03e
bamboo_planRepository_username=
bamboo_JDK8_HOME=/opt/jdk-8
bamboo_planRepository_1_branchName=master
bamboo_repository_215253006_name=Plan Repository
bamboo_sonar_version=5.6.3
bamboo_sonar_jdbc_password=********
bamboo_bintray_api_key_password=********
bamboo_capability_system_jdk_JDK_1_11=/opt/jdk-11
bamboo_resultsUrl=https://build.spring.io/browse/SPRINGDATACMNS-COMMONSSONAR-JOB1-2684
bamboo_capability_system_jdk_JDK_1_10=/opt/jdk-10
bamboo_build_working_directory=/opt/bamboo-home/xml-data/build-dir/SPRINGDATACMNS-COMMONSSONAR-JOB1
bamboo_planRepository_1_name=Plan Repository
bamboo_capability_system_os=ubuntu1804
bamboo_nexusPush_stagingProfile=buildmaster
bamboo_shortPlanName=Spring Data Commons - Sonar
bamboo_planRepository_name=Plan Repository
bamboo_buildNumber=2684
bamboo_planName=Spring Data Commons - Spring Data Commons - Sonar
bamboo_JDK7_HOME=/opt/jdk-7
bamboo_shortPlanKey=COMMONSSONAR
bamboo_shortJobKey=JOB1
bamboo_artifactory_password=********
bamboo_buildTimeStamp=2019-08-19T00:15:00.460Z
bamboo_repository_previous_revision_number=34c683bc57245102797f7c7d1568de1936b9b03e
bamboo_sonar_username=buildmaster
bamboo_********_password=********
M2_HOME=/opt/maven-3.5
bamboo_repository_215253006_git_branch=master
bamboo_repository_git_branch=master
bamboo_buildResultKey=SPRINGDATACMNS-COMMONSSONAR-JOB1-2684
bamboo_nexusPush_close=true
bamboo_artifactory_override_resolver_username=buildmaster
bamboo_buildPlanName=Spring Data Commons - Spring Data Commons - Sonar - Default Job
bamboo_planRepository_1_revision=34c683bc57245102797f7c7d1568de1936b9b03e
bamboo_repository_name=Plan Repository
bamboo_repository_215253006_branch_name=master
bamboo_signing_key_password=********
bamboo_repository_215253006_previous_revision_number=34c683bc57245102797f7c7d1568de1936b9b03e
bamboo_capability_system_builder_groovy_Groovy_2_5=/opt/groovy-2.5
bamboo_buildFailed=false
bamboo_capability_system_docker_executable=/usr/bin/docker
bamboo_capability_system_jdk_OpenJDK_7=/opt/jdk-7
bamboo_capability_system_builder_groovy_Groovy_2_4=/opt/groovy-2.4
bamboo_artifactory_override_deployer_username=buildmaster
bamboo_capability_system_builder_command_Bash=/bin/bash
bamboo_agentWorkingDirectory=/opt/bamboo-home/xml-data/build-dir
bamboo_capability_system_git_executable=/usr/bin/git
bamboo_repository_git_username=
bamboo_planRepository_1_previousRevision=34c683bc57245102797f7c7d1568de1936b9b03e
bamboo_capability_os_family=unix
bamboo_planRepository_branchDisplayName=master
bamboo_capability_system_builder_maven_Artifactory_Maven_3_6=/opt/maven-3.6
bamboo_capability_system_builder_maven_Artifactory_Maven_3_5=/opt/maven-3.5
bamboo_capability_system_builder_maven_Artifactory_Maven_3_3=/opt/maven-3.3
bamboo_capability_system_builder_maven_Artifactory_Maven_3_2=/opt/maven-3.2
bamboo_s3_properties=/home/bamboo/tools/s3.properties
bamboo_capability_system_builder_maven_Artifactory_Maven_3_1=/opt/maven-3.1
bamboo_artifactory_override_deploy_repo=libs-snapshot-local
bamboo_capability_system_builder_maven_Artifactory_Maven_3_0=/opt/maven-3.0
bamboo_plan_storageTag=SPRINGDATACMNS-COMMONSSONAR
bamboo_bintray_username_password=********
bamboo_repository_git_repositoryUrl=git://github.com/spring-projects/spring-data-commons.git
bamboo_working_directory=/opt/bamboo-home/xml-data/build-dir/SPRINGDATACMNS-COMMONSSONAR-JOB1
bamboo_planRepository_1_repositoryUrl=git://github.com/spring-projects/spring-data-commons.git
bamboo_capability_system_jdk_JDK_1_8=/opt/jdk-8
bamboo_artifactory_override_deployer_password=********
bamboo_capability_system_jdk_JDK_1_9=/opt/jdk-9
bamboo_capability_system_jdk_JDK_1_6=/opt/jdk-6
bamboo_sonatype_password=********
bamboo_capability_system_jdk_JDK_1_7=/opt/jdk-7
bamboo_sonar_ip=10.194.6.9
PATH=/opt/jdk-8/bin:/bin:/home/bamboo/bin:/usr/local/sbin:/usr/local/bin:/usr/sbin:/usr/bin:/sbin:/bin:/usr/games:/usr/local/games:/snap/bin:/home/bamboo/bin:/usr/local/bin
19-Aug-2019 00:16:16 [INFO] Scanning for projects...
19-Aug-2019 00:16:16 [INFO] Downloading from spring-plugins-release: https://repo.spring.io/plugins-release/org/codehaus/mojo/maven-metadata.xml
19-Aug-2019 00:16:16 [INFO] Downloading from spring-plugins-release: https://repo.spring.io/plugins-release/org/apache/maven/plugins/maven-metadata.xml
19-Aug-2019 00:16:17 [INFO] Downloaded from spring-plugins-release: https://repo.spring.io/plugins-release/org/codehaus/mojo/maven-metadata.xml (27 kB at 48 kB/s)
19-Aug-2019 00:16:17 [INFO] Downloaded from spring-plugins-release: https://repo.spring.io/plugins-release/org/apache/maven/plugins/maven-metadata.xml (19 kB at 27 kB/s)
19-Aug-2019 00:16:17 [INFO] Downloading from spring-plugins-release: https://repo.spring.io/plugins-release/org/codehaus/mojo/sonar-maven-plugin/maven-metadata.xml
19-Aug-2019 00:16:17 [INFO] Downloaded from spring-plugins-release: https://repo.spring.io/plugins-release/org/codehaus/mojo/sonar-maven-plugin/maven-metadata.xml (1.1 kB at 3.9 kB/s)
19-Aug-2019 00:16:17 [INFO]
19-Aug-2019 00:16:17 [INFO] ------------< org.springframework.data:spring-data-commons >------------
19-Aug-2019 00:16:17 [INFO] Building Spring Data Core 2.2.0.BUILD-SNAPSHOT
19-Aug-2019 00:16:17 [INFO] --------------------------------[ jar ]---------------------------------
19-Aug-2019 00:16:17 [INFO]
19-Aug-2019 00:16:17 [INFO] --- sonar-maven-plugin:3.6.0.1398:sonar (default-cli) @ spring-data-commons ---
19-Aug-2019 00:16:18 [INFO] User cache: /home/bamboo/.sonar/cache
19-Aug-2019 00:16:18 [INFO] SonarQube version: 6.7.7
19-Aug-2019 00:16:18 [INFO] Default locale: "en_US", source code encoding: "UTF-8"
19-Aug-2019 00:16:18 [INFO] Publish mode
19-Aug-2019 00:16:18 [INFO] Load global settings
19-Aug-2019 00:16:18 [INFO] Load global settings (done) | time=69ms
19-Aug-2019 00:16:18 [INFO] Server id: A7EE8CF2-11acedf5b092511
19-Aug-2019 00:16:18 [INFO] User cache: /home/bamboo/.sonar/cache
19-Aug-2019 00:16:18 [INFO] Load plugins index
19-Aug-2019 00:16:18 [INFO] Load plugins index (done) | time=42ms
19-Aug-2019 00:16:19 [INFO] Process project properties
19-Aug-2019 00:16:19 [INFO] Load project repositories
19-Aug-2019 00:16:19 [INFO] Load project repositories (done) | time=550ms
19-Aug-2019 00:16:19 [INFO] Execute project builders
19-Aug-2019 00:16:19 [INFO] Execute project builders (done) | time=1ms
19-Aug-2019 00:16:19 [INFO] Load quality profiles
19-Aug-2019 00:16:20 [INFO] Load quality profiles (done) | time=295ms
19-Aug-2019 00:16:20 [INFO] Load active rules
19-Aug-2019 00:16:20 [INFO] Load active rules (done) | time=270ms
19-Aug-2019 00:16:20 [INFO] Load metrics repository
19-Aug-2019 00:16:20 [INFO] Load metrics repository (done) | time=19ms
19-Aug-2019 00:16:20 [INFO] Project key: org.springframework.data:spring-data-commons
19-Aug-2019 00:16:20 [INFO] -------------  Scan Spring Data Core
19-Aug-2019 00:16:20 [INFO] Base dir: /opt/bamboo-home/xml-data/build-dir/SPRINGDATACMNS-COMMONSSONAR-JOB1
19-Aug-2019 00:16:20 [INFO] Working dir: /opt/bamboo-home/xml-data/build-dir/SPRINGDATACMNS-COMMONSSONAR-JOB1/target/sonar
19-Aug-2019 00:16:20 [INFO] Source paths: target/generated-sources/delombok
19-Aug-2019 00:16:20 [INFO] Test paths: src/test/java
19-Aug-2019 00:16:20 [INFO] Source encoding: UTF-8, default locale: en_US
19-Aug-2019 00:16:20 [INFO] Load server rules
19-Aug-2019 00:16:20 [INFO] Load server rules (done) | time=91ms
19-Aug-2019 00:16:20 [INFO] Index files
19-Aug-2019 00:16:20 [INFO] 749 files indexed
19-Aug-2019 00:16:20 [INFO] Quality profile for java: Spring Data
19-Aug-2019 00:16:20 [INFO] Structure101 sensor require following mandatory properties:
19-Aug-2019 00:16:20         structure101.java.classpath
19-Aug-2019 00:16:20         structure101.java.repository
19-Aug-2019 00:16:20         structure101.java.project
19-Aug-2019 00:16:20         
19-Aug-2019 00:16:20 [INFO] Structure101 sensor require following mandatory properties:
19-Aug-2019 00:16:20         structure101.java.classpath
19-Aug-2019 00:16:20         structure101.java.repository
19-Aug-2019 00:16:20         structure101.java.project
19-Aug-2019 00:16:20         
19-Aug-2019 00:16:20 [INFO] Sensor JavaSquidSensor [java]
19-Aug-2019 00:16:20 [INFO] Configured Java source version (sonar.java.source): 8
19-Aug-2019 00:16:20 [INFO] JavaClasspath initialization
19-Aug-2019 00:16:20 [INFO] JavaClasspath initialization (done) | time=12ms
19-Aug-2019 00:16:20 [INFO] JavaTestClasspath initialization
19-Aug-2019 00:16:20 [INFO] JavaTestClasspath initialization (done) | time=2ms
19-Aug-2019 00:16:21 [INFO] Java Main Files AST scan
19-Aug-2019 00:16:21 [INFO] 449 source files to be analyzed
19-Aug-2019 00:16:28 [INFO] 449/449 source files have been analyzed
19-Aug-2019 00:16:28 [WARNING] Classes not found during the analysis : [javax.el.ELResolver, javax.el.ExpressionFactory, javax.transaction.Transactional, org.aspectj.weaver.World, org.aspectj.weaver.patterns.TypePattern, scala.Predef$$less, scala.Predef$$less$colon]
19-Aug-2019 00:16:28 [INFO] Java Main Files AST scan (done) | time=7467ms
19-Aug-2019 00:16:28 [INFO] Java Test Files AST scan
19-Aug-2019 00:16:28 [INFO] 300 source files to be analyzed
19-Aug-2019 00:16:37 [INFO] 300/300 source files have been analyzed
19-Aug-2019 00:16:37 [WARNING] Classes not found during the analysis : [javax.servlet.http.HttpUpgradeHandler, scala.Predef$$less, scala.Predef$$less$colon, scala.collection.parallel.mutable.ParHashMapCombiner$table]
19-Aug-2019 00:16:37 [INFO] Java Test Files AST scan (done) | time=8655ms
19-Aug-2019 00:16:37 [INFO] Sensor JavaSquidSensor [java] (done) | time=16485ms
19-Aug-2019 00:16:37 [INFO] Sensor Sonar-Sonargraph-Plugin [3.5] [Sonargraph]
19-Aug-2019 00:16:37 [INFO] ----------------------------------------------------------------
19-Aug-2019 00:16:37 [INFO] Sonargraph: Skipping project Spring Data Core [org.springframework.data:spring-data-commons], since no Sonargraph rules are activated in current SonarQube quality profile.
19-Aug-2019 00:16:37 [INFO] ----------------------------------------------------------------
19-Aug-2019 00:16:37 [INFO] Sensor Sonar-Sonargraph-Plugin [3.5] [Sonargraph] (done) | time=1ms
19-Aug-2019 00:16:37 [INFO] Sensor CoberturaSensor [cobertura]
19-Aug-2019 00:16:37 [WARNING] Cobertura report not found at /opt/bamboo-home/xml-data/build-dir/SPRINGDATACMNS-COMMONSSONAR-JOB1/target/site/cobertura/coverage.xml
19-Aug-2019 00:16:37 [INFO] Sensor CoberturaSensor [cobertura] (done) | time=0ms
19-Aug-2019 00:16:37 [INFO] Sensor PmdSensor [pmd]
19-Aug-2019 00:16:37 [INFO] Execute PMD 6.10.0
19-Aug-2019 00:16:37 [INFO] Java version: 1.8
19-Aug-2019 00:16:37 [INFO] PMD configuration: /opt/bamboo-home/xml-data/build-dir/SPRINGDATACMNS-COMMONSSONAR-JOB1/target/sonar/pmd.xml
19-Aug-2019 00:16:43 [INFO] PMD configuration: /opt/bamboo-home/xml-data/build-dir/SPRINGDATACMNS-COMMONSSONAR-JOB1/target/sonar/pmd-unit-tests.xml
19-Aug-2019 00:16:43 [INFO] Execute PMD 6.10.0 (done) | time=6602ms
19-Aug-2019 00:16:43 [INFO] Sensor PmdSensor [pmd] (done) | time=6626ms
19-Aug-2019 00:16:43 [INFO] Sensor FindBugs Sensor [findbugs]
19-Aug-2019 00:16:44 [INFO] Loading findbugs plugin: /opt/bamboo-home/xml-data/build-dir/SPRINGDATACMNS-COMMONSSONAR-JOB1/target/sonar/findbugs/findsecbugs-plugin.jar
19-Aug-2019 00:16:44 [INFO] Findbugs output report: /opt/bamboo-home/xml-data/build-dir/SPRINGDATACMNS-COMMONSSONAR-JOB1/target/sonar/findbugs-result.xml
19-Aug-2019 00:17:00 The following classes needed for analysis were missing:
19-Aug-2019 00:17:00   apply
19-Aug-2019 00:17:00   test
19-Aug-2019 00:17:00   convert
19-Aug-2019 00:17:00   get
19-Aug-2019 00:17:00   getEvaluationContext
19-Aug-2019 00:17:00   accept
19-Aug-2019 00:17:00   applyAsInt
19-Aug-2019 00:17:00   call
19-Aug-2019 00:17:00   getLookups
19-Aug-2019 00:17:00   getUserType
19-Aug-2019 00:17:00   doWith
19-Aug-2019 00:17:00   doWithPersistentProperty
19-Aug-2019 00:17:00   matches
19-Aug-2019 00:17:00   run
19-Aug-2019 00:17:00   iterator
19-Aug-2019 00:17:00   match
19-Aug-2019 00:17:00   toModel
19-Aug-2019 00:17:00   applyAsDouble
19-Aug-2019 00:17:00   getJavaType
19-Aug-2019 00:17:00   doWithAssociation
19-Aug-2019 00:17:00   bind
19-Aug-2019 00:17:00 [WARNING] An error occurs while processing the bug instance [BugInstance type=NP_NULL_ON_SOME_PATH_FROM_RETURN_VALUE, class=org.springframework.data.mapping.model.ClassGeneratingPropertyAccessorFactory, line=1420]
19-Aug-2019 00:17:00 java.lang.IllegalArgumentException: 1420 is not a valid line for pointer. File target/generated-sources/delombok/org/springframework/data/mapping/model/ClassGeneratingPropertyAccessorFactory.java has 1135 line(s)
19-Aug-2019 00:17:00         at org.sonar.api.internal.google.common.base.Preconditions.checkArgument(Preconditions.java:145)
19-Aug-2019 00:17:00         at org.sonar.api.batch.fs.internal.DefaultInputFile.checkValid(DefaultInputFile.java:309)
19-Aug-2019 00:17:00         at org.sonar.api.batch.fs.internal.DefaultInputFile.newPointer(DefaultInputFile.java:246)
19-Aug-2019 00:17:00         at org.sonar.api.batch.fs.internal.DefaultInputFile.selectLine(DefaultInputFile.java:269)
19-Aug-2019 00:17:00         at org.sonar.plugins.findbugs.FindbugsSensor.insertIssue(FindbugsSensor.java:217)
19-Aug-2019 00:17:00         at org.sonar.plugins.findbugs.FindbugsSensor.execute(FindbugsSensor.java:148)
19-Aug-2019 00:17:00         at org.sonar.scanner.sensor.SensorWrapper.analyse(SensorWrapper.java:53)
19-Aug-2019 00:17:00         at org.sonar.scanner.phases.SensorsExecutor.executeSensor(SensorsExecutor.java:88)
19-Aug-2019 00:17:00         at org.sonar.scanner.phases.SensorsExecutor.execute(SensorsExecutor.java:82)
19-Aug-2019 00:17:00         at org.sonar.scanner.phases.SensorsExecutor.execute(SensorsExecutor.java:68)
19-Aug-2019 00:17:00         at org.sonar.scanner.phases.AbstractPhaseExecutor.execute(AbstractPhaseExecutor.java:88)
19-Aug-2019 00:17:00         at org.sonar.scanner.scan.ModuleScanContainer.doAfterStart(ModuleScanContainer.java:177)
19-Aug-2019 00:17:00         at org.sonar.core.platform.ComponentContainer.startComponents(ComponentContainer.java:135)
19-Aug-2019 00:17:00         at org.sonar.core.platform.ComponentContainer.execute(ComponentContainer.java:121)
19-Aug-2019 00:17:00         at org.sonar.scanner.scan.ProjectScanContainer.scan(ProjectScanContainer.java:291)
19-Aug-2019 00:17:00         at org.sonar.scanner.scan.ProjectScanContainer.scanRecursively(ProjectScanContainer.java:286)
19-Aug-2019 00:17:00         at org.sonar.scanner.scan.ProjectScanContainer.doAfterStart(ProjectScanContainer.java:264)
19-Aug-2019 00:17:00         at org.sonar.core.platform.ComponentContainer.startComponents(ComponentContainer.java:135)
19-Aug-2019 00:17:00         at org.sonar.core.platform.ComponentContainer.execute(ComponentContainer.java:121)
19-Aug-2019 00:17:00         at org.sonar.scanner.task.ScanTask.execute(ScanTask.java:48)
19-Aug-2019 00:17:00         at org.sonar.scanner.task.TaskContainer.doAfterStart(TaskContainer.java:84)
19-Aug-2019 00:17:00         at org.sonar.core.platform.ComponentContainer.startComponents(ComponentContainer.java:135)
19-Aug-2019 00:17:00         at org.sonar.core.platform.ComponentContainer.execute(ComponentContainer.java:121)
19-Aug-2019 00:17:00         at org.sonar.scanner.bootstrap.GlobalContainer.executeTask(GlobalContainer.java:121)
19-Aug-2019 00:17:00         at org.sonar.batch.bootstrapper.Batch.doExecuteTask(Batch.java:116)
19-Aug-2019 00:17:00         at org.sonar.batch.bootstrapper.Batch.execute(Batch.java:71)
19-Aug-2019 00:17:00         at org.sonarsource.scanner.api.internal.batch.BatchIsolatedLauncher.execute(BatchIsolatedLauncher.java:46)
19-Aug-2019 00:17:00         at sun.reflect.NativeMethodAccessorImpl.invoke0(Native Method)
19-Aug-2019 00:17:00         at sun.reflect.NativeMethodAccessorImpl.invoke(NativeMethodAccessorImpl.java:62)
19-Aug-2019 00:17:00         at sun.reflect.DelegatingMethodAccessorImpl.invoke(DelegatingMethodAccessorImpl.java:43)
19-Aug-2019 00:17:00         at java.lang.reflect.Method.invoke(Method.java:498)
19-Aug-2019 00:17:00         at org.sonarsource.scanner.api.internal.IsolatedLauncherProxy.invoke(IsolatedLauncherProxy.java:60)
19-Aug-2019 00:17:00         at com.sun.proxy.$Proxy24.execute(Unknown Source)
19-Aug-2019 00:17:00         at org.sonarsource.scanner.api.EmbeddedScanner.doExecute(EmbeddedScanner.java:185)
19-Aug-2019 00:17:00         at org.sonarsource.scanner.api.EmbeddedScanner.execute(EmbeddedScanner.java:137)
19-Aug-2019 00:17:00         at org.sonarsource.scanner.maven.bootstrap.ScannerBootstrapper.execute(ScannerBootstrapper.java:65)
19-Aug-2019 00:17:00         at org.sonarsource.scanner.maven.SonarQubeMojo.execute(SonarQubeMojo.java:104)
19-Aug-2019 00:17:00         at org.apache.maven.plugin.DefaultBuildPluginManager.executeMojo(DefaultBuildPluginManager.java:137)
19-Aug-2019 00:17:00         at org.apache.maven.lifecycle.internal.MojoExecutor.execute(MojoExecutor.java:208)
19-Aug-2019 00:17:00         at org.apache.maven.lifecycle.internal.MojoExecutor.execute(MojoExecutor.java:154)
19-Aug-2019 00:17:00         at org.apache.maven.lifecycle.internal.MojoExecutor.execute(MojoExecutor.java:146)
19-Aug-2019 00:17:00         at org.apache.maven.lifecycle.internal.LifecycleModuleBuilder.buildProject(LifecycleModuleBuilder.java:117)
19-Aug-2019 00:17:00         at org.apache.maven.lifecycle.internal.LifecycleModuleBuilder.buildProject(LifecycleModuleBuilder.java:81)
19-Aug-2019 00:17:00         at org.apache.maven.lifecycle.internal.builder.singlethreaded.SingleThreadedBuilder.build(SingleThreadedBuilder.java:56)
19-Aug-2019 00:17:00         at org.apache.maven.lifecycle.internal.LifecycleStarter.execute(LifecycleStarter.java:128)
19-Aug-2019 00:17:00         at org.apache.maven.DefaultMaven.doExecute(DefaultMaven.java:305)
19-Aug-2019 00:17:00         at org.apache.maven.DefaultMaven.doExecute(DefaultMaven.java:192)
19-Aug-2019 00:17:00         at org.apache.maven.DefaultMaven.execute(DefaultMaven.java:105)
19-Aug-2019 00:17:00         at org.apache.maven.cli.MavenCli.execute(MavenCli.java:954)
19-Aug-2019 00:17:00         at org.apache.maven.cli.MavenCli.doMain(MavenCli.java:288)
19-Aug-2019 00:17:00         at org.apache.maven.cli.MavenCli.main(MavenCli.java:192)
19-Aug-2019 00:17:00         at sun.reflect.NativeMethodAccessorImpl.invoke0(Native Method)
19-Aug-2019 00:17:00         at sun.reflect.NativeMethodAccessorImpl.invoke(NativeMethodAccessorImpl.java:62)
19-Aug-2019 00:17:00         at sun.reflect.DelegatingMethodAccessorImpl.invoke(DelegatingMethodAccessorImpl.java:43)
19-Aug-2019 00:17:00         at java.lang.reflect.Method.invoke(Method.java:498)
19-Aug-2019 00:17:00         at org.codehaus.plexus.classworlds.launcher.Launcher.launchEnhanced(Launcher.java:289)
19-Aug-2019 00:17:00         at org.codehaus.plexus.classworlds.launcher.Launcher.launch(Launcher.java:229)
19-Aug-2019 00:17:00         at org.codehaus.plexus.classworlds.launcher.Launcher.mainWithExitCode(Launcher.java:415)
19-Aug-2019 00:17:00         at org.codehaus.plexus.classworlds.launcher.Launcher.main(Launcher.java:356)
19-Aug-2019 00:17:00
19-Aug-2019 00:17:00 [WARNING] An error occurs while processing the bug instance [BugInstance type=EQ_COMPARETO_USE_OBJECT_EQUALS, class=org.springframework.data.mapping.model.ClassGeneratingPropertyAccessorFactory$PropertyStackAddress, line=1398]
19-Aug-2019 00:17:00 java.lang.IllegalArgumentException: 1398 is not a valid line for pointer. File target/generated-sources/delombok/org/springframework/data/mapping/model/ClassGeneratingPropertyAccessorFactory.java has 1135 line(s)
19-Aug-2019 00:17:00         at org.sonar.api.internal.google.common.base.Preconditions.checkArgument(Preconditions.java:145)
19-Aug-2019 00:17:00         at org.sonar.api.batch.fs.internal.DefaultInputFile.checkValid(DefaultInputFile.java:309)
19-Aug-2019 00:17:00         at org.sonar.api.batch.fs.internal.DefaultInputFile.newPointer(DefaultInputFile.java:246)
19-Aug-2019 00:17:00         at org.sonar.api.batch.fs.internal.DefaultInputFile.selectLine(DefaultInputFile.java:269)
19-Aug-2019 00:17:00         at org.sonar.plugins.findbugs.FindbugsSensor.insertIssue(FindbugsSensor.java:217)
19-Aug-2019 00:17:00         at org.sonar.plugins.findbugs.FindbugsSensor.execute(FindbugsSensor.java:148)
19-Aug-2019 00:17:00         at org.sonar.scanner.sensor.SensorWrapper.analyse(SensorWrapper.java:53)
19-Aug-2019 00:17:00         at org.sonar.scanner.phases.SensorsExecutor.executeSensor(SensorsExecutor.java:88)
19-Aug-2019 00:17:00         at org.sonar.scanner.phases.SensorsExecutor.execute(SensorsExecutor.java:82)
19-Aug-2019 00:17:00         at org.sonar.scanner.phases.SensorsExecutor.execute(SensorsExecutor.java:68)
19-Aug-2019 00:17:00         at org.sonar.scanner.phases.AbstractPhaseExecutor.execute(AbstractPhaseExecutor.java:88)
19-Aug-2019 00:17:00         at org.sonar.scanner.scan.ModuleScanContainer.doAfterStart(ModuleScanContainer.java:177)
19-Aug-2019 00:17:00         at org.sonar.core.platform.ComponentContainer.startComponents(ComponentContainer.java:135)
19-Aug-2019 00:17:00         at org.sonar.core.platform.ComponentContainer.execute(ComponentContainer.java:121)
19-Aug-2019 00:17:00         at org.sonar.scanner.scan.ProjectScanContainer.scan(ProjectScanContainer.java:291)
19-Aug-2019 00:17:00         at org.sonar.scanner.scan.ProjectScanContainer.scanRecursively(ProjectScanContainer.java:286)
19-Aug-2019 00:17:00         at org.sonar.scanner.scan.ProjectScanContainer.doAfterStart(ProjectScanContainer.java:264)
19-Aug-2019 00:17:00         at org.sonar.core.platform.ComponentContainer.startComponents(ComponentContainer.java:135)
19-Aug-2019 00:17:00         at org.sonar.core.platform.ComponentContainer.execute(ComponentContainer.java:121)
19-Aug-2019 00:17:00         at org.sonar.scanner.task.ScanTask.execute(ScanTask.java:48)
19-Aug-2019 00:17:00         at org.sonar.scanner.task.TaskContainer.doAfterStart(TaskContainer.java:84)
19-Aug-2019 00:17:00         at org.sonar.core.platform.ComponentContainer.startComponents(ComponentContainer.java:135)
19-Aug-2019 00:17:00         at org.sonar.core.platform.ComponentContainer.execute(ComponentContainer.java:121)
19-Aug-2019 00:17:00         at org.sonar.scanner.bootstrap.GlobalContainer.executeTask(GlobalContainer.java:121)
19-Aug-2019 00:17:00         at org.sonar.batch.bootstrapper.Batch.doExecuteTask(Batch.java:116)
19-Aug-2019 00:17:00         at org.sonar.batch.bootstrapper.Batch.execute(Batch.java:71)
19-Aug-2019 00:17:00         at org.sonarsource.scanner.api.internal.batch.BatchIsolatedLauncher.execute(BatchIsolatedLauncher.java:46)
19-Aug-2019 00:17:00         at sun.reflect.NativeMethodAccessorImpl.invoke0(Native Method)
19-Aug-2019 00:17:00         at sun.reflect.NativeMethodAccessorImpl.invoke(NativeMethodAccessorImpl.java:62)
19-Aug-2019 00:17:00         at sun.reflect.DelegatingMethodAccessorImpl.invoke(DelegatingMethodAccessorImpl.java:43)
19-Aug-2019 00:17:00         at java.lang.reflect.Method.invoke(Method.java:498)
19-Aug-2019 00:17:00         at org.sonarsource.scanner.api.internal.IsolatedLauncherProxy.invoke(IsolatedLauncherProxy.java:60)
19-Aug-2019 00:17:00         at com.sun.proxy.$Proxy24.execute(Unknown Source)
19-Aug-2019 00:17:00         at org.sonarsource.scanner.api.EmbeddedScanner.doExecute(EmbeddedScanner.java:185)
19-Aug-2019 00:17:00         at org.sonarsource.scanner.api.EmbeddedScanner.execute(EmbeddedScanner.java:137)
19-Aug-2019 00:17:00         at org.sonarsource.scanner.maven.bootstrap.ScannerBootstrapper.execute(ScannerBootstrapper.java:65)
19-Aug-2019 00:17:00         at org.sonarsource.scanner.maven.SonarQubeMojo.execute(SonarQubeMojo.java:104)
19-Aug-2019 00:17:00         at org.apache.maven.plugin.DefaultBuildPluginManager.executeMojo(DefaultBuildPluginManager.java:137)
19-Aug-2019 00:17:00         at org.apache.maven.lifecycle.internal.MojoExecutor.execute(MojoExecutor.java:208)
19-Aug-2019 00:17:00         at org.apache.maven.lifecycle.internal.MojoExecutor.execute(MojoExecutor.java:154)
19-Aug-2019 00:17:00         at org.apache.maven.lifecycle.internal.MojoExecutor.execute(MojoExecutor.java:146)
19-Aug-2019 00:17:00         at org.apache.maven.lifecycle.internal.LifecycleModuleBuilder.buildProject(LifecycleModuleBuilder.java:117)
19-Aug-2019 00:17:00         at org.apache.maven.lifecycle.internal.LifecycleModuleBuilder.buildProject(LifecycleModuleBuilder.java:81)
19-Aug-2019 00:17:00         at org.apache.maven.lifecycle.internal.builder.singlethreaded.SingleThreadedBuilder.build(SingleThreadedBuilder.java:56)
19-Aug-2019 00:17:00         at org.apache.maven.lifecycle.internal.LifecycleStarter.execute(LifecycleStarter.java:128)
19-Aug-2019 00:17:00         at org.apache.maven.DefaultMaven.doExecute(DefaultMaven.java:305)
19-Aug-2019 00:17:00         at org.apache.maven.DefaultMaven.doExecute(DefaultMaven.java:192)
19-Aug-2019 00:17:00         at org.apache.maven.DefaultMaven.execute(DefaultMaven.java:105)
19-Aug-2019 00:17:00         at org.apache.maven.cli.MavenCli.execute(MavenCli.java:954)
19-Aug-2019 00:17:00         at org.apache.maven.cli.MavenCli.doMain(MavenCli.java:288)
19-Aug-2019 00:17:00         at org.apache.maven.cli.MavenCli.main(MavenCli.java:192)
19-Aug-2019 00:17:00         at sun.reflect.NativeMethodAccessorImpl.invoke0(Native Method)
19-Aug-2019 00:17:00         at sun.reflect.NativeMethodAccessorImpl.invoke(NativeMethodAccessorImpl.java:62)
19-Aug-2019 00:17:00         at sun.reflect.DelegatingMethodAccessorImpl.invoke(DelegatingMethodAccessorImpl.java:43)
19-Aug-2019 00:17:00         at java.lang.reflect.Method.invoke(Method.java:498)
19-Aug-2019 00:17:00         at org.codehaus.plexus.classworlds.launcher.Launcher.launchEnhanced(Launcher.java:289)
19-Aug-2019 00:17:00         at org.codehaus.plexus.classworlds.launcher.Launcher.launch(Launcher.java:229)
19-Aug-2019 00:17:00         at org.codehaus.plexus.classworlds.launcher.Launcher.mainWithExitCode(Launcher.java:415)
19-Aug-2019 00:17:00         at org.codehaus.plexus.classworlds.launcher.Launcher.main(Launcher.java:356)
19-Aug-2019 00:17:00
19-Aug-2019 00:17:00 [WARNING] An error occurs while processing the bug instance [BugInstance type=RCN_REDUNDANT_NULLCHECK_OF_NONNULL_VALUE, class=org.springframework.data.repository.core.support.RepositoryFactorySupport$RepositoryInformationCacheKey, line=695]
19-Aug-2019 00:17:00 java.lang.IllegalArgumentException: 695 is not a valid line for pointer. File target/generated-sources/delombok/org/springframework/data/repository/core/support/RepositoryFactorySupport.java has 682 line(s)
19-Aug-2019 00:17:00         at org.sonar.api.internal.google.common.base.Preconditions.checkArgument(Preconditions.java:145)
19-Aug-2019 00:17:00         at org.sonar.api.batch.fs.internal.DefaultInputFile.checkValid(DefaultInputFile.java:309)
19-Aug-2019 00:17:00         at org.sonar.api.batch.fs.internal.DefaultInputFile.newPointer(DefaultInputFile.java:246)
19-Aug-2019 00:17:00         at org.sonar.api.batch.fs.internal.DefaultInputFile.selectLine(DefaultInputFile.java:269)
19-Aug-2019 00:17:00         at org.sonar.plugins.findbugs.FindbugsSensor.insertIssue(FindbugsSensor.java:217)
19-Aug-2019 00:17:00         at org.sonar.plugins.findbugs.FindbugsSensor.execute(FindbugsSensor.java:148)
19-Aug-2019 00:17:00         at org.sonar.scanner.sensor.SensorWrapper.analyse(SensorWrapper.java:53)
19-Aug-2019 00:17:00         at org.sonar.scanner.phases.SensorsExecutor.executeSensor(SensorsExecutor.java:88)
19-Aug-2019 00:17:00         at org.sonar.scanner.phases.SensorsExecutor.execute(SensorsExecutor.java:82)
19-Aug-2019 00:17:00         at org.sonar.scanner.phases.SensorsExecutor.execute(SensorsExecutor.java:68)
19-Aug-2019 00:17:00         at org.sonar.scanner.phases.AbstractPhaseExecutor.execute(AbstractPhaseExecutor.java:88)
19-Aug-2019 00:17:00         at org.sonar.scanner.scan.ModuleScanContainer.doAfterStart(ModuleScanContainer.java:177)
19-Aug-2019 00:17:00         at org.sonar.core.platform.ComponentContainer.startComponents(ComponentContainer.java:135)
19-Aug-2019 00:17:00         at org.sonar.core.platform.ComponentContainer.execute(ComponentContainer.java:121)
19-Aug-2019 00:17:00         at org.sonar.scanner.scan.ProjectScanContainer.scan(ProjectScanContainer.java:291)
19-Aug-2019 00:17:00         at org.sonar.scanner.scan.ProjectScanContainer.scanRecursively(ProjectScanContainer.java:286)
19-Aug-2019 00:17:00         at org.sonar.scanner.scan.ProjectScanContainer.doAfterStart(ProjectScanContainer.java:264)
19-Aug-2019 00:17:00         at org.sonar.core.platform.ComponentContainer.startComponents(ComponentContainer.java:135)
19-Aug-2019 00:17:00         at org.sonar.core.platform.ComponentContainer.execute(ComponentContainer.java:121)
19-Aug-2019 00:17:00         at org.sonar.scanner.task.ScanTask.execute(ScanTask.java:48)
19-Aug-2019 00:17:00         at org.sonar.scanner.task.TaskContainer.doAfterStart(TaskContainer.java:84)
19-Aug-2019 00:17:00         at org.sonar.core.platform.ComponentContainer.startComponents(ComponentContainer.java:135)
19-Aug-2019 00:17:00         at org.sonar.core.platform.ComponentContainer.execute(ComponentContainer.java:121)
19-Aug-2019 00:17:00         at org.sonar.scanner.bootstrap.GlobalContainer.executeTask(GlobalContainer.java:121)
19-Aug-2019 00:17:00         at org.sonar.batch.bootstrapper.Batch.doExecuteTask(Batch.java:116)
19-Aug-2019 00:17:00         at org.sonar.batch.bootstrapper.Batch.execute(Batch.java:71)
19-Aug-2019 00:17:00         at org.sonarsource.scanner.api.internal.batch.BatchIsolatedLauncher.execute(BatchIsolatedLauncher.java:46)
19-Aug-2019 00:17:00         at sun.reflect.NativeMethodAccessorImpl.invoke0(Native Method)
19-Aug-2019 00:17:00         at sun.reflect.NativeMethodAccessorImpl.invoke(NativeMethodAccessorImpl.java:62)
19-Aug-2019 00:17:00         at sun.reflect.DelegatingMethodAccessorImpl.invoke(DelegatingMethodAccessorImpl.java:43)
19-Aug-2019 00:17:00         at java.lang.reflect.Method.invoke(Method.java:498)
19-Aug-2019 00:17:00         at org.sonarsource.scanner.api.internal.IsolatedLauncherProxy.invoke(IsolatedLauncherProxy.java:60)
19-Aug-2019 00:17:00         at com.sun.proxy.$Proxy24.execute(Unknown Source)
19-Aug-2019 00:17:00         at org.sonarsource.scanner.api.EmbeddedScanner.doExecute(EmbeddedScanner.java:185)
19-Aug-2019 00:17:00         at org.sonarsource.scanner.api.EmbeddedScanner.execute(EmbeddedScanner.java:137)
19-Aug-2019 00:17:00         at org.sonarsource.scanner.maven.bootstrap.ScannerBootstrapper.execute(ScannerBootstrapper.java:65)
19-Aug-2019 00:17:00         at org.sonarsource.scanner.maven.SonarQubeMojo.execute(SonarQubeMojo.java:104)
19-Aug-2019 00:17:00         at org.apache.maven.plugin.DefaultBuildPluginManager.executeMojo(DefaultBuildPluginManager.java:137)
19-Aug-2019 00:17:00         at org.apache.maven.lifecycle.internal.MojoExecutor.execute(MojoExecutor.java:208)
19-Aug-2019 00:17:00         at org.apache.maven.lifecycle.internal.MojoExecutor.execute(MojoExecutor.java:154)
19-Aug-2019 00:17:00         at org.apache.maven.lifecycle.internal.MojoExecutor.execute(MojoExecutor.java:146)
19-Aug-2019 00:17:00         at org.apache.maven.lifecycle.internal.LifecycleModuleBuilder.buildProject(LifecycleModuleBuilder.java:117)
19-Aug-2019 00:17:00         at org.apache.maven.lifecycle.internal.LifecycleModuleBuilder.buildProject(LifecycleModuleBuilder.java:81)
19-Aug-2019 00:17:00         at org.apache.maven.lifecycle.internal.builder.singlethreaded.SingleThreadedBuilder.build(SingleThreadedBuilder.java:56)
19-Aug-2019 00:17:00         at org.apache.maven.lifecycle.internal.LifecycleStarter.execute(LifecycleStarter.java:128)
19-Aug-2019 00:17:00         at org.apache.maven.DefaultMaven.doExecute(DefaultMaven.java:305)
19-Aug-2019 00:17:00         at org.apache.maven.DefaultMaven.doExecute(DefaultMaven.java:192)
19-Aug-2019 00:17:00         at org.apache.maven.DefaultMaven.execute(DefaultMaven.java:105)
19-Aug-2019 00:17:00         at org.apache.maven.cli.MavenCli.execute(MavenCli.java:954)
19-Aug-2019 00:17:00         at org.apache.maven.cli.MavenCli.doMain(MavenCli.java:288)
19-Aug-2019 00:17:00         at org.apache.maven.cli.MavenCli.main(MavenCli.java:192)
19-Aug-2019 00:17:00         at sun.reflect.NativeMethodAccessorImpl.invoke0(Native Method)
19-Aug-2019 00:17:00         at sun.reflect.NativeMethodAccessorImpl.invoke(NativeMethodAccessorImpl.java:62)
19-Aug-2019 00:17:00         at sun.reflect.DelegatingMethodAccessorImpl.invoke(DelegatingMethodAccessorImpl.java:43)
19-Aug-2019 00:17:00         at java.lang.reflect.Method.invoke(Method.java:498)
19-Aug-2019 00:17:00         at org.codehaus.plexus.classworlds.launcher.Launcher.launchEnhanced(Launcher.java:289)
19-Aug-2019 00:17:00         at org.codehaus.plexus.classworlds.launcher.Launcher.launch(Launcher.java:229)
19-Aug-2019 00:17:00         at org.codehaus.plexus.classworlds.launcher.Launcher.mainWithExitCode(Launcher.java:415)
19-Aug-2019 00:17:00         at org.codehaus.plexus.classworlds.launcher.Launcher.main(Launcher.java:356)
19-Aug-2019 00:17:00
19-Aug-2019 00:17:00 [WARNING] An error occurs while processing the bug instance [BugInstance type=RCN_REDUNDANT_NULLCHECK_OF_NONNULL_VALUE, class=org.springframework.data.repository.core.support.RepositoryFactorySupport$RepositoryInformationCacheKey, line=695]
19-Aug-2019 00:17:00 java.lang.IllegalArgumentException: 695 is not a valid line for pointer. File target/generated-sources/delombok/org/springframework/data/repository/core/support/RepositoryFactorySupport.java has 682 line(s)
19-Aug-2019 00:17:00         at org.sonar.api.internal.google.common.base.Preconditions.checkArgument(Preconditions.java:145)
19-Aug-2019 00:17:00         at org.sonar.api.batch.fs.internal.DefaultInputFile.checkValid(DefaultInputFile.java:309)
19-Aug-2019 00:17:00         at org.sonar.api.batch.fs.internal.DefaultInputFile.newPointer(DefaultInputFile.java:246)
19-Aug-2019 00:17:00         at org.sonar.api.batch.fs.internal.DefaultInputFile.selectLine(DefaultInputFile.java:269)
19-Aug-2019 00:17:00         at org.sonar.plugins.findbugs.FindbugsSensor.insertIssue(FindbugsSensor.java:217)
19-Aug-2019 00:17:00         at org.sonar.plugins.findbugs.FindbugsSensor.execute(FindbugsSensor.java:148)
19-Aug-2019 00:17:00         at org.sonar.scanner.sensor.SensorWrapper.analyse(SensorWrapper.java:53)
19-Aug-2019 00:17:00         at org.sonar.scanner.phases.SensorsExecutor.executeSensor(SensorsExecutor.java:88)
19-Aug-2019 00:17:00         at org.sonar.scanner.phases.SensorsExecutor.execute(SensorsExecutor.java:82)
19-Aug-2019 00:17:00         at org.sonar.scanner.phases.SensorsExecutor.execute(SensorsExecutor.java:68)
19-Aug-2019 00:17:00         at org.sonar.scanner.phases.AbstractPhaseExecutor.execute(AbstractPhaseExecutor.java:88)
19-Aug-2019 00:17:00         at org.sonar.scanner.scan.ModuleScanContainer.doAfterStart(ModuleScanContainer.java:177)
19-Aug-2019 00:17:00         at org.sonar.core.platform.ComponentContainer.startComponents(ComponentContainer.java:135)
19-Aug-2019 00:17:00         at org.sonar.core.platform.ComponentContainer.execute(ComponentContainer.java:121)
19-Aug-2019 00:17:00         at org.sonar.scanner.scan.ProjectScanContainer.scan(ProjectScanContainer.java:291)
19-Aug-2019 00:17:00         at org.sonar.scanner.scan.ProjectScanContainer.scanRecursively(ProjectScanContainer.java:286)
19-Aug-2019 00:17:00         at org.sonar.scanner.scan.ProjectScanContainer.doAfterStart(ProjectScanContainer.java:264)
19-Aug-2019 00:17:00         at org.sonar.core.platform.ComponentContainer.startComponents(ComponentContainer.java:135)
19-Aug-2019 00:17:00         at org.sonar.core.platform.ComponentContainer.execute(ComponentContainer.java:121)
19-Aug-2019 00:17:00         at org.sonar.scanner.task.ScanTask.execute(ScanTask.java:48)
19-Aug-2019 00:17:00         at org.sonar.scanner.task.TaskContainer.doAfterStart(TaskContainer.java:84)
19-Aug-2019 00:17:00         at org.sonar.core.platform.ComponentContainer.startComponents(ComponentContainer.java:135)
19-Aug-2019 00:17:00         at org.sonar.core.platform.ComponentContainer.execute(ComponentContainer.java:121)
19-Aug-2019 00:17:00         at org.sonar.scanner.bootstrap.GlobalContainer.executeTask(GlobalContainer.java:121)
19-Aug-2019 00:17:00         at org.sonar.batch.bootstrapper.Batch.doExecuteTask(Batch.java:116)
19-Aug-2019 00:17:00         at org.sonar.batch.bootstrapper.Batch.execute(Batch.java:71)
19-Aug-2019 00:17:00         at org.sonarsource.scanner.api.internal.batch.BatchIsolatedLauncher.execute(BatchIsolatedLauncher.java:46)
19-Aug-2019 00:17:00         at sun.reflect.NativeMethodAccessorImpl.invoke0(Native Method)
19-Aug-2019 00:17:00         at sun.reflect.NativeMethodAccessorImpl.invoke(NativeMethodAccessorImpl.java:62)
19-Aug-2019 00:17:00         at sun.reflect.DelegatingMethodAccessorImpl.invoke(DelegatingMethodAccessorImpl.java:43)
19-Aug-2019 00:17:00         at java.lang.reflect.Method.invoke(Method.java:498)
19-Aug-2019 00:17:00         at org.sonarsource.scanner.api.internal.IsolatedLauncherProxy.invoke(IsolatedLauncherProxy.java:60)
19-Aug-2019 00:17:00         at com.sun.proxy.$Proxy24.execute(Unknown Source)
19-Aug-2019 00:17:00         at org.sonarsource.scanner.api.EmbeddedScanner.doExecute(EmbeddedScanner.java:185)
19-Aug-2019 00:17:00         at org.sonarsource.scanner.api.EmbeddedScanner.execute(EmbeddedScanner.java:137)
19-Aug-2019 00:17:00         at org.sonarsource.scanner.maven.bootstrap.ScannerBootstrapper.execute(ScannerBootstrapper.java:65)
19-Aug-2019 00:17:00         at org.sonarsource.scanner.maven.SonarQubeMojo.execute(SonarQubeMojo.java:104)
19-Aug-2019 00:17:00         at org.apache.maven.plugin.DefaultBuildPluginManager.executeMojo(DefaultBuildPluginManager.java:137)
19-Aug-2019 00:17:00         at org.apache.maven.lifecycle.internal.MojoExecutor.execute(MojoExecutor.java:208)
19-Aug-2019 00:17:00         at org.apache.maven.lifecycle.internal.MojoExecutor.execute(MojoExecutor.java:154)
19-Aug-2019 00:17:00         at org.apache.maven.lifecycle.internal.MojoExecutor.execute(MojoExecutor.java:146)
19-Aug-2019 00:17:00         at org.apache.maven.lifecycle.internal.LifecycleModuleBuilder.buildProject(LifecycleModuleBuilder.java:117)
19-Aug-2019 00:17:00         at org.apache.maven.lifecycle.internal.LifecycleModuleBuilder.buildProject(LifecycleModuleBuilder.java:81)
19-Aug-2019 00:17:00         at org.apache.maven.lifecycle.internal.builder.singlethreaded.SingleThreadedBuilder.build(SingleThreadedBuilder.java:56)
19-Aug-2019 00:17:00         at org.apache.maven.lifecycle.internal.LifecycleStarter.execute(LifecycleStarter.java:128)
19-Aug-2019 00:17:00         at org.apache.maven.DefaultMaven.doExecute(DefaultMaven.java:305)
19-Aug-2019 00:17:00         at org.apache.maven.DefaultMaven.doExecute(DefaultMaven.java:192)
19-Aug-2019 00:17:00         at org.apache.maven.DefaultMaven.execute(DefaultMaven.java:105)
19-Aug-2019 00:17:00         at org.apache.maven.cli.MavenCli.execute(MavenCli.java:954)
19-Aug-2019 00:17:00         at org.apache.maven.cli.MavenCli.doMain(MavenCli.java:288)
19-Aug-2019 00:17:00         at org.apache.maven.cli.MavenCli.main(MavenCli.java:192)
19-Aug-2019 00:17:00         at sun.reflect.NativeMethodAccessorImpl.invoke0(Native Method)
19-Aug-2019 00:17:00         at sun.reflect.NativeMethodAccessorImpl.invoke(NativeMethodAccessorImpl.java:62)
19-Aug-2019 00:17:00         at sun.reflect.DelegatingMethodAccessorImpl.invoke(DelegatingMethodAccessorImpl.java:43)
19-Aug-2019 00:17:00         at java.lang.reflect.Method.invoke(Method.java:498)
19-Aug-2019 00:17:00         at org.codehaus.plexus.classworlds.launcher.Launcher.launchEnhanced(Launcher.java:289)
19-Aug-2019 00:17:00         at org.codehaus.plexus.classworlds.launcher.Launcher.launch(Launcher.java:229)
19-Aug-2019 00:17:00         at org.codehaus.plexus.classworlds.launcher.Launcher.mainWithExitCode(Launcher.java:415)
19-Aug-2019 00:17:00         at org.codehaus.plexus.classworlds.launcher.Launcher.main(Launcher.java:356)
19-Aug-2019 00:17:00
19-Aug-2019 00:17:00 [INFO] Sensor FindBugs Sensor [findbugs] (done) | time=17046ms
19-Aug-2019 00:17:00 [INFO] Sensor SurefireSensor [java]
19-Aug-2019 00:17:00 [INFO] parsing [/opt/bamboo-home/xml-data/build-dir/SPRINGDATACMNS-COMMONSSONAR-JOB1/target/surefire-reports]
19-Aug-2019 00:17:01 [INFO] Sensor SurefireSensor [java] (done) | time=227ms
19-Aug-2019 00:17:01 [INFO] Sensor JaCoCoSensor [java]
19-Aug-2019 00:17:01 [WARNING] Property 'sonar.jacoco.reportPaths' is deprecated (JaCoCo binary format). 'sonar.coverage.jacoco.xmlReportPaths' should be used instead (JaCoCo XML format).
19-Aug-2019 00:17:01 [INFO] Analysing /opt/bamboo-home/xml-data/build-dir/SPRINGDATACMNS-COMMONSSONAR-JOB1/target/jacoco.exec
19-Aug-2019 00:17:01 [INFO] ------------------------------------------------------------------------
19-Aug-2019 00:17:01 [INFO] BUILD FAILURE
19-Aug-2019 00:17:01 [INFO] ------------------------------------------------------------------------
19-Aug-2019 00:17:01 [INFO] Total time: 45.432 s
19-Aug-2019 00:17:01 [INFO] Finished at: 2019-08-19T00:17:01Z
19-Aug-2019 00:17:01 [INFO] ------------------------------------------------------------------------
19-Aug-2019 00:17:01 [ERROR] Failed to execute goal org.sonarsource.scanner.maven:sonar-maven-plugin:3.6.0.1398:sonar (default-cli) on project spring-data-commons: Line 568 is out of range in the file target/generated-sources/delombok/org/springframework/data/mapping/model/BasicPersistentEntity.java (lines: 566) -> [Help 1]
19-Aug-2019 00:17:01 [ERROR]
19-Aug-2019 00:17:01 [ERROR] To see the full stack trace of the errors, re-run Maven with the -e switch.
19-Aug-2019 00:17:01 [ERROR] Re-run Maven using the -X switch to enable full debug logging.
19-Aug-2019 00:17:01 [ERROR]
19-Aug-2019 00:17:01 [ERROR] For more information about the errors and possible solutions, please read the following articles:
19-Aug-2019 00:17:01 [ERROR] [Help 1] http://cwiki.apache.org/confluence/display/MAVEN/MojoExecutionException
19-Aug-2019 00:17:01 Failing task since return code of [/opt/maven-3.5/bin/mvn sonar:sonar -B -Dsonar.sources=target/generated-sources/delombok -Dsonar.host.url=http://sonar.af.pivotal.io:8080 -Dsonar.login=****** was 1 while expected 0
19-Aug-2019 00:17:01 SONAR4BAMBOO: was not able to find a SonarQube result URL
19-Aug-2019 00:17:01 Finished task 'SonarQube' with result: Failed
19-Aug-2019 00:17:01 Running post build plugin 'Docker Container Cleanup'
19-Aug-2019 00:17:01 Running post build plugin 'NCover Results Collector'
19-Aug-2019 00:17:01 Running post build plugin 'Artifactory Release Management Staging'
19-Aug-2019 00:17:01 Running post build plugin 'Artifactory Build Info Copier'
19-Aug-2019 00:17:01 Running post build plugin 'Artifactory Gradle Properties Info Copier'
19-Aug-2019 00:17:01 Running post build plugin 'Clover Results Collector'
19-Aug-2019 00:17:01 Running post build plugin 'npm Cache Cleanup'
19-Aug-2019 00:17:01 Running post build plugin 'Artifact Copier'
19-Aug-2019 00:17:01 Successfully removed working directory at '/opt/bamboo-home/xml-data/build-dir/SPRINGDATACMNS-COMMONSSONAR-JOB1'
19-Aug-2019 00:17:01 Finalising the build...
19-Aug-2019 00:17:01 Stopping timer.
19-Aug-2019 00:17:01 Build SPRINGDATACMNS-COMMONSSONAR-JOB1-2684 completed.
19-Aug-2019 00:17:01 Running on server: post build plugin 'NCover Results Collector'
19-Aug-2019 00:17:01 Running on server: post build plugin 'Build Hanging Detection Configuration'
19-Aug-2019 00:17:01 Running on server: post build plugin 'Bamboo project link creator'
19-Aug-2019 00:17:01 Running on server: post build plugin 'Clover Delta Calculator'
19-Aug-2019 00:17:01 Running on server: post build plugin 'Maven Dependencies Postprocessor'
19-Aug-2019 00:17:01 All post build plugins have finished
19-Aug-2019 00:17:01 Generating build results summary...
19-Aug-2019 00:17:02 Saving build results to disk...
19-Aug-2019 00:17:02 Logging substituted variables...
19-Aug-2019 00:17:02 Indexing build results...
19-Aug-2019 00:17:02 Finished building SPRINGDATACMNS-COMMONSSONAR-JOB1-2684.