Build #742

Build: #742 was successful

Job: Default Job was successful

Stages & jobs

  1. Default Stage

Build log

The build generated 866 lines of output. Download or view full build log

19-May-2019 03:24:01 Build Spring Data Commons - Spring Data Commons - 2.0.x - Default Job #742 (SPRINGDATACMNS-DATACMNS143-JOB1-742) started building on agent bamboo-00.af.pivotal.io
19-May-2019 03:24:01 Remote agent on host bamboo-00.af.pivotal.io
19-May-2019 03:24:01 Build working directory is /opt/bamboo-home/xml-data/build-dir/SPRINGDATACMNS-DATACMNS143-JOB1
19-May-2019 03:24:01 Executing build Spring Data Commons - Spring Data Commons - 2.0.x - Default Job #742 (SPRINGDATACMNS-DATACMNS143-JOB1-742)
19-May-2019 03:24:01 Starting task 'Checkout Default Repository' of type 'com.atlassian.bamboo.plugins.vcs:task.vcs.checkout'
19-May-2019 03:24:01 Build always requires a clean checkout
19-May-2019 03:24:01 Cleaning build directory '/opt/bamboo-home/xml-data/build-dir/SPRINGDATACMNS-DATACMNS143-JOB1'
19-May-2019 03:24:01 Checking out into /opt/bamboo-home/xml-data/build-dir/SPRINGDATACMNS-DATACMNS143-JOB1
19-May-2019 03:24:01 Updating source code to revision: abf2b2ddce653092e3019a123bfcdde787038836
19-May-2019 03:24:01 Creating local git repository in '/opt/bamboo-home/xml-data/build-dir/SPRINGDATACMNS-DATACMNS143-JOB1/.git'.
19-May-2019 03:24:01 Initialized empty Git repository in /opt/bamboo-home/xml-data/build-dir/SPRINGDATACMNS-DATACMNS143-JOB1/.git/
19-May-2019 03:24:02 Fetching 'refs/heads/2.0.x' from 'https://github.com/spring-projects/spring-data-commons.git'.
19-May-2019 03:24:04 From https://github.com/spring-projects/spring-data-commons
19-May-2019 03:24:04 * [new branch]      2.0.x      -> 2.0.x
19-May-2019 03:24:04 * [new tag]         1.0.0.M1   -> 1.0.0.M1
19-May-2019 03:24:04 * [new tag]         1.0.0.M2   -> 1.0.0.M2
19-May-2019 03:24:04 * [new tag]         1.0.0.M3   -> 1.0.0.M3
19-May-2019 03:24:04 * [new tag]         1.0.0.M4   -> 1.0.0.M4
19-May-2019 03:24:04 * [new tag]         1.0.0.M5   -> 1.0.0.M5
19-May-2019 03:24:04 * [new tag]         1.0.0.M6   -> 1.0.0.M6
19-May-2019 03:24:04 * [new tag]         1.0.0.M7   -> 1.0.0.M7
19-May-2019 03:24:04 * [new tag]         1.0.0.RC1  -> 1.0.0.RC1
19-May-2019 03:24:04 * [new tag]         1.0.0.RELEASE -> 1.0.0.RELEASE
19-May-2019 03:24:04 * [new tag]         1.1.0.M1   -> 1.1.0.M1
19-May-2019 03:24:04 * [new tag]         1.1.0.M2   -> 1.1.0.M2
19-May-2019 03:24:04 * [new tag]         1.1.0.RC1  -> 1.1.0.RC1
19-May-2019 03:24:04 * [new tag]         1.1.0.RELEASE -> 1.1.0.RELEASE
19-May-2019 03:24:04 * [new tag]         1.10.0.M1  -> 1.10.0.M1
19-May-2019 03:24:04 * [new tag]         1.10.0.RC1 -> 1.10.0.RC1
19-May-2019 03:24:04 * [new tag]         1.10.0.RELEASE -> 1.10.0.RELEASE
19-May-2019 03:24:04 * [new tag]         1.11.0.M1  -> 1.11.0.M1
19-May-2019 03:24:04 * [new tag]         1.11.0.RC1 -> 1.11.0.RC1
19-May-2019 03:24:04 * [new tag]         1.11.0.RELEASE -> 1.11.0.RELEASE
19-May-2019 03:24:04 * [new tag]         1.12.0.M1  -> 1.12.0.M1
19-May-2019 03:24:04 * [new tag]         1.12.0.RC1 -> 1.12.0.RC1
19-May-2019 03:24:04 * [new tag]         1.12.0.RELEASE -> 1.12.0.RELEASE
19-May-2019 03:24:04 * [new tag]         1.13.0.M1  -> 1.13.0.M1
19-May-2019 03:24:04 * [new tag]         1.2.0.M1   -> 1.2.0.M1
19-May-2019 03:24:04 * [new tag]         1.2.0.M2   -> 1.2.0.M2
19-May-2019 03:24:04 * [new tag]         1.2.0.RC1  -> 1.2.0.RC1
19-May-2019 03:24:04 * [new tag]         1.2.0.RELEASE -> 1.2.0.RELEASE
19-May-2019 03:24:04 * [new tag]         1.3.0.M1   -> 1.3.0.M1
19-May-2019 03:24:04 * [new tag]         1.3.0.RC1  -> 1.3.0.RC1
19-May-2019 03:24:04 * [new tag]         1.3.0.RC2  -> 1.3.0.RC2
19-May-2019 03:24:04 * [new tag]         1.3.0.RELEASE -> 1.3.0.RELEASE
19-May-2019 03:24:04 * [new tag]         1.4.0.M1   -> 1.4.0.M1
19-May-2019 03:24:04 * [new tag]         1.4.0.RC1  -> 1.4.0.RC1
19-May-2019 03:24:04 * [new tag]         1.4.0.RELEASE -> 1.4.0.RELEASE
19-May-2019 03:24:04 * [new tag]         1.5.0.RELEASE -> 1.5.0.RELEASE
19-May-2019 03:24:04 * [new tag]         1.6.0.M1   -> 1.6.0.M1
19-May-2019 03:24:04 * [new tag]         1.6.0.RC1  -> 1.6.0.RC1
19-May-2019 03:24:04 * [new tag]         1.6.0.RELEASE -> 1.6.0.RELEASE
19-May-2019 03:24:04 * [new tag]         1.7.0.M1   -> 1.7.0.M1
19-May-2019 03:24:04 * [new tag]         1.7.0.RC1  -> 1.7.0.RC1
19-May-2019 03:24:04 * [new tag]         1.7.0.RELEASE -> 1.7.0.RELEASE
19-May-2019 03:24:04 * [new tag]         1.8.0.M1   -> 1.8.0.M1
19-May-2019 03:24:04 * [new tag]         1.8.0.RC1  -> 1.8.0.RC1
19-May-2019 03:24:04 * [new tag]         1.8.0.RELEASE -> 1.8.0.RELEASE
19-May-2019 03:24:04 * [new tag]         1.9.0.M1   -> 1.9.0.M1
19-May-2019 03:24:04 * [new tag]         1.9.0.RC1  -> 1.9.0.RC1
19-May-2019 03:24:04 * [new tag]         1.9.0.RELEASE -> 1.9.0.RELEASE
19-May-2019 03:24:04 * [new tag]         2.0.0.M1   -> 2.0.0.M1
19-May-2019 03:24:04 * [new tag]         2.0.0.M2   -> 2.0.0.M2
19-May-2019 03:24:04 * [new tag]         2.0.0.M3   -> 2.0.0.M3
19-May-2019 03:24:04 * [new tag]         2.0.0.M4   -> 2.0.0.M4
19-May-2019 03:24:04 * [new tag]         2.0.0.RC1  -> 2.0.0.RC1
19-May-2019 03:24:04 * [new tag]         2.0.0.RC2  -> 2.0.0.RC2
19-May-2019 03:24:04 * [new tag]         2.0.0.RC3  -> 2.0.0.RC3
19-May-2019 03:24:04 * [new tag]         2.0.0.RELEASE -> 2.0.0.RELEASE
19-May-2019 03:24:04 * [new tag]         2.0.1.RELEASE -> 2.0.1.RELEASE
19-May-2019 03:24:04 * [new tag]         2.0.10.RELEASE -> 2.0.10.RELEASE
19-May-2019 03:24:04 * [new tag]         2.0.11.RELEASE -> 2.0.11.RELEASE
19-May-2019 03:24:04 * [new tag]         2.0.12.RELEASE -> 2.0.12.RELEASE
19-May-2019 03:24:04 * [new tag]         2.0.13.RELEASE -> 2.0.13.RELEASE
19-May-2019 03:24:04 * [new tag]         2.0.14.RELEASE -> 2.0.14.RELEASE
19-May-2019 03:24:04 * [new tag]         2.0.2.RELEASE -> 2.0.2.RELEASE
19-May-2019 03:24:04 * [new tag]         2.0.3.RELEASE -> 2.0.3.RELEASE
19-May-2019 03:24:04 * [new tag]         2.0.4.RELEASE -> 2.0.4.RELEASE
19-May-2019 03:24:04 * [new tag]         2.0.5.RELEASE -> 2.0.5.RELEASE
19-May-2019 03:24:04 * [new tag]         2.0.6.RELEASE -> 2.0.6.RELEASE
19-May-2019 03:24:04 * [new tag]         2.0.7.RELEASE -> 2.0.7.RELEASE
19-May-2019 03:24:04 * [new tag]         2.0.8.RELEASE -> 2.0.8.RELEASE
19-May-2019 03:24:04 * [new tag]         2.0.9.RELEASE -> 2.0.9.RELEASE
19-May-2019 03:24:04 Checking out revision abf2b2ddce653092e3019a123bfcdde787038836.
19-May-2019 03:24:04 Switched to branch '2.0.x'
19-May-2019 03:24:04 Updated source code to revision: abf2b2ddce653092e3019a123bfcdde787038836
19-May-2019 03:24:04 Finished task 'Checkout Default Repository' with result: Success
19-May-2019 03:24:04 Running pre-build action: Artifactory Release Staging
19-May-2019 03:24:04 Running pre-build action: VCS Version Collector
19-May-2019 03:24:04 Starting task 'Build, test and install' of type 'org.jfrog.bamboo.bamboo-artifactory-plugin:maven3Task'
19-May-2019 03:24:04 Bamboo Artifactory Plugin version: 2.5.x-SNAPSHOT
19-May-2019 03:24:04
Beginning to execute external process for build 'Spring Data Commons - Spring Data Commons - 2.0.x - Default Job #742 (SPRINGDATACMNS-DATACMNS143-JOB1-742)'
... running command line:
/opt/jdk-8/bin/java -cp /opt/maven-3.5/boot/plexus-classworlds-2.5.2.jar -Dclassworlds.conf=/tmp/artifactoryM2104835799339217647conf -DbuildInfoConfig.propertiesFile=/tmp/buildInfo1974146661756429447.properties -Dmaven.home=/opt/maven-3.5 -Dmaven.multiModuleProjectDirectory=/opt/bamboo-home/xml-data/build-dir/SPRINGDATACMNS-DATACMNS143-JOB1 org.codehaus.plexus.classworlds.launcher.Launcher clean dependency:tree install -Pci -U -B -Dartifactory.publish.password=********
... in: /opt/bamboo-home/xml-data/build-dir/SPRINGDATACMNS-DATACMNS143-JOB1
... using extra environment variables:
bamboo_planRepository_1_branch=2.0.x
IRBRC=/home/bamboo/.rvm/rubies/ruby-2.3.0/.irbrc
bamboo_********_username_password=********
bamboo_signing_store_password=********
bamboo_capability_system_builder_ant_Ant_1_9=/opt/ant-1.9
bamboo_capability_system_builder_ant_Ant_1_8=/opt/ant-1.8
bamboo_planRepository_1_branchDisplayName=2.0.x
bamboo_capability_system_jdk_OpenJDK_7u181=/opt/openjdk-7
bamboo_repository_revision_number=abf2b2ddce653092e3019a123bfcdde787038836
bamboo_capability_system_builder_node_Node_js_6=/usr/bin/node
bamboo_RIAK_BIN=/usr/sbin/riak
WRAPPER_BITS=32
bamboo_buildKey=SPRINGDATACMNS-DATACMNS143-JOB1
rvm_loaded_flag=1
bamboo_repository_254541851_git_repositoryUrl=https://github.com/spring-projects/spring-data-commons.git
bamboo_bintray_password=********
bamboo_sonar_token_password=********
rvm_version=1.27.0 (latest)
PWD=/opt/bamboo-home/bin
bamboo_shortJobName=Default Job
bamboo_capability_system_builder_gradle___gradlew=./gradlew
bamboo_buildResultsUrl=https://build.spring.io/browse/SPRINGDATACMNS-DATACMNS143-JOB1-742
bamboo_capability_system_builder_mvn3_Maven_3_3=/opt/maven-3.3
bamboo_capability_system_builder_mvn3_Maven_3_2=/opt/maven-3.2
bamboo_capability_system_builder_mvn3_Maven_3_1=/opt/maven-3.1
bamboo_planRepository_repositoryUrl=https://github.com/spring-projects/spring-data-commons.git
bamboo_agentId=208568321
bamboo_capability_system_builder_mvn3_Maven_3_5=/opt/maven-3.5
MY_RUBY_HOME=/home/bamboo/.rvm/rubies/ruby-2.3.0
bamboo_capability_system_builder_mvn3_Maven_3_0=/opt/maven-3.0
bamboo_repository_254541851_previous_revision_number=abf2b2ddce653092e3019a123bfcdde787038836
rvm_path=/home/bamboo/.rvm
bamboo_planRepository_revision=abf2b2ddce653092e3019a123bfcdde787038836
bamboo_repository_254541851_git_branch=2.0.x
bamboo_planRepository_previousRevision=abf2b2ddce653092e3019a123bfcdde787038836
bamboo_capability_remote_build=true
bamboo_repository_branch_name=2.0.x
bamboo_sonatype_token_password=********
SHLVL=1
bamboo_org_jfrog_bamboo_buildInfo_serverUrl=https://repo.spring.io
bamboo_scdf_acceptance_tests_password=********
WRAPPER_OS=linux
EC2_HOME=/opt/ec2-api-tools
XDG_SESSION_ID=c1
bamboo_repository_254541851_branch_name=2.0.x
bamboo_capability_Agent=bamboo-00.af.pivotal.io
bamboo_planRepository_branch=2.0.x
bamboo_org_jfrog_bamboo_release_activated=false
bamboo_planRepository_1_type=gitv2
bamboo_planRepository_branchName=2.0.x
bamboo_capability_system_jdk_JDK_12=/opt/jdk-12
WRAPPER_FILE_SEPARATOR=/
_=/opt/bamboo-home/bin/bamboo-agent.sh
WRAPPER_PATH_SEPARATOR=:
bamboo_sonar_password=********
bamboo_hg_cache_directory=/opt/bamboo-home/xml-data/build-dir/_hg-repositories-cache
bamboo_planRepository_1_username=spring-buildmaster
bamboo_planRepository_type=gitv2
bamboo_git_cache_directory=/opt/bamboo-home/xml-data/build-dir/_git-repositories-cache
bamboo_artifactory_username=buildmaster
rvm_stored_umask=0002
bamboo_tmp_directory=/opt/bamboo-home/temp
GEM_PATH=/home/bamboo/.rvm/gems/ruby-2.3.0:/home/bamboo/.rvm/gems/ruby-2.3.0@global
bamboo_planKey=SPRINGDATACMNS-DATACMNS143
bamboo_planRepository_username=spring-buildmaster
bamboo_JDK8_HOME=/opt/jdk-8
bamboo_planRepository_1_branchName=2.0.x
bamboo_sonar_version=5.6.3
XDG_DATA_DIRS=/usr/local/share:/usr/share:/var/lib/snapd/desktop
bamboo_capability_system_jdk_JDK_1_11=/opt/jdk-11
bamboo_resultsUrl=https://build.spring.io/browse/SPRINGDATACMNS-DATACMNS143-JOB1-742
bamboo_capability_system_jdk_JDK_1_10=/opt/jdk-10
bamboo_build_working_directory=/opt/bamboo-home/xml-data/build-dir/SPRINGDATACMNS-DATACMNS143-JOB1
bamboo_planRepository_1_name=Plan Repository
bamboo_capability_system_os=ubuntu1604
bamboo_nexusPush_stagingProfile=buildmaster
bamboo_shortPlanName=2.0.x
MAIL=/var/mail/bamboo
bamboo_planRepository_name=Plan Repository
LOGNAME=bamboo
bamboo_buildNumber=742
rvm_user_install_flag=1
SHELL=/bin/bash
bamboo_planName=Spring Data Commons - Spring Data Commons - 2.0.x
bamboo_JDK7_HOME=/opt/jdk-7
bamboo_shortPlanKey=DATACMNS143
OLDPWD=/opt/users/bamboo
bamboo_repository_254541851_git_username=spring-buildmaster
GEM_HOME=/home/bamboo/.rvm/gems/ruby-2.3.0
bamboo_repository_254541851_revision_number=abf2b2ddce653092e3019a123bfcdde787038836
bamboo_shortJobKey=JOB1
bamboo_artifactory_password=********
bamboo_buildTimeStamp=2019-05-19T03:24:00.934Z
bamboo_repository_previous_revision_number=abf2b2ddce653092e3019a123bfcdde787038836
RUBY_VERSION=ruby-2.3.0
bamboo_sonar_username=buildmaster
_system_name=Ubuntu
bamboo_********_password=********
bamboo_repository_git_branch=2.0.x
bamboo_buildResultKey=SPRINGDATACMNS-DATACMNS143-JOB1-742
bamboo_nexusPush_close=true
bamboo_buildPlanName=Spring Data Commons - Spring Data Commons - 2.0.x - Default Job
bamboo_planRepository_1_revision=abf2b2ddce653092e3019a123bfcdde787038836
_system_arch=x86_64
bamboo_repository_name=Plan Repository
rvm_bin_path=/home/bamboo/.rvm/bin
bamboo_signing_key_password=********
rvm_prefix=/home/bamboo
LANG=en_US.UTF-8
bamboo_buildFailed=false
bamboo_repository_254541851_name=Plan Repository
bamboo_capability_system_docker_executable=/usr/bin/docker
DISPLAY=localhost:1.0
bamboo_capability_system_builder_groovy_Groovy_2_4=/opt/groovy-2.4
bamboo_capability_system_builder_command_Bash=/bin/bash
bamboo_artifactory_password_mask_a=********
bamboo_agentWorkingDirectory=/opt/bamboo-home/xml-data/build-dir
bamboo_capability_system_git_executable=/usr/bin/git
bamboo_repository_git_username=spring-buildmaster
bamboo_planRepository_1_previousRevision=abf2b2ddce653092e3019a123bfcdde787038836
bamboo_capability_os_family=unix
NVM_NODEJS_ORG_MIRROR=http://nodejs.org/dist
bamboo_planRepository_branchDisplayName=2.0.x
NODE_PATH=/usr/lib/nodejs:/usr/lib/node_modules:/usr/share/javascript
bamboo_capability_system_builder_maven_Artifactory_Maven_3_5=/opt/maven-3.5
GIT_SSL_NO_VERIFY=true
bamboo_capability_system_builder_maven_Artifactory_Maven_3_3=/opt/maven-3.3
NVM_DIR=/home/bamboo/.nvm
bamboo_capability_system_builder_maven_Artifactory_Maven_3_2=/opt/maven-3.2
bamboo_s3_properties=/home/bamboo/tools/s3.properties
bamboo_capability_system_builder_maven_Artifactory_Maven_3_1=/opt/maven-3.1
bamboo_capability_system_builder_maven_Artifactory_Maven_3_0=/opt/maven-3.0
_system_type=Linux
bamboo_plan_storageTag=plan-254345269
bamboo_bintray_username_password=********
_system_version=16.04
USER=bamboo
bamboo_repository_git_repositoryUrl=https://github.com/spring-projects/spring-data-commons.git
bamboo_working_directory=/opt/bamboo-home/xml-data/build-dir/SPRINGDATACMNS-DATACMNS143-JOB1
bamboo_org_jfrog_bamboo_buildInfo_activated=true
bamboo_planRepository_1_repositoryUrl=https://github.com/spring-projects/spring-data-commons.git
bamboo_capability_system_jdk_JDK_1_8=/opt/jdk-8
bamboo_capability_system_jdk_JDK_1_9=/opt/jdk-9
WRAPPER_ARCH=x86
bamboo_capability_system_jdk_JDK_1_6=/opt/jdk-6
bamboo_sonatype_password=********
bamboo_capability_system_jdk_JDK_1_7=/opt/jdk-7
bamboo_sonar_ip=10.194.6.9
XDG_RUNTIME_DIR=/run/user/505
HOME=/home/bamboo
PATH=/bin:/home/bamboo/.rvm/gems/ruby-2.3.0/bin:/home/bamboo/.rvm/gems/ruby-2.3.0@global/bin:/home/bamboo/.rvm/rubies/ruby-2.3.0/bin:/home/bamboo/bin:/usr/local/bin:/usr/bin:/bin:/usr/local/games:/usr/games:/snap/bin:/home/bamboo/bin:/usr/local/bin:/opt/ec2-api-tools/bin:/home/bamboo/.rvm/bin:/bin:/home/bamboo/.rvm/gems/ruby-2.3.0/bin:/home/bamboo/.rvm/gems/ruby-2.3.0@global/bin:/home/bamboo/.rvm/rubies/ruby-2.3.0/bin:/home/bamboo/bin:/usr/local/bin:/usr/bin:/bin:/usr/local/games:/usr/games:/snap/bin:/home/bamboo/bin:/usr/local/bin:/opt/ec2-api-tools/bin:/home/bamboo/.rvm/bin
19-May-2019 03:24:05 [INFO] Scanning for projects...
19-May-2019 03:24:06 [INFO] Downloading: https://repo.spring.io/libs-snapshot/org/springframework/data/build/spring-data-parent/2.0.15.BUILD-SNAPSHOT/maven-metadata.xml
19-May-2019 03:24:06 [INFO] Downloaded: https://repo.spring.io/libs-snapshot/org/springframework/data/build/spring-data-parent/2.0.15.BUILD-SNAPSHOT/maven-metadata.xml (641 B at 812 B/s)
19-May-2019 03:24:06 [INFO] Downloading: https://repo.spring.io/libs-snapshot/org/springframework/data/build/spring-data-build/2.0.15.BUILD-SNAPSHOT/maven-metadata.xml
19-May-2019 03:24:07 [INFO] Downloaded: https://repo.spring.io/libs-snapshot/org/springframework/data/build/spring-data-build/2.0.15.BUILD-SNAPSHOT/maven-metadata.xml (640 B at 1.0 kB/s)
19-May-2019 03:24:07 [INFO] Initializing Artifactory Build-Info Recording
19-May-2019 03:24:07 [INFO]
19-May-2019 03:24:07 [INFO] ------------------------------------------------------------------------
19-May-2019 03:24:07 [INFO] Building Spring Data Core 2.0.15.BUILD-SNAPSHOT
19-May-2019 03:24:07 [INFO] ------------------------------------------------------------------------
19-May-2019 03:24:08 [INFO]
19-May-2019 03:24:08 [INFO] --- maven-clean-plugin:2.5:clean (default-clean) @ spring-data-commons ---
19-May-2019 03:24:08 [INFO]
19-May-2019 03:24:08 [INFO] --- maven-dependency-plugin:3.0.0:tree (default-cli) @ spring-data-commons ---
19-May-2019 03:24:08 [INFO] org.springframework.data:spring-data-commons:jar:2.0.15.BUILD-SNAPSHOT
19-May-2019 03:24:08 [INFO] +- org.springframework:spring-core:jar:5.0.13.RELEASE:compile
19-May-2019 03:24:08 [INFO] |  \- org.springframework:spring-jcl:jar:5.0.13.RELEASE:compile
19-May-2019 03:24:08 [INFO] +- org.springframework:spring-beans:jar:5.0.13.RELEASE:compile
19-May-2019 03:24:08 [INFO] +- org.springframework:spring-context:jar:5.0.13.RELEASE:compile (optional)
19-May-2019 03:24:08 [INFO] |  \- org.springframework:spring-aop:jar:5.0.13.RELEASE:compile
19-May-2019 03:24:08 [INFO] +- org.springframework:spring-expression:jar:5.0.13.RELEASE:compile (optional)
19-May-2019 03:24:08 [INFO] +- org.springframework:spring-tx:jar:5.0.13.RELEASE:compile (optional)
19-May-2019 03:24:08 [INFO] +- org.springframework:spring-oxm:jar:5.0.13.RELEASE:compile (optional)
19-May-2019 03:24:08 [INFO] +- com.fasterxml.jackson.core:jackson-databind:jar:2.9.8:compile (optional)
19-May-2019 03:24:08 [INFO] |  +- com.fasterxml.jackson.core:jackson-annotations:jar:2.9.0:compile
19-May-2019 03:24:08 [INFO] |  \- com.fasterxml.jackson.core:jackson-core:jar:2.9.8:compile
19-May-2019 03:24:08 [INFO] +- org.springframework:spring-web:jar:5.0.13.RELEASE:compile (optional)
19-May-2019 03:24:08 [INFO] +- javax.servlet:javax.servlet-api:jar:3.0.1:provided
19-May-2019 03:24:08 [INFO] +- javax.annotation:javax.annotation-api:jar:1.3:compile (optional)
19-May-2019 03:24:08 [INFO] +- joda-time:joda-time:jar:2.9.9:compile (optional)
19-May-2019 03:24:08 [INFO] +- org.threeten:threetenbp:jar:1.3.8:compile (optional)
19-May-2019 03:24:08 [INFO] +- io.projectreactor:reactor-core:jar:3.1.14.RELEASE:compile (optional)
19-May-2019 03:24:08 [INFO] |  \- org.reactivestreams:reactive-streams:jar:1.0.2:compile
19-May-2019 03:24:08 [INFO] +- io.reactivex:rxjava:jar:1.3.8:compile (optional)
19-May-2019 03:24:08 [INFO] +- io.reactivex:rxjava-reactive-streams:jar:1.2.1:compile (optional)
19-May-2019 03:24:08 [INFO] +- io.reactivex.rxjava2:rxjava:jar:2.1.17:compile (optional)
19-May-2019 03:24:08 [INFO] +- com.querydsl:querydsl-core:jar:4.1.4:compile (optional)
19-May-2019 03:24:08 [INFO] |  +- com.google.code.findbugs:jsr305:jar:1.3.9:compile (optional)
19-May-2019 03:24:08 [INFO] |  +- com.mysema.commons:mysema-commons-lang:jar:0.2.4:compile (optional)
19-May-2019 03:24:08 [INFO] |  \- com.infradna.tool:bridge-method-annotation:jar:1.13:compile (optional)
19-May-2019 03:24:08 [INFO] +- com.querydsl:querydsl-apt:jar:4.1.4:provided
19-May-2019 03:24:08 [INFO] |  +- com.querydsl:querydsl-codegen:jar:4.1.4:compile
19-May-2019 03:24:08 [INFO] |  |  +- com.mysema.codegen:codegen:jar:0.6.8:compile
19-May-2019 03:24:08 [INFO] |  |  |  \- org.eclipse.jdt.core.compiler:ecj:jar:4.3.1:compile
19-May-2019 03:24:08 [INFO] |  |  \- org.reflections:reflections:jar:0.9.9:compile
19-May-2019 03:24:08 [INFO] |  |     +- org.javassist:javassist:jar:3.18.2-GA:compile
19-May-2019 03:24:08 [INFO] |  |     \- com.google.code.findbugs:annotations:jar:2.0.1:compile
19-May-2019 03:24:08 [INFO] |  \- javax.jdo:jdo-api:jar:3.0.1:provided
19-May-2019 03:24:08 [INFO] |     \- javax.transaction:jta:jar:1.1:provided
19-May-2019 03:24:08 [INFO] +- com.querydsl:querydsl-collections:jar:4.1.4:compile (optional)
19-May-2019 03:24:08 [INFO] +- javax.ejb:ejb-api:jar:3.0:compile (optional)
19-May-2019 03:24:08 [INFO] +- org.apache.geronimo.specs:geronimo-jcdi_2.0_spec:jar:1.0.1:test
19-May-2019 03:24:08 [INFO] +- javax.interceptor:javax.interceptor-api:jar:1.2.1:test
19-May-2019 03:24:08 [INFO] +- javax.enterprise:cdi-api:jar:1.0:provided (optional)
19-May-2019 03:24:08 [INFO] |  +- org.jboss.interceptor:jboss-interceptor-api:jar:1.1:provided (optional)
19-May-2019 03:24:08 [INFO] |  +- javax.annotation:jsr250-api:jar:1.0:provided (optional)
19-May-2019 03:24:08 [INFO] |  \- javax.inject:javax.inject:jar:1:compile
19-May-2019 03:24:08 [INFO] +- com.google.guava:guava:jar:19.0:compile (optional)
19-May-2019 03:24:08 [INFO] +- io.javaslang:javaslang:jar:2.0.6:compile (optional)
19-May-2019 03:24:08 [INFO] |  \- io.javaslang:javaslang-match:jar:2.0.6:compile (optional)
19-May-2019 03:24:08 [INFO] +- io.vavr:vavr:jar:0.9.3:compile (optional)
19-May-2019 03:24:08 [INFO] |  \- io.vavr:vavr-match:jar:0.9.3:compile (optional)
19-May-2019 03:24:08 [INFO] +- javax.el:el-api:jar:1.0:test
19-May-2019 03:24:08 [INFO] +- org.apache.openwebbeans:openwebbeans-se:jar:2.0.8:test
19-May-2019 03:24:08 [INFO] |  \- org.apache.openwebbeans:openwebbeans-impl:jar:2.0.8:test
19-May-2019 03:24:08 [INFO] |     +- org.apache.xbean:xbean-finder-shaded:jar:4.12:test
19-May-2019 03:24:08 [INFO] |     +- org.apache.xbean:xbean-asm7-shaded:jar:4.12:test
19-May-2019 03:24:08 [INFO] |     \- org.apache.openwebbeans:openwebbeans-spi:jar:2.0.8:test
19-May-2019 03:24:08 [INFO] +- org.springframework.hateoas:spring-hateoas:jar:0.25.0.RELEASE:compile (optional)
19-May-2019 03:24:08 [INFO] +- org.springframework:spring-webmvc:jar:5.0.13.RELEASE:compile (optional)
19-May-2019 03:24:08 [INFO] +- com.sun.xml.bind:jaxb-impl:jar:2.2.3U1:test
19-May-2019 03:24:08 [INFO] |  \- javax.xml.bind:jaxb-api:jar:2.2.2:test
19-May-2019 03:24:08 [INFO] |     +- javax.xml.stream:stax-api:jar:1.0-2:test
19-May-2019 03:24:08 [INFO] |     \- javax.activation:activation:jar:1.1:test
19-May-2019 03:24:08 [INFO] +- xmlunit:xmlunit:jar:1.6:test
19-May-2019 03:24:08 [INFO] +- org.codehaus.groovy:groovy-all:jar:2.4.4:test
19-May-2019 03:24:08 [INFO] +- org.jetbrains.kotlin:kotlin-stdlib:jar:1.1.61:compile (optional)
19-May-2019 03:24:08 [INFO] |  \- org.jetbrains:annotations:jar:13.0:compile (optional)
19-May-2019 03:24:08 [INFO] +- org.jetbrains.kotlin:kotlin-reflect:jar:1.1.61:compile (optional)
19-May-2019 03:24:08 [INFO] +- org.jetbrains.kotlin:kotlin-test:jar:1.1.61:test
19-May-2019 03:24:08 [INFO] +- com.nhaarman:mockito-kotlin:jar:1.5.0:test
19-May-2019 03:24:08 [INFO] +- org.scala-lang:scala-library:jar:2.11.7:compile (optional)
19-May-2019 03:24:08 [INFO] +- javax.transaction:javax.transaction-api:jar:1.2:test
19-May-2019 03:24:08 [INFO] +- com.jayway.jsonpath:json-path:jar:2.4.0:compile (optional)
19-May-2019 03:24:08 [INFO] |  \- net.minidev:json-smart:jar:2.3:compile (optional)
19-May-2019 03:24:08 [INFO] |     \- net.minidev:accessors-smart:jar:1.2:compile (optional)
19-May-2019 03:24:08 [INFO] +- org.xmlbeam:xmlprojector:jar:1.4.15:compile (optional)
19-May-2019 03:24:08 [INFO] +- de.schauderhaft.degraph:degraph-check:jar:0.1.4:test
19-May-2019 03:24:08 [INFO] |  +- de.schauderhaft.degraph:degraph-core:jar:0.1.4:test
19-May-2019 03:24:08 [INFO] |  |  +- org.scala-lang.modules:scala-xml_2.11:jar:1.0.3:test
19-May-2019 03:24:08 [INFO] |  |  +- org.scala-lang.modules:scala-parser-combinators_2.11:jar:1.0.3:test
19-May-2019 03:24:08 [INFO] |  |  +- org.ow2.asm:asm:jar:5.1:compile
19-May-2019 03:24:08 [INFO] |  |  \- com.assembla.scala-incubator:graph-core_2.11:jar:1.9.1:test
19-May-2019 03:24:08 [INFO] |  +- org.scalatest:scalatest_2.11:jar:2.2.4:test
19-May-2019 03:24:08 [INFO] |  |  \- org.scala-lang:scala-reflect:jar:2.11.2:test
19-May-2019 03:24:08 [INFO] |  \- org.hamcrest:hamcrest-all:jar:1.3:test
19-May-2019 03:24:08 [INFO] +- org.hamcrest:hamcrest-library:jar:1.3:test
19-May-2019 03:24:08 [INFO] +- org.hamcrest:hamcrest-core:jar:1.3:test
19-May-2019 03:24:08 [INFO] +- junit:junit:jar:4.12:test
19-May-2019 03:24:08 [INFO] +- org.mockito:mockito-core:jar:2.8.47:test
19-May-2019 03:24:08 [INFO] |  +- net.bytebuddy:byte-buddy:jar:1.6.14:test
19-May-2019 03:24:08 [INFO] |  +- net.bytebuddy:byte-buddy-agent:jar:1.6.14:test
19-May-2019 03:24:08 [INFO] |  \- org.objenesis:objenesis:jar:2.5:test
19-May-2019 03:24:08 [INFO] +- org.assertj:assertj-core:jar:3.9.1:test
19-May-2019 03:24:08 [INFO] +- org.springframework:spring-test:jar:5.0.13.RELEASE:test
19-May-2019 03:24:08 [INFO] +- org.slf4j:slf4j-api:jar:1.7.25:compile
19-May-2019 03:24:08 [INFO] +- ch.qos.logback:logback-classic:jar:1.2.3:test
19-May-2019 03:24:08 [INFO] |  \- ch.qos.logback:logback-core:jar:1.2.3:test
19-May-2019 03:24:08 [INFO] \- org.projectlombok:lombok:jar:1.18.4:compile (optional)
19-May-2019 03:24:08 [INFO]
19-May-2019 03:24:08 [INFO] --- maven-enforcer-plugin:1.4.1:enforce (enforce-maven-version) @ spring-data-commons ---
19-May-2019 03:24:08 [INFO]
19-May-2019 03:24:08 [INFO] --- maven-enforcer-plugin:1.4.1:enforce (enforce-rules) @ spring-data-commons ---
19-May-2019 03:24:08 [INFO]
19-May-2019 03:24:08 [INFO] --- lombok-maven-plugin:1.18.4.0:delombok (default) @ spring-data-commons ---
19-May-2019 03:24:13 [INFO] Delombok complete.
19-May-2019 03:24:13 [INFO]
19-May-2019 03:24:13 [INFO] --- maven-resources-plugin:2.6:resources (default-resources) @ spring-data-commons ---
19-May-2019 03:24:13 [INFO] Using 'UTF-8' encoding to copy filtered resources.
19-May-2019 03:24:14 [INFO] Copying 17 resources
19-May-2019 03:24:14 [INFO]
19-May-2019 03:24:14 [INFO] --- kotlin-maven-plugin:1.1.61:compile (compile) @ spring-data-commons ---
19-May-2019 03:24:14 [WARNING] No sources found skipping Kotlin compile
19-May-2019 03:24:14 [INFO]
19-May-2019 03:24:14 [INFO] --- maven-compiler-plugin:3.6.1:compile (java-compile) @ spring-data-commons ---
19-May-2019 03:24:14 [INFO] Changes detected - recompiling the module!
19-May-2019 03:24:14 [INFO] Compiling 431 source files to /opt/bamboo-home/xml-data/build-dir/SPRINGDATACMNS-DATACMNS143-JOB1/target/classes
19-May-2019 03:24:19 [INFO] /opt/bamboo-home/xml-data/build-dir/SPRINGDATACMNS-DATACMNS143-JOB1/src/main/java/org/springframework/data/repository/config/RepositoryConfigurationExtensionSupport.java: Some input files use or override a deprecated API.
19-May-2019 03:24:19 [INFO] /opt/bamboo-home/xml-data/build-dir/SPRINGDATACMNS-DATACMNS143-JOB1/src/main/java/org/springframework/data/repository/config/RepositoryConfigurationExtensionSupport.java: Recompile with -Xlint:deprecation for details.
19-May-2019 03:24:19 [INFO]
19-May-2019 03:24:19 [INFO] --- apt-maven-plugin:1.1.3:test-process (default) @ spring-data-commons ---
19-May-2019 03:24:19 /opt/bamboo-home/xml-data/build-dir/SPRINGDATACMNS-DATACMNS143-JOB1/src/test/java/org/springframework/data/util/ReflectionUtilsUnitTests.java:27: error: cannot find symbol
19-May-2019 03:24:19 import org.springframework.data.mapping.model.TypeCreatingSyntheticClassKt;
19-May-2019 03:24:19                                              ^
19-May-2019 03:24:19   symbol:   class TypeCreatingSyntheticClassKt
19-May-2019 03:24:19   location: package org.springframework.data.mapping.model
19-May-2019 03:24:19 /opt/bamboo-home/xml-data/build-dir/SPRINGDATACMNS-DATACMNS143-JOB1/src/test/java/org/springframework/data/convert/ParameterizedKotlinInstantiatorUnitTests.java:35: error: cannot find symbol
19-May-2019 03:24:19 import org.springframework.data.mapping.model.With32Args;
19-May-2019 03:24:19                                              ^
19-May-2019 03:24:19   symbol:   class With32Args
19-May-2019 03:24:19   location: package org.springframework.data.mapping.model
19-May-2019 03:24:19 /opt/bamboo-home/xml-data/build-dir/SPRINGDATACMNS-DATACMNS143-JOB1/src/test/java/org/springframework/data/convert/ParameterizedKotlinInstantiatorUnitTests.java:36: error: cannot find symbol
19-May-2019 03:24:19 import org.springframework.data.mapping.model.With33Args;
19-May-2019 03:24:19                                              ^
19-May-2019 03:24:19   symbol:   class With33Args
19-May-2019 03:24:19   location: package org.springframework.data.mapping.model
19-May-2019 03:24:19 /opt/bamboo-home/xml-data/build-dir/SPRINGDATACMNS-DATACMNS143-JOB1/src/test/java/org/springframework/data/repository/core/support/EventPublishingRepositoryProxyPostProcessorUnitTests.java:269: error: cannot find symbol
19-May-2019 03:24:19                 @Getter(onMethod = @__(@DomainEvents)) Collection<? extends Object> events;
19-May-2019 03:24:19                                     ^
19-May-2019 03:24:19   symbol:   class __
19-May-2019 03:24:19   location: class MultipleEvents
19-May-2019 03:24:19 /opt/bamboo-home/xml-data/build-dir/SPRINGDATACMNS-DATACMNS143-JOB1/src/test/java/org/springframework/data/repository/core/support/EventPublishingRepositoryProxyPostProcessorUnitTests.java:274: error: cannot find symbol
19-May-2019 03:24:19                 @Getter(onMethod = @__(@DomainEvents)) final Collection<? extends Object> events;
19-May-2019 03:24:19                                     ^
19-May-2019 03:24:19   symbol:   class __
19-May-2019 03:24:19   location: class EventsWithClearing
19-May-2019 03:24:19 /opt/bamboo-home/xml-data/build-dir/SPRINGDATACMNS-DATACMNS143-JOB1/src/test/java/org/springframework/data/repository/core/support/EventPublishingRepositoryProxyPostProcessorUnitTests.java:282: error: cannot find symbol
19-May-2019 03:24:19                 @Getter(onMethod = @__(@DomainEvents)) Object event;
19-May-2019 03:24:19                                     ^
19-May-2019 03:24:19   symbol:   class __
19-May-2019 03:24:19   location: class OneEvent
19-May-2019 03:24:19 6 errors
19-May-2019 03:24:19 [INFO]
19-May-2019 03:24:19 [INFO] --- maven-resources-plugin:2.6:testResources (default-testResources) @ spring-data-commons ---
19-May-2019 03:24:19 [INFO] Using 'UTF-8' encoding to copy filtered resources.
19-May-2019 03:24:19 [INFO] Copying 11 resources
19-May-2019 03:24:19 [INFO]
19-May-2019 03:24:19 [INFO] --- kotlin-maven-plugin:1.1.61:test-compile (test-compile) @ spring-data-commons ---
19-May-2019 03:24:25 [WARNING] /opt/bamboo-home/xml-data/build-dir/SPRINGDATACMNS-DATACMNS143-JOB1/src/test/kotlin/org/springframework/data/convert/KotlinClassGeneratingEntityInstantiatorUnitTests.kt: (54, 12) Expected type does not accept nulls in Kotlin, but the value may be null in Java
19-May-2019 03:24:25 [WARNING] /opt/bamboo-home/xml-data/build-dir/SPRINGDATACMNS-DATACMNS143-JOB1/src/test/kotlin/org/springframework/data/convert/KotlinClassGeneratingEntityInstantiatorUnitTests.kt: (73, 12) Expected type does not accept nulls in Kotlin, but the value may be null in Java
19-May-2019 03:24:25 [WARNING] /opt/bamboo-home/xml-data/build-dir/SPRINGDATACMNS-DATACMNS143-JOB1/src/test/kotlin/org/springframework/data/convert/KotlinClassGeneratingEntityInstantiatorUnitTests.kt: (92, 12) Expected type does not accept nulls in Kotlin, but the value may be null in Java
19-May-2019 03:24:25 [WARNING] /opt/bamboo-home/xml-data/build-dir/SPRINGDATACMNS-DATACMNS143-JOB1/src/test/kotlin/org/springframework/data/convert/KotlinClassGeneratingEntityInstantiatorUnitTests.kt: (107, 12) Expected type does not accept nulls in Kotlin, but the value may be null in Java
19-May-2019 03:24:25 [WARNING] /opt/bamboo-home/xml-data/build-dir/SPRINGDATACMNS-DATACMNS143-JOB1/src/test/kotlin/org/springframework/data/convert/KotlinClassGeneratingEntityInstantiatorUnitTests.kt: (129, 12) Expected type does not accept nulls in Kotlin, but the value may be null in Java
19-May-2019 03:24:25 [WARNING] /opt/bamboo-home/xml-data/build-dir/SPRINGDATACMNS-DATACMNS143-JOB1/src/test/kotlin/org/springframework/data/mapping/context/TypeCreatingSyntheticClass.kt: (24, 12) Parameter 'args' is never used
19-May-2019 03:24:25 [WARNING] /opt/bamboo-home/xml-data/build-dir/SPRINGDATACMNS-DATACMNS143-JOB1/src/test/kotlin/org/springframework/data/mapping/model/PreferredConstructorDiscovererUnitTests.kt: (35, 25) Expected type does not accept nulls in Kotlin, but the value may be null in Java
19-May-2019 03:24:25 [WARNING] /opt/bamboo-home/xml-data/build-dir/SPRINGDATACMNS-DATACMNS143-JOB1/src/test/kotlin/org/springframework/data/mapping/model/PreferredConstructorDiscovererUnitTests.kt: (43, 25) Expected type does not accept nulls in Kotlin, but the value may be null in Java
19-May-2019 03:24:25 [WARNING] /opt/bamboo-home/xml-data/build-dir/SPRINGDATACMNS-DATACMNS143-JOB1/src/test/kotlin/org/springframework/data/mapping/model/PreferredConstructorDiscovererUnitTests.kt: (51, 25) Expected type does not accept nulls in Kotlin, but the value may be null in Java
19-May-2019 03:24:25 [WARNING] /opt/bamboo-home/xml-data/build-dir/SPRINGDATACMNS-DATACMNS143-JOB1/src/test/kotlin/org/springframework/data/mapping/model/PreferredConstructorDiscovererUnitTests.kt: (59, 25) Expected type does not accept nulls in Kotlin, but the value may be null in Java
19-May-2019 03:24:25 [WARNING] /opt/bamboo-home/xml-data/build-dir/SPRINGDATACMNS-DATACMNS143-JOB1/src/test/kotlin/org/springframework/data/mapping/model/PreferredConstructorDiscovererUnitTests.kt: (67, 25) Expected type does not accept nulls in Kotlin, but the value may be null in Java
19-May-2019 03:24:25 [WARNING] /opt/bamboo-home/xml-data/build-dir/SPRINGDATACMNS-DATACMNS143-JOB1/src/test/kotlin/org/springframework/data/mapping/model/PreferredConstructorDiscovererUnitTests.kt: (75, 25) Expected type does not accept nulls in Kotlin, but the value may be null in Java
19-May-2019 03:24:25 [WARNING] /opt/bamboo-home/xml-data/build-dir/SPRINGDATACMNS-DATACMNS143-JOB1/src/test/kotlin/org/springframework/data/mapping/model/PreferredConstructorDiscovererUnitTests.kt: (103, 34) Parameter 'lastname' is never used
19-May-2019 03:24:25 [WARNING] /opt/bamboo-home/xml-data/build-dir/SPRINGDATACMNS-DATACMNS143-JOB1/src/test/kotlin/org/springframework/data/mapping/model/PreferredConstructorDiscovererUnitTests.kt: (109, 34) Parameter 'lastname' is never used
19-May-2019 03:24:25 [WARNING] /opt/bamboo-home/xml-data/build-dir/SPRINGDATACMNS-DATACMNS143-JOB1/src/test/kotlin/org/springframework/data/mapping/model/PreferredConstructorDiscovererUnitTests.kt: (118, 68) Parameter 'age' is never used
19-May-2019 03:24:25 [WARNING] /opt/bamboo-home/xml-data/build-dir/SPRINGDATACMNS-DATACMNS143-JOB1/src/test/kotlin/org/springframework/data/mapping/model/TypeCreatingSyntheticClass.kt: (24, 12) Parameter 'args' is never used
19-May-2019 03:24:25 [WARNING] /opt/bamboo-home/xml-data/build-dir/SPRINGDATACMNS-DATACMNS143-JOB1/src/test/kotlin/org/springframework/data/util/TypeCreatingSyntheticClass.kt: (24, 12) Parameter 'args' is never used
19-May-2019 03:24:25 [INFO]
19-May-2019 03:24:25 [INFO] --- maven-compiler-plugin:3.6.1:testCompile (java-test-compile) @ spring-data-commons ---
19-May-2019 03:24:25 [INFO] Changes detected - recompiling the module!
19-May-2019 03:24:25 [INFO] Compiling 269 source files to /opt/bamboo-home/xml-data/build-dir/SPRINGDATACMNS-DATACMNS143-JOB1/target/test-classes
19-May-2019 03:24:30 [INFO] /opt/bamboo-home/xml-data/build-dir/SPRINGDATACMNS-DATACMNS143-JOB1/src/test/java/org/springframework/data/mapping/model/AbstractPersistentPropertyUnitTests.java: Some input files use or override a deprecated API.
19-May-2019 03:24:30 [INFO] /opt/bamboo-home/xml-data/build-dir/SPRINGDATACMNS-DATACMNS143-JOB1/src/test/java/org/springframework/data/mapping/model/AbstractPersistentPropertyUnitTests.java: Recompile with -Xlint:deprecation for details.
19-May-2019 03:24:30 [INFO] /opt/bamboo-home/xml-data/build-dir/SPRINGDATACMNS-DATACMNS143-JOB1/src/test/java/org/springframework/data/convert/ParameterizedKotlinInstantiatorUnitTests.java: Some input files use unchecked or unsafe operations.
19-May-2019 03:24:30 [INFO] /opt/bamboo-home/xml-data/build-dir/SPRINGDATACMNS-DATACMNS143-JOB1/src/test/java/org/springframework/data/convert/ParameterizedKotlinInstantiatorUnitTests.java: Recompile with -Xlint:unchecked for details.
19-May-2019 03:24:30 [INFO]
19-May-2019 03:24:30 [INFO] --- maven-surefire-plugin:2.19.1:test (default-test) @ spring-data-commons ---
19-May-2019 03:24:30
19-May-2019 03:24:30 -------------------------------------------------------
19-May-2019 03:24:30 T E S T S
19-May-2019 03:24:30 -------------------------------------------------------
19-May-2019 03:24:31 Running org.springframework.data.config.TypeFilterParserUnitTests
19-May-2019 03:24:32 Tests run: 2, Failures: 0, Errors: 0, Skipped: 0, Time elapsed: 0.775 sec - in org.springframework.data.config.TypeFilterParserUnitTests
19-May-2019 03:24:32 Running org.springframework.data.type.classreading.DefaultMethodsMetadataReaderUnitTests
19-May-2019 03:24:32 Tests run: 4, Failures: 0, Errors: 0, Skipped: 0, Time elapsed: 0.049 sec - in org.springframework.data.type.classreading.DefaultMethodsMetadataReaderUnitTests
19-May-2019 03:24:32 Running org.springframework.data.type.classreading.MethodsMetadataReaderFactoryUnitTests
19-May-2019 03:24:32 Tests run: 4, Failures: 0, Errors: 0, Skipped: 0, Time elapsed: 0.003 sec - in org.springframework.data.type.classreading.MethodsMetadataReaderFactoryUnitTests
19-May-2019 03:24:32 Running org.springframework.data.auditing.config.AuditingBeanDefinitionRegistrarSupportUnitTests
19-May-2019 03:24:32 Tests run: 3, Failures: 0, Errors: 0, Skipped: 0, Time elapsed: 0.038 sec - in org.springframework.data.auditing.config.AuditingBeanDefinitionRegistrarSupportUnitTests
19-May-2019 03:24:32 Running org.springframework.data.auditing.AnnotationAuditingMetadataUnitTests
19-May-2019 03:24:32 Tests run: 4, Failures: 0, Errors: 0, Skipped: 0, Time elapsed: 0.025 sec - in org.springframework.data.auditing.AnnotationAuditingMetadataUnitTests
19-May-2019 03:24:32 Running org.springframework.data.auditing.IsNewAwareAuditingHandlerUnitTests
19-May-2019 03:24:32 Tests run: 13, Failures: 0, Errors: 0, Skipped: 0, Time elapsed: 0.254 sec - in org.springframework.data.auditing.IsNewAwareAuditingHandlerUnitTests
19-May-2019 03:24:32 Running org.springframework.data.auditing.DefaultAuditableBeanWrapperFactoryUnitTests
19-May-2019 03:24:32 Tests run: 10, Failures: 0, Errors: 0, Skipped: 0, Time elapsed: 0.048 sec - in org.springframework.data.auditing.DefaultAuditableBeanWrapperFactoryUnitTests
19-May-2019 03:24:32 Running org.springframework.data.auditing.AuditingHandlerUnitTests
19-May-2019 03:24:32 Tests run: 7, Failures: 0, Errors: 0, Skipped: 0, Time elapsed: 0.007 sec - in org.springframework.data.auditing.AuditingHandlerUnitTests
19-May-2019 03:24:32 Running org.springframework.data.auditing.ReflectionAuditingBeanWrapperUnitTests
19-May-2019 03:24:32 Tests run: 4, Failures: 0, Errors: 0, Skipped: 0, Time elapsed: 0.039 sec - in org.springframework.data.auditing.ReflectionAuditingBeanWrapperUnitTests
19-May-2019 03:24:32 Running org.springframework.data.auditing.MappingAuditableBeanWrapperFactoryUnitTests
19-May-2019 03:24:32 Tests run: 12, Failures: 0, Errors: 0, Skipped: 0, Time elapsed: 0.133 sec - in org.springframework.data.auditing.MappingAuditableBeanWrapperFactoryUnitTests
19-May-2019 03:24:32 Running org.springframework.data.domain.PageRequestUnitTests
19-May-2019 03:24:32 Tests run: 7, Failures: 0, Errors: 0, Skipped: 0, Time elapsed: 0.006 sec - in org.springframework.data.domain.PageRequestUnitTests
19-May-2019 03:24:32 Running org.springframework.data.domain.SortUnitTests
19-May-2019 03:24:32 Tests run: 17, Failures: 0, Errors: 0, Skipped: 0, Time elapsed: 0.005 sec - in org.springframework.data.domain.SortUnitTests
19-May-2019 03:24:32 Running org.springframework.data.domain.ExampleUnitTests
19-May-2019 03:24:32 Tests run: 3, Failures: 0, Errors: 0, Skipped: 0, Time elapsed: 0.005 sec - in org.springframework.data.domain.ExampleUnitTests
19-May-2019 03:24:32 Running org.springframework.data.domain.DirectionUnitTests
19-May-2019 03:24:32 Tests run: 2, Failures: 0, Errors: 0, Skipped: 0, Time elapsed: 0 sec - in org.springframework.data.domain.DirectionUnitTests
19-May-2019 03:24:32 Running org.springframework.data.domain.PageImplUnitTests
19-May-2019 03:24:32 Tests run: 14, Failures: 0, Errors: 0, Skipped: 0, Time elapsed: 0.007 sec - in org.springframework.data.domain.PageImplUnitTests
19-May-2019 03:24:32 Running org.springframework.data.domain.ExampleMatcherUnitTests
19-May-2019 03:24:32 Tests run: 17, Failures: 0, Errors: 0, Skipped: 0, Time elapsed: 0.014 sec - in org.springframework.data.domain.ExampleMatcherUnitTests
19-May-2019 03:24:32 Running org.springframework.data.domain.jaxb.SpringDataJaxbUnitTests
19-May-2019 03:24:33 Tests run: 3, Failures: 0, Errors: 0, Skipped: 0, Time elapsed: 0.185 sec - in org.springframework.data.domain.jaxb.SpringDataJaxbUnitTests
19-May-2019 03:24:33 Running org.springframework.data.domain.RangeUnitTests
19-May-2019 03:24:33 Tests run: 11, Failures: 0, Errors: 0, Skipped: 0, Time elapsed: 0.005 sec - in org.springframework.data.domain.RangeUnitTests
19-May-2019 03:24:33 Running org.springframework.data.domain.AbstractAggregateRootUnitTests
19-May-2019 03:24:33 Tests run: 7, Failures: 0, Errors: 0, Skipped: 0, Time elapsed: 0.002 sec - in org.springframework.data.domain.AbstractAggregateRootUnitTests
19-May-2019 03:24:33 Running org.springframework.data.support.CachingIsNewStrategyFactoryUnitTests
19-May-2019 03:24:33 Tests run: 2, Failures: 0, Errors: 0, Skipped: 0, Time elapsed: 0.011 sec - in org.springframework.data.support.CachingIsNewStrategyFactoryUnitTests
19-May-2019 03:24:33 Running org.springframework.data.support.PersistableIsNewStrategyUnitTests
19-May-2019 03:24:33 Tests run: 2, Failures: 0, Errors: 0, Skipped: 0, Time elapsed: 0.002 sec - in org.springframework.data.support.PersistableIsNewStrategyUnitTests
19-May-2019 03:24:33 Running org.springframework.data.annotation.TypeAliasUnitTests
19-May-2019 03:24:33 Tests run: 1, Failures: 0, Errors: 0, Skipped: 0, Time elapsed: 0.031 sec - in org.springframework.data.annotation.TypeAliasUnitTests
19-May-2019 03:24:33 Running org.springframework.data.DependencyTests
19-May-2019 03:24:35 Tests run: 1, Failures: 0, Errors: 0, Skipped: 0, Time elapsed: 2.113 sec - in org.springframework.data.DependencyTests
19-May-2019 03:24:35 Running org.springframework.data.history.RevisionsUnitTests
19-May-2019 03:24:35 Tests run: 5, Failures: 0, Errors: 0, Skipped: 0, Time elapsed: 0.019 sec - in org.springframework.data.history.RevisionsUnitTests
19-May-2019 03:24:35 Running org.springframework.data.history.AnnotationRevisionMetadataUnitTests
19-May-2019 03:24:36 Tests run: 7, Failures: 0, Errors: 0, Skipped: 0, Time elapsed: 0.771 sec - in org.springframework.data.history.AnnotationRevisionMetadataUnitTests
19-May-2019 03:24:36 Running org.springframework.data.history.RevisionUnitTests
19-May-2019 03:24:36 Tests run: 4, Failures: 0, Errors: 0, Skipped: 0, Time elapsed: 0.002 sec - in org.springframework.data.history.RevisionUnitTests
19-May-2019 03:24:36 Running org.springframework.data.authentication.UserCredentialsUnitTests
19-May-2019 03:24:36 Tests run: 8, Failures: 0, Errors: 0, Skipped: 0, Time elapsed: 0.002 sec - in org.springframework.data.authentication.UserCredentialsUnitTests
19-May-2019 03:24:36 Running org.springframework.data.repository.config.RepositoryConfigurationExtensionSupportUnitTests
19-May-2019 03:24:36 Tests run: 4, Failures: 0, Errors: 0, Skipped: 0, Time elapsed: 0.198 sec - in org.springframework.data.repository.config.RepositoryConfigurationExtensionSupportUnitTests
19-May-2019 03:24:36 Running org.springframework.data.repository.config.RepositoryConfigurationDelegateUnitTests
19-May-2019 03:24:36 Tests run: 1, Failures: 0, Errors: 0, Skipped: 0, Time elapsed: 0.028 sec - in org.springframework.data.repository.config.RepositoryConfigurationDelegateUnitTests
19-May-2019 03:24:36 Running org.springframework.data.repository.config.AnnotationRepositoryConfigurationSourceUnitTests
19-May-2019 03:24:36 Tests run: 9, Failures: 0, Errors: 0, Skipped: 0, Time elapsed: 0.045 sec - in org.springframework.data.repository.config.AnnotationRepositoryConfigurationSourceUnitTests
19-May-2019 03:24:36 Running org.springframework.data.repository.config.XmlRepositoryConfigurationSourceUnitTests
19-May-2019 03:24:36 Tests run: 1, Failures: 0, Errors: 0, Skipped: 0, Time elapsed: 0.064 sec - in org.springframework.data.repository.config.XmlRepositoryConfigurationSourceUnitTests
19-May-2019 03:24:36 Running org.springframework.data.repository.config.SelectionSetUnitTests
19-May-2019 03:24:36 Tests run: 7, Failures: 0, Errors: 0, Skipped: 0, Time elapsed: 0.003 sec - in org.springframework.data.repository.config.SelectionSetUnitTests
19-May-2019 03:24:36 Running org.springframework.data.repository.config.DefaultRepositoryConfigurationUnitTests
19-May-2019 03:24:36 Tests run: 3, Failures: 0, Errors: 0, Skipped: 0, Time elapsed: 0.015 sec - in org.springframework.data.repository.config.DefaultRepositoryConfigurationUnitTests
19-May-2019 03:24:36 Running org.springframework.data.repository.config.RepositoryBeanDefinitionRegistrarSupportUnitTests
19-May-2019 03:24:36 Tests run: 4, Failures: 0, Errors: 0, Skipped: 0, Time elapsed: 0.169 sec - in org.springframework.data.repository.config.RepositoryBeanDefinitionRegistrarSupportUnitTests
19-May-2019 03:24:36 Running org.springframework.data.repository.config.CustomRepositoryImplementationDetectorUnitTests
19-May-2019 03:24:36 Tests run: 4, Failures: 0, Errors: 0, Skipped: 0, Time elapsed: 0.119 sec - in org.springframework.data.repository.config.CustomRepositoryImplementationDetectorUnitTests
19-May-2019 03:24:36 Running org.springframework.data.repository.config.RepositoryBeanNameGeneratorUnitTests
19-May-2019 03:24:36 Tests run: 4, Failures: 0, Errors: 0, Skipped: 0, Time elapsed: 0.002 sec - in org.springframework.data.repository.config.RepositoryBeanNameGeneratorUnitTests
19-May-2019 03:24:36 Running org.springframework.data.repository.config.ResourceReaderRepositoryPopulatorBeanDefinitionParserIntegrationTests
19-May-2019 03:24:37 Tests run: 2, Failures: 0, Errors: 0, Skipped: 0, Time elapsed: 0.386 sec - in org.springframework.data.repository.config.ResourceReaderRepositoryPopulatorBeanDefinitionParserIntegrationTests
19-May-2019 03:24:37 Running org.springframework.data.repository.config.RepositoryBeanDefinitionRegistrarSupportIntegrationTests
19-May-2019 03:24:37 Tests run: 5, Failures: 0, Errors: 0, Skipped: 0, Time elapsed: 0.899 sec - in org.springframework.data.repository.config.RepositoryBeanDefinitionRegistrarSupportIntegrationTests
19-May-2019 03:24:37 Running org.springframework.data.repository.config.RepositoryComponentProviderUnitTests
19-May-2019 03:24:38 Tests run: 5, Failures: 0, Errors: 0, Skipped: 0, Time elapsed: 0.131 sec - in org.springframework.data.repository.config.RepositoryComponentProviderUnitTests
19-May-2019 03:24:38 Running org.springframework.data.repository.support.RepositoriesUnitTests
19-May-2019 03:24:38 Tests run: 8, Failures: 0, Errors: 0, Skipped: 0, Time elapsed: 0.084 sec - in org.springframework.data.repository.support.RepositoriesUnitTests
19-May-2019 03:24:38 Running org.springframework.data.repository.support.CrudRepositoryInvokerUnitTests
19-May-2019 03:24:38 Tests run: 9, Failures: 0, Errors: 0, Skipped: 0, Time elapsed: 0.077 sec - in org.springframework.data.repository.support.CrudRepositoryInvokerUnitTests
19-May-2019 03:24:38 Running org.springframework.data.repository.support.PaginginAndSortingRepositoryInvokerUnitTests
19-May-2019 03:24:38 Tests run: 4, Failures: 0, Errors: 0, Skipped: 0, Time elapsed: 0.047 sec - in org.springframework.data.repository.support.PaginginAndSortingRepositoryInvokerUnitTests
19-May-2019 03:24:38 Running org.springframework.data.repository.support.RepositoriesIntegrationTests
19-May-2019 03:24:38 Tests run: 2, Failures: 0, Errors: 0, Skipped: 0, Time elapsed: 0.1 sec - in org.springframework.data.repository.support.RepositoriesIntegrationTests
19-May-2019 03:24:38 Running org.springframework.data.repository.support.DomainClassConverterUnitTests
19-May-2019 03:24:38 Tests run: 10, Failures: 0, Errors: 0, Skipped: 0, Time elapsed: 0.078 sec - in org.springframework.data.repository.support.DomainClassConverterUnitTests
19-May-2019 03:24:38 Running org.springframework.data.repository.support.ReflectionRepositoryInvokerUnitTests
19-May-2019 03:24:38 Tests run: 19, Failures: 0, Errors: 0, Skipped: 0, Time elapsed: 0.116 sec - in org.springframework.data.repository.support.ReflectionRepositoryInvokerUnitTests
19-May-2019 03:24:38 Running org.springframework.data.repository.support.PageableExecutionUtilsUnitTests
19-May-2019 03:24:38 Tests run: 6, Failures: 0, Errors: 0, Skipped: 0, Time elapsed: 0.007 sec - in org.springframework.data.repository.support.PageableExecutionUtilsUnitTests
19-May-2019 03:24:38 Running org.springframework.data.repository.support.MethodParametersUnitTests
19-May-2019 03:24:38 Tests run: 2, Failures: 0, Errors: 0, Skipped: 0, Time elapsed: 0.002 sec - in org.springframework.data.repository.support.MethodParametersUnitTests
19-May-2019 03:24:38 Running org.springframework.data.repository.support.DefaultRepositoryInvokerFactoryIntegrationTests
19-May-2019 03:24:38 Tests run: 5, Failures: 0, Errors: 0, Skipped: 0, Time elapsed: 0.009 sec - in org.springframework.data.repository.support.DefaultRepositoryInvokerFactoryIntegrationTests
19-May-2019 03:24:38 Running org.springframework.data.repository.support.DomainClassConverterIntegrationTests
19-May-2019 03:24:38 Tests run: 1, Failures: 0, Errors: 0, Skipped: 0, Time elapsed: 0.053 sec - in org.springframework.data.repository.support.DomainClassConverterIntegrationTests
19-May-2019 03:24:38 Running org.springframework.data.repository.support.AnnotationAttributeUnitTests
19-May-2019 03:24:38 Tests run: 3, Failures: 0, Errors: 0, Skipped: 0, Time elapsed: 0.001 sec - in org.springframework.data.repository.support.AnnotationAttributeUnitTests
19-May-2019 03:24:38 Running org.springframework.data.repository.core.support.TransactionRepositoryFactoryBeanSupportUnitTests
19-May-2019 03:24:38 Tests run: 2, Failures: 0, Errors: 0, Skipped: 0, Time elapsed: 0.016 sec - in org.springframework.data.repository.core.support.TransactionRepositoryFactoryBeanSupportUnitTests
19-May-2019 03:24:38 Running org.springframework.data.repository.core.support.TransactionRepositoryProxyPostProcessorUnitTests
19-May-2019 03:24:38 Tests run: 6, Failures: 0, Errors: 0, Skipped: 0, Time elapsed: 0.076 sec - in org.springframework.data.repository.core.support.TransactionRepositoryProxyPostProcessorUnitTests
19-May-2019 03:24:38 Running org.springframework.data.repository.core.support.DefaultRepositoryInformationUnitTests
19-May-2019 03:24:38 Tests run: 18, Failures: 0, Errors: 0, Skipped: 0, Time elapsed: 0.021 sec - in org.springframework.data.repository.core.support.DefaultRepositoryInformationUnitTests
19-May-2019 03:24:38 Running org.springframework.data.repository.core.support.DefaultCrudMethodsUnitTests
19-May-2019 03:24:38 Tests run: 11, Failures: 0, Errors: 0, Skipped: 0, Time elapsed: 0 sec - in org.springframework.data.repository.core.support.DefaultCrudMethodsUnitTests
19-May-2019 03:24:38 Running org.springframework.data.repository.core.support.PersistentEntityInformationUnitTests
19-May-2019 03:24:38 Tests run: 2, Failures: 0, Errors: 0, Skipped: 0, Time elapsed: 0 sec - in org.springframework.data.repository.core.support.PersistentEntityInformationUnitTests
19-May-2019 03:24:38 Running org.springframework.data.repository.core.support.QueryExecutorMethodInterceptorUnitTests
19-May-2019 03:24:38 Tests run: 2, Failures: 0, Errors: 0, Skipped: 0, Time elapsed: 0 sec - in org.springframework.data.repository.core.support.QueryExecutorMethodInterceptorUnitTests
19-May-2019 03:24:38 Running org.springframework.data.repository.core.support.PersistenceExceptionTranslationRepositoryProxyPostProcessorUnitTests
19-May-2019 03:24:38 Tests run: 2, Failures: 0, Errors: 0, Skipped: 0, Time elapsed: 0 sec - in org.springframework.data.repository.core.support.PersistenceExceptionTranslationRepositoryProxyPostProcessorUnitTests
19-May-2019 03:24:38 Running org.springframework.data.repository.core.support.PersistableEntityInformationUnitTests
19-May-2019 03:24:38 Tests run: 3, Failures: 0, Errors: 0, Skipped: 0, Time elapsed: 0 sec - in org.springframework.data.repository.core.support.PersistableEntityInformationUnitTests
19-May-2019 03:24:38 Running org.springframework.data.repository.core.support.RepositoryCompositionUnitTests
19-May-2019 03:24:38 Tests run: 8, Failures: 0, Errors: 0, Skipped: 0, Time elapsed: 0 sec - in org.springframework.data.repository.core.support.RepositoryCompositionUnitTests
19-May-2019 03:24:38 Running org.springframework.data.repository.core.support.ReflectionEntityInformationUnitTests
19-May-2019 03:24:38 Tests run: 4, Failures: 0, Errors: 0, Skipped: 0, Time elapsed: 0 sec - in org.springframework.data.repository.core.support.ReflectionEntityInformationUnitTests
19-May-2019 03:24:38 Running org.springframework.data.repository.core.support.RepositoryFactorySupportUnitTests
19-May-2019 03:24:40 Tests run: 24, Failures: 0, Errors: 0, Skipped: 0, Time elapsed: 1.991 sec - in org.springframework.data.repository.core.support.RepositoryFactorySupportUnitTests
19-May-2019 03:24:40 Running org.springframework.data.repository.core.support.AbstractEntityInformationUnitTests
19-May-2019 03:24:40 Tests run: 5, Failures: 0, Errors: 0, Skipped: 0, Time elapsed: 0.001 sec - in org.springframework.data.repository.core.support.AbstractEntityInformationUnitTests
19-May-2019 03:24:40 Running org.springframework.data.repository.core.support.ReactiveRepositoryInformationUnitTests
19-May-2019 03:24:40 Tests run: 8, Failures: 0, Errors: 0, Skipped: 0, Time elapsed: 0.014 sec - in org.springframework.data.repository.core.support.ReactiveRepositoryInformationUnitTests
19-May-2019 03:24:40 Running org.springframework.data.repository.core.support.ReactiveWrapperRepositoryFactorySupportUnitTests
19-May-2019 03:24:41 Tests run: 5, Failures: 0, Errors: 0, Skipped: 0, Time elapsed: 0.069 sec - in org.springframework.data.repository.core.support.ReactiveWrapperRepositoryFactorySupportUnitTests
19-May-2019 03:24:41 Running org.springframework.data.repository.core.support.RepositoryFactoryBeanSupportUnitTests
19-May-2019 03:24:41 Tests run: 4, Failures: 0, Errors: 0, Skipped: 0, Time elapsed: 0.021 sec - in org.springframework.data.repository.core.support.RepositoryFactoryBeanSupportUnitTests
19-May-2019 03:24:41 Running org.springframework.data.repository.core.support.CustomAnnotationTransactionAttributeSourceUnitTests
19-May-2019 03:24:41 Tests run: 1, Failures: 0, Errors: 0, Skipped: 0, Time elapsed: 0.001 sec - in org.springframework.data.repository.core.support.CustomAnnotationTransactionAttributeSourceUnitTests
19-May-2019 03:24:41 Running org.springframework.data.repository.core.support.AbstractRepositoryMetadataUnitTests
19-May-2019 03:24:41 Tests run: 9, Failures: 0, Errors: 0, Skipped: 0, Time elapsed: 0.007 sec - in org.springframework.data.repository.core.support.AbstractRepositoryMetadataUnitTests
19-May-2019 03:24:41 Running org.springframework.data.repository.core.support.RepositoryFragmentUnitTests
19-May-2019 03:24:41 Tests run: 2, Failures: 0, Errors: 0, Skipped: 0, Time elapsed: 0.002 sec - in org.springframework.data.repository.core.support.RepositoryFragmentUnitTests
19-May-2019 03:24:41 Running org.springframework.data.repository.core.support.ExampleSpecificationAccessorUnitTests
19-May-2019 03:24:41 Tests run: 20, Failures: 0, Errors: 0, Skipped: 0, Time elapsed: 0.008 sec - in org.springframework.data.repository.core.support.ExampleSpecificationAccessorUnitTests
19-May-2019 03:24:41 Running org.springframework.data.repository.core.support.SurroundingTransactionDetectorMethodInterceptorUnitTests
19-May-2019 03:24:41 Tests run: 2, Failures: 0, Errors: 0, Skipped: 0, Time elapsed: 0.001 sec - in org.springframework.data.repository.core.support.SurroundingTransactionDetectorMethodInterceptorUnitTests
19-May-2019 03:24:41 Running org.springframework.data.repository.core.support.QueryExecutionResultHandlerUnitTests
19-May-2019 03:24:41 Tests run: 27, Failures: 0, Errors: 0, Skipped: 0, Time elapsed: 0.283 sec - in org.springframework.data.repository.core.support.QueryExecutionResultHandlerUnitTests
19-May-2019 03:24:41 Running org.springframework.data.repository.core.support.DefaultRepositoryMetadataUnitTests
19-May-2019 03:24:41 Tests run: 12, Failures: 0, Errors: 0, Skipped: 0, Time elapsed: 0.004 sec - in org.springframework.data.repository.core.support.DefaultRepositoryMetadataUnitTests
19-May-2019 03:24:41 Running org.springframework.data.repository.core.support.AnnotationRepositoryMetadataUnitTests
19-May-2019 03:24:41 Tests run: 2, Failures: 0, Errors: 0, Skipped: 0, Time elapsed: 0.001 sec - in org.springframework.data.repository.core.support.AnnotationRepositoryMetadataUnitTests
19-May-2019 03:24:41 Running org.springframework.data.repository.core.support.EventPublishingRepositoryProxyPostProcessorUnitTests
19-May-2019 03:24:41 Tests run: 17, Failures: 0, Errors: 0, Skipped: 0, Time elapsed: 0.03 sec - in org.springframework.data.repository.core.support.EventPublishingRepositoryProxyPostProcessorUnitTests
19-May-2019 03:24:41 Running org.springframework.data.repository.cdi.CdiRepositoryBeanUnitTests
19-May-2019 03:24:41 Tests run: 9, Failures: 0, Errors: 0, Skipped: 0, Time elapsed: 0.039 sec - in org.springframework.data.repository.cdi.CdiRepositoryBeanUnitTests
19-May-2019 03:24:41 Running org.springframework.data.repository.cdi.WebbeansCdiRepositoryExtensionSupportIntegrationTests
19-May-2019 03:24:41 May 19, 2019 3:24:41 AM org.apache.webbeans.lifecycle.AbstractLifeCycle bootstrapApplication
19-May-2019 03:24:41 INFO: OpenWebBeans Container is starting...
19-May-2019 03:24:41 May 19, 2019 3:24:41 AM org.apache.webbeans.config.BeansDeployer validateInjectionPoints
19-May-2019 03:24:41 INFO: All injection points were validated successfully.
19-May-2019 03:24:41 May 19, 2019 3:24:41 AM org.apache.webbeans.lifecycle.AbstractLifeCycle bootstrapApplication
19-May-2019 03:24:41 INFO: OpenWebBeans Container has started, it took [92] ms.
19-May-2019 03:24:41 Tests run: 2, Failures: 0, Errors: 0, Skipped: 0, Time elapsed: 0.217 sec - in org.springframework.data.repository.cdi.WebbeansCdiRepositoryExtensionSupportIntegrationTests
19-May-2019 03:24:41 Running org.springframework.data.repository.init.ResourceReaderRepositoryInitializerUnitTests
19-May-2019 03:24:41 Tests run: 3, Failures: 0, Errors: 0, Skipped: 0, Time elapsed: 0.021 sec - in org.springframework.data.repository.init.ResourceReaderRepositoryInitializerUnitTests
19-May-2019 03:24:41 Running org.springframework.data.repository.init.Jackson2ResourceReaderIntegrationTests
19-May-2019 03:24:41 Tests run: 1, Failures: 0, Errors: 0, Skipped: 0, Time elapsed: 0.047 sec - in org.springframework.data.repository.init.Jackson2ResourceReaderIntegrationTests
19-May-2019 03:24:41 Running org.springframework.data.repository.util.ReactiveWrapperConvertersUnitTests
19-May-2019 03:24:41 Tests run: 30, Failures: 0, Errors: 0, Skipped: 0, Time elapsed: 0.031 sec - in org.springframework.data.repository.util.ReactiveWrapperConvertersUnitTests
19-May-2019 03:24:41 Running org.springframework.data.repository.util.ClassUtilsUnitTests
19-May-2019 03:24:41 Tests run: 3, Failures: 0, Errors: 0, Skipped: 0, Time elapsed: 0.002 sec - in org.springframework.data.repository.util.ClassUtilsUnitTests
19-May-2019 03:24:41 Running org.springframework.data.repository.util.QueryExecutionConvertersUnitTests
19-May-2019 03:24:41 Tests run: 33, Failures: 0, Errors: 0, Skipped: 0, Time elapsed: 0.114 sec - in org.springframework.data.repository.util.QueryExecutionConvertersUnitTests
19-May-2019 03:24:41 Running org.springframework.data.repository.util.ReactiveWrappersUnitTests
19-May-2019 03:24:41 Tests run: 3, Failures: 0, Errors: 0, Skipped: 0, Time elapsed: 0 sec - in org.springframework.data.repository.util.ReactiveWrappersUnitTests
19-May-2019 03:24:41 Running org.springframework.data.repository.query.ParametersParameterAccessorUnitTests
19-May-2019 03:24:41 Tests run: 3, Failures: 0, Errors: 0, Skipped: 0, Time elapsed: 0.003 sec - in org.springframework.data.repository.query.ParametersParameterAccessorUnitTests
19-May-2019 03:24:41 Running org.springframework.data.repository.query.ParametersUnitTests
19-May-2019 03:24:41 Tests run: 16, Failures: 0, Errors: 0, Skipped: 0, Time elapsed: 0.007 sec - in org.springframework.data.repository.query.ParametersUnitTests
19-May-2019 03:24:41 Running org.springframework.data.repository.query.ReturnedTypeUnitTests
19-May-2019 03:24:41 Tests run: 13, Failures: 0, Errors: 0, Skipped: 0, Time elapsed: 0.021 sec - in org.springframework.data.repository.query.ReturnedTypeUnitTests
19-May-2019 03:24:41 Running org.springframework.data.repository.query.ResultProcessorUnitTests
19-May-2019 03:24:41 Tests run: 20, Failures: 0, Errors: 0, Skipped: 0, Time elapsed: 0.088 sec - in org.springframework.data.repository.query.ResultProcessorUnitTests
19-May-2019 03:24:41 Running org.springframework.data.repository.query.SimpleParameterAccessorUnitTests
19-May-2019 03:24:41 Tests run: 9, Failures: 0, Errors: 0, Skipped: 0, Time elapsed: 0.004 sec - in org.springframework.data.repository.query.SimpleParameterAccessorUnitTests
19-May-2019 03:24:41 Running org.springframework.data.repository.query.ExtensionAwareEvaluationContextProviderUnitTests
19-May-2019 03:24:42 Tests run: 17, Failures: 0, Errors: 0, Skipped: 0, Time elapsed: 0.062 sec - in org.springframework.data.repository.query.ExtensionAwareEvaluationContextProviderUnitTests
19-May-2019 03:24:42 Running org.springframework.data.repository.query.parser.PartTreeUnitTests
19-May-2019 03:24:42 Tests run: 72, Failures: 0, Errors: 0, Skipped: 0, Time elapsed: 0.053 sec - in org.springframework.data.repository.query.parser.PartTreeUnitTests
19-May-2019 03:24:42 Running org.springframework.data.repository.query.parser.OrderBySourceUnitTests
19-May-2019 03:24:42 Tests run: 7, Failures: 0, Errors: 0, Skipped: 0, Time elapsed: 0.019 sec - in org.springframework.data.repository.query.parser.OrderBySourceUnitTests
19-May-2019 03:24:42 Running org.springframework.data.repository.query.EvaluationContextExtensionInformationUnitTests
19-May-2019 03:24:42 Tests run: 1, Failures: 0, Errors: 0, Skipped: 0, Time elapsed: 0.002 sec - in org.springframework.data.repository.query.EvaluationContextExtensionInformationUnitTests
19-May-2019 03:24:42 Running org.springframework.data.repository.query.QueryMethodUnitTests
19-May-2019 03:24:42 Tests run: 20, Failures: 0, Errors: 0, Skipped: 0, Time elapsed: 0.011 sec - in org.springframework.data.repository.query.QueryMethodUnitTests
19-May-2019 03:24:42 Running org.springframework.data.repository.query.ParameterUnitTests
19-May-2019 03:24:42 Tests run: 2, Failures: 0, Errors: 0, Skipped: 0, Time elapsed: 0 sec - in org.springframework.data.repository.query.ParameterUnitTests
19-May-2019 03:24:42 Running org.springframework.data.mapping.MappingMetadataTests
19-May-2019 03:24:42 Tests run: 2, Failures: 0, Errors: 0, Skipped: 0, Time elapsed: 0.009 sec - in org.springframework.data.mapping.MappingMetadataTests
19-May-2019 03:24:42 Running org.springframework.data.mapping.model.IdPropertyIdentifierAccessorUnitTests
19-May-2019 03:24:42 Tests run: 3, Failures: 0, Errors: 0, Skipped: 0, Time elapsed: 0.004 sec - in org.springframework.data.mapping.model.IdPropertyIdentifierAccessorUnitTests
19-May-2019 03:24:42 Running org.springframework.data.mapping.model.SnakeCaseFieldNamingStrategyUnitTests
19-May-2019 03:24:42 Tests run: 1, Failures: 0, Errors: 0, Skipped: 0, Time elapsed: 0.023 sec - in org.springframework.data.mapping.model.SnakeCaseFieldNamingStrategyUnitTests
19-May-2019 03:24:42 Running org.springframework.data.mapping.model.ClassGeneratingPropertyAccessorFactoryDatatypeTests
19-May-2019 03:24:42 Tests run: 272, Failures: 0, Errors: 0, Skipped: 0, Time elapsed: 0.736 sec - in org.springframework.data.mapping.model.ClassGeneratingPropertyAccessorFactoryDatatypeTests
19-May-2019 03:24:42 Running org.springframework.data.mapping.model.PersistentEntityParameterValueProviderUnitTests
19-May-2019 03:24:42 Tests run: 2, Failures: 0, Errors: 0, Skipped: 0, Time elapsed: 0.012 sec - in org.springframework.data.mapping.model.PersistentEntityParameterValueProviderUnitTests
19-May-2019 03:24:42 Running org.springframework.data.mapping.model.PreferredConstructorDiscovererUnitTests
19-May-2019 03:24:42 Tests run: 7, Failures: 0, Errors: 0, Skipped: 0, Time elapsed: 0.034 sec - in org.springframework.data.mapping.model.PreferredConstructorDiscovererUnitTests
19-May-2019 03:24:42 Running org.springframework.data.mapping.model.CamelCaseAbbreviatingFieldNamingStrategyUnitTests
19-May-2019 03:24:42 Tests run: 1, Failures: 0, Errors: 0, Skipped: 0, Time elapsed: 0.002 sec - in org.springframework.data.mapping.model.CamelCaseAbbreviatingFieldNamingStrategyUnitTests
19-May-2019 03:24:42 Running org.springframework.data.mapping.model.BasicPersistentEntityUnitTests
19-May-2019 03:24:42 Tests run: 21, Failures: 0, Errors: 0, Skipped: 1, Time elapsed: 0.024 sec - in org.springframework.data.mapping.model.BasicPersistentEntityUnitTests
19-May-2019 03:24:42 Running org.springframework.data.mapping.model.SpelExpressionParameterProviderUnitTests
19-May-2019 03:24:43 Tests run: 5, Failures: 0, Errors: 0, Skipped: 0, Time elapsed: 0.036 sec - in org.springframework.data.mapping.model.SpelExpressionParameterProviderUnitTests
19-May-2019 03:24:43 Running org.springframework.data.mapping.model.ConvertingPropertyAccessorUnitTests
19-May-2019 03:24:43 Tests run: 8, Failures: 0, Errors: 0, Skipped: 0, Time elapsed: 0.008 sec - in org.springframework.data.mapping.model.ConvertingPropertyAccessorUnitTests
19-May-2019 03:24:43 Running org.springframework.data.mapping.model.ClassGeneratingPropertyAccessorFactoryEntityTypeTests
19-May-2019 03:24:43 Tests run: 2, Failures: 0, Errors: 0, Skipped: 0, Time elapsed: 0.006 sec - in org.springframework.data.mapping.model.ClassGeneratingPropertyAccessorFactoryEntityTypeTests
19-May-2019 03:24:43 Running org.springframework.data.mapping.model.ClassGeneratingPropertyAccessorFactoryTests
19-May-2019 03:24:43 Tests run: 511, Failures: 0, Errors: 0, Skipped: 1, Time elapsed: 0.806 sec - in org.springframework.data.mapping.model.ClassGeneratingPropertyAccessorFactoryTests
19-May-2019 03:24:43 Running org.springframework.data.mapping.model.AnnotationBasedPersistentPropertyUnitTests
19-May-2019 03:24:43 Tests run: 25, Failures: 0, Errors: 0, Skipped: 0, Time elapsed: 0.043 sec - in org.springframework.data.mapping.model.AnnotationBasedPersistentPropertyUnitTests
19-May-2019 03:24:43 Running org.springframework.data.mapping.model.AbstractPersistentPropertyUnitTests
19-May-2019 03:24:43 Tests run: 20, Failures: 0, Errors: 0, Skipped: 0, Time elapsed: 0.021 sec - in org.springframework.data.mapping.model.AbstractPersistentPropertyUnitTests
19-May-2019 03:24:43 Running org.springframework.data.mapping.context.PersistentEntitiesUnitTests
19-May-2019 03:24:43 Tests run: 3, Failures: 0, Errors: 0, Skipped: 0, Time elapsed: 0.035 sec - in org.springframework.data.mapping.context.PersistentEntitiesUnitTests
19-May-2019 03:24:43 Running org.springframework.data.mapping.context.AbstractMappingContextUnitTests
19-May-2019 03:24:44 Tests run: 22, Failures: 0, Errors: 0, Skipped: 0, Time elapsed: 0.058 sec - in org.springframework.data.mapping.context.AbstractMappingContextUnitTests
19-May-2019 03:24:44 Running org.springframework.data.mapping.context.AbstractMappingContextIntegrationTests
19-May-2019 03:24:45 Tests run: 4, Failures: 0, Errors: 0, Skipped: 0, Time elapsed: 1.456 sec - in org.springframework.data.mapping.context.AbstractMappingContextIntegrationTests
19-May-2019 03:24:45 Running org.springframework.data.mapping.context.DefaultPersistenPropertyPathUnitTests
19-May-2019 03:24:45 Tests run: 14, Failures: 0, Errors: 0, Skipped: 0, Time elapsed: 0.009 sec - in org.springframework.data.mapping.context.DefaultPersistenPropertyPathUnitTests
19-May-2019 03:24:45 Running org.springframework.data.mapping.context.MappingContextEventUnitTests
19-May-2019 03:24:45 Tests run: 3, Failures: 0, Errors: 0, Skipped: 0, Time elapsed: 0.025 sec - in org.springframework.data.mapping.context.MappingContextEventUnitTests
19-May-2019 03:24:45 Running org.springframework.data.mapping.context.MappingContextIsNewStrategyFactoryUnitTests
19-May-2019 03:24:45 Tests run: 4, Failures: 0, Errors: 0, Skipped: 0, Time elapsed: 0.011 sec - in org.springframework.data.mapping.context.MappingContextIsNewStrategyFactoryUnitTests
19-May-2019 03:24:45 Running org.springframework.data.mapping.context.PropertyMatchUnitTests
19-May-2019 03:24:45 Tests run: 5, Failures: 0, Errors: 0, Skipped: 0, Time elapsed: 0 sec - in org.springframework.data.mapping.context.PropertyMatchUnitTests
19-May-2019 03:24:45 Running org.springframework.data.mapping.PreferredConstructorDiscovererUnitTests
19-May-2019 03:24:45 Tests run: 6, Failures: 0, Errors: 0, Skipped: 0, Time elapsed: 0.004 sec - in org.springframework.data.mapping.PreferredConstructorDiscovererUnitTests
19-May-2019 03:24:45 Running org.springframework.data.mapping.TargetAwareIdentifierAccessorUnitTests
19-May-2019 03:24:45 Tests run: 1, Failures: 0, Errors: 0, Skipped: 0, Time elapsed: 0 sec - in org.springframework.data.mapping.TargetAwareIdentifierAccessorUnitTests
19-May-2019 03:24:45 Running org.springframework.data.mapping.PropertyReferenceExceptionUnitTests
19-May-2019 03:24:45 Tests run: 4, Failures: 0, Errors: 0, Skipped: 0, Time elapsed: 0.002 sec - in org.springframework.data.mapping.PropertyReferenceExceptionUnitTests
19-May-2019 03:24:45 Running org.springframework.data.mapping.ParameterUnitTests
19-May-2019 03:24:45 Tests run: 5, Failures: 0, Errors: 0, Skipped: 0, Time elapsed: 0.002 sec - in org.springframework.data.mapping.ParameterUnitTests
19-May-2019 03:24:45 Running org.springframework.data.mapping.SimpleTypeHolderUnitTests
19-May-2019 03:24:45 Tests run: 15, Failures: 0, Errors: 0, Skipped: 0, Time elapsed: 0.004 sec - in org.springframework.data.mapping.SimpleTypeHolderUnitTests
19-May-2019 03:24:45 Running org.springframework.data.mapping.PropertyPathUnitTests
19-May-2019 03:24:45 Tests run: 38, Failures: 0, Errors: 0, Skipped: 0, Time elapsed: 0.024 sec - in org.springframework.data.mapping.PropertyPathUnitTests
19-May-2019 03:24:45 Running org.springframework.data.web.config.SpringDataWebConfigurationIntegrationTests
19-May-2019 03:24:45 Tests run: 6, Failures: 0, Errors: 0, Skipped: 0, Time elapsed: 0.127 sec - in org.springframework.data.web.config.SpringDataWebConfigurationIntegrationTests
19-May-2019 03:24:45 Running org.springframework.data.web.config.EnableSpringDataWebSupportIntegrationTests
19-May-2019 03:24:46 Tests run: 11, Failures: 0, Errors: 0, Skipped: 0, Time elapsed: 0.734 sec - in org.springframework.data.web.config.EnableSpringDataWebSupportIntegrationTests
19-May-2019 03:24:46 Running org.springframework.data.web.config.PageableResourcesAssemblerIntegrationTests
19-May-2019 03:24:46 Tests run: 3, Failures: 0, Errors: 0, Skipped: 0, Time elapsed: 0.062 sec - in org.springframework.data.web.config.PageableResourcesAssemblerIntegrationTests
19-May-2019 03:24:46 Running org.springframework.data.web.JsonProjectingMethodInterceptorFactoryUnitTests
19-May-2019 03:24:46 Tests run: 14, Failures: 0, Errors: 0, Skipped: 0, Time elapsed: 0.067 sec - in org.springframework.data.web.JsonProjectingMethodInterceptorFactoryUnitTests
19-May-2019 03:24:46 Running org.springframework.data.web.MapDataBinderUnitTests
19-May-2019 03:24:46 Tests run: 6, Failures: 0, Errors: 0, Skipped: 0, Time elapsed: 0.018 sec - in org.springframework.data.web.MapDataBinderUnitTests
19-May-2019 03:24:46 Running org.springframework.data.web.HateoasPageableHandlerMethodArgumentResolverUnitTests
19-May-2019 03:24:46 Tests run: 36, Failures: 0, Errors: 0, Skipped: 0, Time elapsed: 0.02 sec - in org.springframework.data.web.HateoasPageableHandlerMethodArgumentResolverUnitTests
19-May-2019 03:24:46 Running org.springframework.data.web.SortHandlerMethodArgumentResolverUnitTests
19-May-2019 03:24:46 Tests run: 21, Failures: 0, Errors: 0, Skipped: 0, Time elapsed: 0.008 sec - in org.springframework.data.web.SortHandlerMethodArgumentResolverUnitTests
19-May-2019 03:24:46 Running org.springframework.data.web.PagedResourcesAssemblerArgumentResolverUnitTests
19-May-2019 03:24:46 Tests run: 10, Failures: 0, Errors: 0, Skipped: 0, Time elapsed: 0.014 sec - in org.springframework.data.web.PagedResourcesAssemblerArgumentResolverUnitTests
19-May-2019 03:24:46 Running org.springframework.data.web.HateoasSortHandlerMethodArgumentResolverUnitTests
19-May-2019 03:24:46 Tests run: 24, Failures: 0, Errors: 0, Skipped: 0, Time elapsed: 0.009 sec - in org.springframework.data.web.HateoasSortHandlerMethodArgumentResolverUnitTests
19-May-2019 03:24:46 Running org.springframework.data.web.XmlBeamHttpMessageConverterUnitTests
19-May-2019 03:24:46 [Fatal Error] :2:10: DOCTYPE is disallowed when the feature "http://apache.org/xml/features/disallow-doctype-decl" set to true.
19-May-2019 03:24:46 Tests run: 7, Failures: 0, Errors: 0, Skipped: 0, Time elapsed: 0.073 sec - in org.springframework.data.web.XmlBeamHttpMessageConverterUnitTests
19-May-2019 03:24:46 Running org.springframework.data.web.PageableHandlerMethodArgumentResolverUnitTests
19-May-2019 03:24:46 Tests run: 29, Failures: 0, Errors: 0, Skipped: 0, Time elapsed: 0.01 sec - in org.springframework.data.web.PageableHandlerMethodArgumentResolverUnitTests
19-May-2019 03:24:46 Running org.springframework.data.web.ProxyingHandlerMethodArgumentResolverUnitTests
19-May-2019 03:24:46 Tests run: 4, Failures: 0, Errors: 0, Skipped: 0, Time elapsed: 0.003 sec - in org.springframework.data.web.ProxyingHandlerMethodArgumentResolverUnitTests
19-May-2019 03:24:46 Running org.springframework.data.web.PagedResourcesAssemblerUnitTests
19-May-2019 03:24:46 Tests run: 19, Failures: 0, Errors: 0, Skipped: 0, Time elapsed: 0.014 sec - in org.springframework.data.web.PagedResourcesAssemblerUnitTests
19-May-2019 03:24:46 Running org.springframework.data.web.querydsl.QuerydslPredicateArgumentResolverUnitTests
19-May-2019 03:24:46 Tests run: 14, Failures: 0, Errors: 0, Skipped: 0, Time elapsed: 0.093 sec - in org.springframework.data.web.querydsl.QuerydslPredicateArgumentResolverUnitTests
19-May-2019 03:24:46 Running org.springframework.data.web.ProjectingJackson2HttpMessageConverterUnitTests
19-May-2019 03:24:46 Tests run: 5, Failures: 0, Errors: 0, Skipped: 0, Time elapsed: 0.006 sec - in org.springframework.data.web.ProjectingJackson2HttpMessageConverterUnitTests
19-May-2019 03:24:46 Running org.springframework.data.convert.SimpleTypeInformationMapperUnitTests
19-May-2019 03:24:46 Tests run: 5, Failures: 0, Errors: 0, Skipped: 0, Time elapsed: 0.002 sec - in org.springframework.data.convert.SimpleTypeInformationMapperUnitTests
19-May-2019 03:24:46 Running org.springframework.data.convert.ParameterizedKotlinInstantiatorUnitTests
19-May-2019 03:24:47 Tests run: 260, Failures: 0, Errors: 0, Skipped: 0, Time elapsed: 0.208 sec - in org.springframework.data.convert.ParameterizedKotlinInstantiatorUnitTests
19-May-2019 03:24:47 Running org.springframework.data.convert.KotlinClassGeneratingEntityInstantiatorUnitTests
19-May-2019 03:24:47 Tests run: 5, Failures: 0, Errors: 0, Skipped: 0, Time elapsed: 0.051 sec - in org.springframework.data.convert.KotlinClassGeneratingEntityInstantiatorUnitTests
19-May-2019 03:24:47 Running org.springframework.data.convert.ReflectionEntityInstantiatorUnitTests
19-May-2019 03:24:47 Tests run: 6, Failures: 0, Errors: 0, Skipped: 0, Time elapsed: 0.005 sec - in org.springframework.data.convert.ReflectionEntityInstantiatorUnitTests
19-May-2019 03:24:47 Running org.springframework.data.convert.ClassGeneratingEntityInstantiatorUnitTests
19-May-2019 03:24:47 Tests run: 20, Failures: 0, Errors: 0, Skipped: 0, Time elapsed: 0.019 sec - in org.springframework.data.convert.ClassGeneratingEntityInstantiatorUnitTests
19-May-2019 03:24:47 Running org.springframework.data.convert.ConverterBuilderUnitTests
19-May-2019 03:24:47 Tests run: 4, Failures: 0, Errors: 0, Skipped: 0, Time elapsed: 0.004 sec - in org.springframework.data.convert.ConverterBuilderUnitTests
19-May-2019 03:24:47 Running org.springframework.data.convert.MappingContextTypeInformationMapperUnitTests
19-May-2019 03:24:47 Tests run: 6, Failures: 0, Errors: 0, Skipped: 0, Time elapsed: 0.025 sec - in org.springframework.data.convert.MappingContextTypeInformationMapperUnitTests
19-May-2019 03:24:47 Running org.springframework.data.convert.DefaultTypeMapperUnitTests
19-May-2019 03:24:47 Tests run: 3, Failures: 0, Errors: 0, Skipped: 0, Time elapsed: 0.015 sec - in org.springframework.data.convert.DefaultTypeMapperUnitTests
19-May-2019 03:24:47 Running org.springframework.data.convert.ReflectionEntityInstantiatorDataClassUnitTests
19-May-2019 03:24:47 Tests run: 2, Failures: 0, Errors: 0, Skipped: 0, Time elapsed: 0.004 sec - in org.springframework.data.convert.ReflectionEntityInstantiatorDataClassUnitTests
19-May-2019 03:24:47 Running org.springframework.data.convert.ConfigurableTypeInformationMapperUnitTests
19-May-2019 03:24:47 Tests run: 4, Failures: 0, Errors: 0, Skipped: 0, Time elapsed: 0.002 sec - in org.springframework.data.convert.ConfigurableTypeInformationMapperUnitTests
19-May-2019 03:24:47 Running org.springframework.data.convert.CustomConversionsUnitTests
19-May-2019 03:24:47 Tests run: 14, Failures: 0, Errors: 0, Skipped: 0, Time elapsed: 0.026 sec - in org.springframework.data.convert.CustomConversionsUnitTests
19-May-2019 03:24:47 Running org.springframework.data.convert.ThreeTenBackPortConvertersUnitTests
19-May-2019 03:24:47 Tests run: 9, Failures: 0, Errors: 0, Skipped: 0, Time elapsed: 0.005 sec - in org.springframework.data.convert.ThreeTenBackPortConvertersUnitTests
19-May-2019 03:24:47 Running org.springframework.data.convert.Jsr310ConvertersUnitTests
19-May-2019 03:24:47 Tests run: 20, Failures: 0, Errors: 0, Skipped: 0, Time elapsed: 0.012 sec - in org.springframework.data.convert.Jsr310ConvertersUnitTests
19-May-2019 03:24:47 Running org.springframework.data.convert.EntityInstantiatorsUnitTests
19-May-2019 03:24:47 Tests run: 4, Failures: 0, Errors: 0, Skipped: 0, Time elapsed: 0.007 sec - in org.springframework.data.convert.EntityInstantiatorsUnitTests
19-May-2019 03:24:47 Running org.springframework.data.transaction.ChainedTransactionManagerTests
19-May-2019 03:24:47 Tests run: 7, Failures: 0, Errors: 0, Skipped: 0, Time elapsed: 0.006 sec - in org.springframework.data.transaction.ChainedTransactionManagerTests
19-May-2019 03:24:47 Running org.springframework.data.util.AnnotationDetectionFieldCallbackUnitTests
19-May-2019 03:24:47 Tests run: 3, Failures: 0, Errors: 0, Skipped: 0, Time elapsed: 0.001 sec - in org.springframework.data.util.AnnotationDetectionFieldCallbackUnitTests
19-May-2019 03:24:47 Running org.springframework.data.util.ReflectionUtilsUnitTests
19-May-2019 03:24:47 Tests run: 17, Failures: 0, Errors: 0, Skipped: 0, Time elapsed: 0.01 sec - in org.springframework.data.util.ReflectionUtilsUnitTests
19-May-2019 03:24:47 Running org.springframework.data.util.LazyUnitTests
19-May-2019 03:24:47 Tests run: 2, Failures: 0, Errors: 0, Skipped: 0, Time elapsed: 0.005 sec - in org.springframework.data.util.LazyUnitTests
19-May-2019 03:24:47 Running org.springframework.data.util.AnnotatedTypeScannerUnitTests
19-May-2019 03:24:47 Tests run: 1, Failures: 0, Errors: 0, Skipped: 0, Time elapsed: 0.016 sec - in org.springframework.data.util.AnnotatedTypeScannerUnitTests
19-May-2019 03:24:47 Running org.springframework.data.util.ClassTypeInformationUnitTests
19-May-2019 03:24:47 Tests run: 33, Failures: 0, Errors: 0, Skipped: 0, Time elapsed: 0.025 sec - in org.springframework.data.util.ClassTypeInformationUnitTests
19-May-2019 03:24:47 Running org.springframework.data.util.DirectFieldAccessFallbackBeanWrapperUnitTests
19-May-2019 03:24:47 Tests run: 4, Failures: 0, Errors: 0, Skipped: 0, Time elapsed: 0 sec - in org.springframework.data.util.DirectFieldAccessFallbackBeanWrapperUnitTests
19-May-2019 03:24:47 Running org.springframework.data.util.NullableUtilsUnitTests
19-May-2019 03:24:47 Tests run: 10, Failures: 0, Errors: 0, Skipped: 0, Time elapsed: 0.001 sec - in org.springframework.data.util.NullableUtilsUnitTests
19-May-2019 03:24:47 Running org.springframework.data.util.VersionUnitTests
19-May-2019 03:24:47 Tests run: 13, Failures: 0, Errors: 0, Skipped: 0, Time elapsed: 0.005 sec - in org.springframework.data.util.VersionUnitTests
19-May-2019 03:24:47 Running org.springframework.data.util.ParsingUtilsUnitTests
19-May-2019 03:24:47 Tests run: 2, Failures: 0, Errors: 0, Skipped: 0, Time elapsed: 0 sec - in org.springframework.data.util.ParsingUtilsUnitTests
19-May-2019 03:24:47 Running org.springframework.data.util.ParameterizedTypeInformationUnitTests
19-May-2019 03:24:47 Tests run: 10, Failures: 0, Errors: 0, Skipped: 0, Time elapsed: 0.013 sec - in org.springframework.data.util.ParameterizedTypeInformationUnitTests
19-May-2019 03:24:47 Running org.springframework.data.util.DataCmns511Tests
19-May-2019 03:24:47 Tests run: 1, Failures: 0, Errors: 0, Skipped: 0, Time elapsed: 0 sec - in org.springframework.data.util.DataCmns511Tests
19-May-2019 03:24:47 Running org.springframework.data.util.TypeDiscovererUnitTests
19-May-2019 03:24:47 Tests run: 12, Failures: 0, Errors: 0, Skipped: 0, Time elapsed: 0.023 sec - in org.springframework.data.util.TypeDiscovererUnitTests
19-May-2019 03:24:47 Running org.springframework.data.util.PairUnitTests
19-May-2019 03:24:47 Tests run: 5, Failures: 0, Errors: 0, Skipped: 0, Time elapsed: 0.001 sec - in org.springframework.data.util.PairUnitTests
19-May-2019 03:24:47 Running org.springframework.data.util.ProxyUtilsUnitTests
19-May-2019 03:24:47 Tests run: 3, Failures: 0, Errors: 0, Skipped: 0, Time elapsed: 0.01 sec - in org.springframework.data.util.ProxyUtilsUnitTests
19-May-2019 03:24:47 Running org.springframework.data.util.StreamUtilsTests
19-May-2019 03:24:47 Tests run: 1, Failures: 0, Errors: 0, Skipped: 0, Time elapsed: 0.002 sec - in org.springframework.data.util.StreamUtilsTests
19-May-2019 03:24:47 Running org.springframework.data.util.AnnotationDetectionMethodCallbackUnitTests
19-May-2019 03:24:47 Tests run: 2, Failures: 0, Errors: 0, Skipped: 0, Time elapsed: 0 sec - in org.springframework.data.util.AnnotationDetectionMethodCallbackUnitTests
19-May-2019 03:24:47 Running org.springframework.data.querydsl.SimpleEntityPathResolverUnitTests
19-May-2019 03:24:47 Tests run: 3, Failures: 0, Errors: 0, Skipped: 0, Time elapsed: 0.001 sec - in org.springframework.data.querydsl.SimpleEntityPathResolverUnitTests
19-May-2019 03:24:47 Running org.springframework.data.querydsl.binding.QuerydslPredicateBuilderUnitTests
19-May-2019 03:24:48 Tests run: 15, Failures: 0, Errors: 0, Skipped: 0, Time elapsed: 0.874 sec - in org.springframework.data.querydsl.binding.QuerydslPredicateBuilderUnitTests
19-May-2019 03:24:48 Running org.springframework.data.querydsl.binding.QuerydslBindingsUnitTests
19-May-2019 03:24:48 Tests run: 22, Failures: 0, Errors: 0, Skipped: 0, Time elapsed: 0.011 sec - in org.springframework.data.querydsl.binding.QuerydslBindingsUnitTests
19-May-2019 03:24:48 Running org.springframework.data.querydsl.binding.QuerydslDefaultBindingUnitTests
19-May-2019 03:24:48 Tests run: 5, Failures: 0, Errors: 0, Skipped: 0, Time elapsed: 0 sec - in org.springframework.data.querydsl.binding.QuerydslDefaultBindingUnitTests
19-May-2019 03:24:48 Running org.springframework.data.querydsl.binding.QuerydslBindingsFactoryUnitTests
19-May-2019 03:24:48 Tests run: 3, Failures: 0, Errors: 0, Skipped: 0, Time elapsed: 0.035 sec - in org.springframework.data.querydsl.binding.QuerydslBindingsFactoryUnitTests
19-May-2019 03:24:48 Running org.springframework.data.querydsl.QSortUnitTests
19-May-2019 03:24:48 Tests run: 12, Failures: 0, Errors: 0, Skipped: 0, Time elapsed: 0.019 sec - in org.springframework.data.querydsl.QSortUnitTests
19-May-2019 03:24:48 Running org.springframework.data.querydsl.QPageRequestUnitTests
19-May-2019 03:24:48 Tests run: 8, Failures: 0, Errors: 0, Skipped: 0, Time elapsed: 0.001 sec - in org.springframework.data.querydsl.QPageRequestUnitTests
19-May-2019 03:24:48 Running org.springframework.data.querydsl.QuerydslUtilsUnitTests
19-May-2019 03:24:48 Tests run: 2, Failures: 0, Errors: 0, Skipped: 0, Time elapsed: 0 sec - in org.springframework.data.querydsl.QuerydslUtilsUnitTests
19-May-2019 03:24:48 Running org.springframework.data.querydsl.QuerydslRepositoryInvokerAdapterUnitTests
19-May-2019 03:24:48 Tests run: 3, Failures: 0, Errors: 0, Skipped: 0, Time elapsed: 0.014 sec - in org.springframework.data.querydsl.QuerydslRepositoryInvokerAdapterUnitTests
19-May-2019 03:24:48 Running org.springframework.data.projection.SpelEvaluatingMethodInterceptorUnitTests
19-May-2019 03:24:48 Tests run: 6, Failures: 0, Errors: 0, Skipped: 0, Time elapsed: 0.01 sec - in org.springframework.data.projection.SpelEvaluatingMethodInterceptorUnitTests
19-May-2019 03:24:48 Running org.springframework.data.projection.ProjectionIntegrationTests
19-May-2019 03:24:48 Tests run: 1, Failures: 0, Errors: 0, Skipped: 0, Time elapsed: 0.013 sec - in org.springframework.data.projection.ProjectionIntegrationTests
19-May-2019 03:24:48 Running org.springframework.data.projection.SpelAwareProxyProjectionFactoryUnitTests
19-May-2019 03:24:48 Tests run: 5, Failures: 0, Errors: 0, Skipped: 0, Time elapsed: 0.008 sec - in org.springframework.data.projection.SpelAwareProxyProjectionFactoryUnitTests
19-May-2019 03:24:48 Running org.springframework.data.projection.MapAccessingMethodInterceptorUnitTests
19-May-2019 03:24:48 Tests run: 6, Failures: 0, Errors: 0, Skipped: 0, Time elapsed: 0.004 sec - in org.springframework.data.projection.MapAccessingMethodInterceptorUnitTests
19-May-2019 03:24:48 Running org.springframework.data.projection.DefaultProjectionInformationUnitTests
19-May-2019 03:24:48 Tests run: 6, Failures: 0, Errors: 0, Skipped: 0, Time elapsed: 0.01 sec - in org.springframework.data.projection.DefaultProjectionInformationUnitTests
19-May-2019 03:24:48 Running org.springframework.data.projection.DefaultMethodInvokingMethodInterceptorUnitTests
19-May-2019 03:24:48 Tests run: 2, Failures: 0, Errors: 0, Skipped: 1, Time elapsed: 0.001 sec - in org.springframework.data.projection.DefaultMethodInvokingMethodInterceptorUnitTests
19-May-2019 03:24:48 Running org.springframework.data.projection.ProxyProjectionFactoryUnitTests
19-May-2019 03:24:48 Tests run: 17, Failures: 0, Errors: 0, Skipped: 0, Time elapsed: 0.019 sec - in org.springframework.data.projection.ProxyProjectionFactoryUnitTests
19-May-2019 03:24:48 Running org.springframework.data.projection.ProjectingMethodInterceptorUnitTests
19-May-2019 03:24:48 Tests run: 9, Failures: 0, Errors: 0, Skipped: 0, Time elapsed: 0.02 sec - in org.springframework.data.projection.ProjectingMethodInterceptorUnitTests
19-May-2019 03:24:48 Running org.springframework.data.projection.PropertyAccessingMethodInterceptorUnitTests
19-May-2019 03:24:48 Tests run: 7, Failures: 0, Errors: 0, Skipped: 0, Time elapsed: 0.005 sec - in org.springframework.data.projection.PropertyAccessingMethodInterceptorUnitTests
19-May-2019 03:24:48 Running org.springframework.data.geo.GeoResultUnitTests
19-May-2019 03:24:48 Tests run: 4, Failures: 0, Errors: 0, Skipped: 0, Time elapsed: 0.005 sec - in org.springframework.data.geo.GeoResultUnitTests
19-May-2019 03:24:48 Running org.springframework.data.geo.GeoModuleIntegrationTests
19-May-2019 03:24:48 Tests run: 5, Failures: 0, Errors: 0, Skipped: 0, Time elapsed: 0.035 sec - in org.springframework.data.geo.GeoModuleIntegrationTests
19-May-2019 03:24:48 Running org.springframework.data.geo.DistanceUnitTests
19-May-2019 03:24:48 Tests run: 12, Failures: 0, Errors: 0, Skipped: 0, Time elapsed: 0.004 sec - in org.springframework.data.geo.DistanceUnitTests
19-May-2019 03:24:48 Running org.springframework.data.geo.PointUnitTests
19-May-2019 03:24:48 Tests run: 4, Failures: 0, Errors: 0, Skipped: 0, Time elapsed: 0.002 sec - in org.springframework.data.geo.PointUnitTests
19-May-2019 03:24:48 Running org.springframework.data.geo.PolygonUnitTests
19-May-2019 03:24:48 Tests run: 5, Failures: 0, Errors: 0, Skipped: 0, Time elapsed: 0.004 sec - in org.springframework.data.geo.PolygonUnitTests
19-May-2019 03:24:48 Running org.springframework.data.geo.format.PointFormatterUnitTests
19-May-2019 03:24:48 Tests run: 11, Failures: 0, Errors: 0, Skipped: 0, Time elapsed: 0.005 sec - in org.springframework.data.geo.format.PointFormatterUnitTests
19-May-2019 03:24:48 Running org.springframework.data.geo.format.DistanceFormatterUnitTests
19-May-2019 03:24:48 Tests run: 19, Failures: 0, Errors: 0, Skipped: 0, Time elapsed: 0.007 sec - in org.springframework.data.geo.format.DistanceFormatterUnitTests
19-May-2019 03:24:48 Running org.springframework.data.geo.BoxUnitTests
19-May-2019 03:24:48 Tests run: 4, Failures: 0, Errors: 0, Skipped: 0, Time elapsed: 0.001 sec - in org.springframework.data.geo.BoxUnitTests
19-May-2019 03:24:48 Running org.springframework.data.geo.GeoResultsUnitTests
19-May-2019 03:24:48 Tests run: 2, Failures: 0, Errors: 0, Skipped: 0, Time elapsed: 0.004 sec - in org.springframework.data.geo.GeoResultsUnitTests
19-May-2019 03:24:48 Running org.springframework.data.geo.CircleUnitTests
19-May-2019 03:24:48 Tests run: 5, Failures: 0, Errors: 0, Skipped: 0, Time elapsed: 0.001 sec - in org.springframework.data.geo.CircleUnitTests
19-May-2019 03:24:48
19-May-2019 03:24:48 Results :
19-May-2019 03:24:48
19-May-2019 03:24:48 Tests run: 2656, Failures: 0, Errors: 0, Skipped: 3
19-May-2019 03:24:48
19-May-2019 03:24:49 [INFO]
19-May-2019 03:24:49 [INFO] --- build-helper-maven-plugin:3.0.0:add-source (add-kotlin-source) @ spring-data-commons ---
19-May-2019 03:24:49 [INFO] Source directory: /opt/bamboo-home/xml-data/build-dir/SPRINGDATACMNS-DATACMNS143-JOB1/src/main/kotlin added.
19-May-2019 03:24:49 [INFO]
19-May-2019 03:24:49 [INFO] --- maven-jar-plugin:3.0.2:jar (default-jar) @ spring-data-commons ---
19-May-2019 03:24:49 [INFO] Building jar: /opt/bamboo-home/xml-data/build-dir/SPRINGDATACMNS-DATACMNS143-JOB1/target/spring-data-commons-2.0.15.BUILD-SNAPSHOT.jar
19-May-2019 03:24:49 [INFO]
19-May-2019 03:24:49 [INFO] >>> maven-source-plugin:3.0.1:jar (attach-sources) > generate-sources @ spring-data-commons >>>
19-May-2019 03:24:49 [INFO]
19-May-2019 03:24:49 [INFO] --- maven-enforcer-plugin:1.4.1:enforce (enforce-maven-version) @ spring-data-commons ---
19-May-2019 03:24:49 [INFO]
19-May-2019 03:24:49 [INFO] --- maven-enforcer-plugin:1.4.1:enforce (enforce-rules) @ spring-data-commons ---
19-May-2019 03:24:49 [INFO]
19-May-2019 03:24:49 [INFO] --- lombok-maven-plugin:1.18.4.0:delombok (default) @ spring-data-commons ---
19-May-2019 03:24:52 [INFO] Delombok complete.
19-May-2019 03:24:52 [INFO]
19-May-2019 03:24:52 [INFO] <<< maven-source-plugin:3.0.1:jar (attach-sources) < generate-sources @ spring-data-commons <<<
19-May-2019 03:24:52 [INFO]
19-May-2019 03:24:52 [INFO]
19-May-2019 03:24:52 [INFO] --- maven-source-plugin:3.0.1:jar (attach-sources) @ spring-data-commons ---
19-May-2019 03:24:52 [INFO] Building jar: /opt/bamboo-home/xml-data/build-dir/SPRINGDATACMNS-DATACMNS143-JOB1/target/spring-data-commons-2.0.15.BUILD-SNAPSHOT-sources.jar
19-May-2019 03:24:52 [INFO]
19-May-2019 03:24:52 [INFO] --- maven-javadoc-plugin:3.1.0:jar (package-javadoc) @ spring-data-commons ---
19-May-2019 03:24:53 [WARNING] Unable to find the resource '${shared.resources}/javadoc/spring-javadoc.css'. Using default Javadoc resources.
19-May-2019 03:24:58 [INFO]
19-May-2019 03:24:58 100 warnings
19-May-2019 03:24:58 [WARNING] Javadoc Warnings
19-May-2019 03:24:58 [WARNING] /opt/bamboo-home/xml-data/build-dir/SPRINGDATACMNS-DATACMNS143-JOB1/target/generated-sources/delombok/org/springframework/data/repository/CrudRepository.java:78: warning - @return tag has no arguments.
19-May-2019 03:24:58 [WARNING] /opt/bamboo-home/xml-data/build-dir/SPRINGDATACMNS-DATACMNS143-JOB1/target/generated-sources/delombok/org/springframework/data/repository/RepositoryDefinition.java:47: warning - @return tag has no arguments.
19-May-2019 03:24:58 [WARNING] /opt/bamboo-home/xml-data/build-dir/SPRINGDATACMNS-DATACMNS143-JOB1/target/generated-sources/delombok/org/springframework/data/repository/RepositoryDefinition.java:55: warning - @return tag has no arguments.
19-May-2019 03:24:58 [WARNING] /opt/bamboo-home/xml-data/build-dir/SPRINGDATACMNS-DATACMNS143-JOB1/target/generated-sources/delombok/org/springframework/data/mapping/Alias.java:121: warning - @return tag has no arguments.
19-May-2019 03:24:58 [WARNING] /opt/bamboo-home/xml-data/build-dir/SPRINGDATACMNS-DATACMNS143-JOB1/target/generated-sources/delombok/org/springframework/data/mapping/PersistentEntity.java:214: warning - @return tag has no arguments.
19-May-2019 03:24:58 [WARNING] /opt/bamboo-home/xml-data/build-dir/SPRINGDATACMNS-DATACMNS143-JOB1/target/generated-sources/delombok/org/springframework/data/mapping/PersistentEntity.java:221: warning - @return tag has no arguments.
19-May-2019 03:24:58 [WARNING] /opt/bamboo-home/xml-data/build-dir/SPRINGDATACMNS-DATACMNS143-JOB1/target/generated-sources/delombok/org/springframework/data/mapping/PersistentProperty.java:63: warning - @return tag has no arguments.
19-May-2019 03:24:58 [WARNING] /opt/bamboo-home/xml-data/build-dir/SPRINGDATACMNS-DATACMNS143-JOB1/target/generated-sources/delombok/org/springframework/data/mapping/PersistentProperty.java:82: warning - @return tag has no arguments.
19-May-2019 03:24:58 [WARNING] /opt/bamboo-home/xml-data/build-dir/SPRINGDATACMNS-DATACMNS143-JOB1/target/generated-sources/delombok/org/springframework/data/mapping/PersistentProperty.java:196: warning - @return tag has no arguments.
19-May-2019 03:24:58 [WARNING] /opt/bamboo-home/xml-data/build-dir/SPRINGDATACMNS-DATACMNS143-JOB1/target/generated-sources/delombok/org/springframework/data/mapping/PersistentProperty.java:203: warning - @return tag has no arguments.
19-May-2019 03:24:58 [WARNING] /opt/bamboo-home/xml-data/build-dir/SPRINGDATACMNS-DATACMNS143-JOB1/target/generated-sources/delombok/org/springframework/data/mapping/PersistentProperty.java:210: warning - @return tag has no arguments.
19-May-2019 03:24:58 [WARNING] /opt/bamboo-home/xml-data/build-dir/SPRINGDATACMNS-DATACMNS143-JOB1/target/generated-sources/delombok/org/springframework/data/mapping/PersistentProperty.java:217: warning - @return tag has no arguments.
19-May-2019 03:24:58 [WARNING] /opt/bamboo-home/xml-data/build-dir/SPRINGDATACMNS-DATACMNS143-JOB1/target/generated-sources/delombok/org/springframework/data/mapping/PersistentProperty.java:224: warning - @return tag has no arguments.
19-May-2019 03:24:58 [WARNING] /opt/bamboo-home/xml-data/build-dir/SPRINGDATACMNS-DATACMNS143-JOB1/target/generated-sources/delombok/org/springframework/data/mapping/PersistentProperty.java:232: warning - @return tag has no arguments.
19-May-2019 03:24:58 [WARNING] /opt/bamboo-home/xml-data/build-dir/SPRINGDATACMNS-DATACMNS143-JOB1/target/generated-sources/delombok/org/springframework/data/mapping/PersistentProperty.java:239: warning - @return tag has no arguments.
19-May-2019 03:24:58 [WARNING] /opt/bamboo-home/xml-data/build-dir/SPRINGDATACMNS-DATACMNS143-JOB1/target/generated-sources/delombok/org/springframework/data/mapping/PersistentProperty.java:272: warning - @return tag has no arguments.
19-May-2019 03:24:58 [WARNING] /opt/bamboo-home/xml-data/build-dir/SPRINGDATACMNS-DATACMNS143-JOB1/target/generated-sources/delombok/org/springframework/data/mapping/PersistentProperty.java:330: warning - @return tag has no arguments.
19-May-2019 03:24:58 [WARNING] /opt/bamboo-home/xml-data/build-dir/SPRINGDATACMNS-DATACMNS143-JOB1/target/generated-sources/delombok/org/springframework/data/mapping/PreferredConstructor.java:73: warning - @return tag has no arguments.
19-May-2019 03:24:58 [WARNING] /opt/bamboo-home/xml-data/build-dir/SPRINGDATACMNS-DATACMNS143-JOB1/target/generated-sources/delombok/org/springframework/data/mapping/PreferredConstructor.java:82: warning - @return tag has no arguments.
19-May-2019 03:24:58 [WARNING] /opt/bamboo-home/xml-data/build-dir/SPRINGDATACMNS-DATACMNS143-JOB1/target/generated-sources/delombok/org/springframework/data/mapping/PreferredConstructor.java:92: warning - @return tag has no arguments.
19-May-2019 03:24:58 [WARNING] /opt/bamboo-home/xml-data/build-dir/SPRINGDATACMNS-DATACMNS143-JOB1/target/generated-sources/delombok/org/springframework/data/mapping/PreferredConstructor.java:102: warning - @return tag has no arguments.
19-May-2019 03:24:58 [WARNING] /opt/bamboo-home/xml-data/build-dir/SPRINGDATACMNS-DATACMNS143-JOB1/target/generated-sources/delombok/org/springframework/data/mapping/PreferredConstructor.java:111: warning - @return tag has no arguments.
19-May-2019 03:24:58 [WARNING] /opt/bamboo-home/xml-data/build-dir/SPRINGDATACMNS-DATACMNS143-JOB1/target/generated-sources/delombok/org/springframework/data/mapping/PreferredConstructor.java:122: warning - @return tag has no arguments.
19-May-2019 03:24:58 [WARNING] /opt/bamboo-home/xml-data/build-dir/SPRINGDATACMNS-DATACMNS143-JOB1/target/generated-sources/delombok/org/springframework/data/mapping/PreferredConstructor.java:156: warning - @return tag has no arguments.
19-May-2019 03:24:58 [WARNING] /opt/bamboo-home/xml-data/build-dir/SPRINGDATACMNS-DATACMNS143-JOB1/target/generated-sources/delombok/org/springframework/data/mapping/PreferredConstructor.java:221: warning - @return tag has no arguments.
19-May-2019 03:24:58 [WARNING] /opt/bamboo-home/xml-data/build-dir/SPRINGDATACMNS-DATACMNS143-JOB1/target/generated-sources/delombok/org/springframework/data/mapping/PreferredConstructor.java:230: warning - @return tag has no arguments.
19-May-2019 03:24:58 [WARNING] /opt/bamboo-home/xml-data/build-dir/SPRINGDATACMNS-DATACMNS143-JOB1/target/generated-sources/delombok/org/springframework/data/mapping/PreferredConstructor.java:239: warning - @return tag has no arguments.
19-May-2019 03:24:58 [WARNING] /opt/bamboo-home/xml-data/build-dir/SPRINGDATACMNS-DATACMNS143-JOB1/target/generated-sources/delombok/org/springframework/data/mapping/PreferredConstructor.java:248: warning - @return tag has no arguments.
19-May-2019 03:24:58 [WARNING] /opt/bamboo-home/xml-data/build-dir/SPRINGDATACMNS-DATACMNS143-JOB1/target/generated-sources/delombok/org/springframework/data/mapping/PreferredConstructor.java:257: warning - @return tag has no arguments.
19-May-2019 03:24:58 [WARNING] /opt/bamboo-home/xml-data/build-dir/SPRINGDATACMNS-DATACMNS143-JOB1/target/generated-sources/delombok/org/springframework/data/mapping/PropertyPath.java:129: warning - @return tag has no arguments.
19-May-2019 03:24:58 [WARNING] /opt/bamboo-home/xml-data/build-dir/SPRINGDATACMNS-DATACMNS143-JOB1/target/generated-sources/delombok/org/springframework/data/mapping/PropertyPath.java:150: warning - @return tag has no arguments.
19-May-2019 03:24:58 [WARNING] /opt/bamboo-home/xml-data/build-dir/SPRINGDATACMNS-DATACMNS143-JOB1/target/generated-sources/delombok/org/springframework/data/mapping/PropertyPath.java:159: warning - @return tag has no arguments.
19-May-2019 03:24:58 [WARNING] /opt/bamboo-home/xml-data/build-dir/SPRINGDATACMNS-DATACMNS143-JOB1/target/generated-sources/delombok/org/springframework/data/mapping/PropertyPath.java:171: warning - @return tag has no arguments.
19-May-2019 03:24:58 [WARNING] /opt/bamboo-home/xml-data/build-dir/SPRINGDATACMNS-DATACMNS143-JOB1/target/generated-sources/delombok/org/springframework/data/mapping/PropertyPath.java:222: warning - @return tag has no arguments.
19-May-2019 03:24:58 [WARNING] /opt/bamboo-home/xml-data/build-dir/SPRINGDATACMNS-DATACMNS143-JOB1/target/generated-sources/delombok/org/springframework/data/mapping/PropertyPath.java:235: warning - @return tag has no arguments.
19-May-2019 03:24:58 [WARNING] /opt/bamboo-home/xml-data/build-dir/SPRINGDATACMNS-DATACMNS143-JOB1/target/generated-sources/delombok/org/springframework/data/util/Streamable.java:53: warning - @return tag has no arguments.
19-May-2019 03:24:58 [WARNING] /opt/bamboo-home/xml-data/build-dir/SPRINGDATACMNS-DATACMNS143-JOB1/target/generated-sources/delombok/org/springframework/data/util/Streamable.java:63: warning - @return tag has no arguments.
19-May-2019 03:24:58 [WARNING] /opt/bamboo-home/xml-data/build-dir/SPRINGDATACMNS-DATACMNS143-JOB1/target/generated-sources/delombok/org/springframework/data/util/Streamable.java:90: warning - @return tag has no arguments.
19-May-2019 03:24:58 [WARNING] /opt/bamboo-home/xml-data/build-dir/SPRINGDATACMNS-DATACMNS143-JOB1/target/generated-sources/delombok/org/springframework/data/util/Streamable.java:104: warning - @return tag has no arguments.
19-May-2019 03:24:58 [WARNING] /opt/bamboo-home/xml-data/build-dir/SPRINGDATACMNS-DATACMNS143-JOB1/target/generated-sources/delombok/org/springframework/data/util/Streamable.java:118: warning - @return tag has no arguments.
19-May-2019 03:24:58 [WARNING] /opt/bamboo-home/xml-data/build-dir/SPRINGDATACMNS-DATACMNS143-JOB1/target/generated-sources/delombok/org/springframework/data/mapping/PropertyReferenceException.java:123: warning - @return tag has no arguments.
19-May-2019 03:24:58 [WARNING] /opt/bamboo-home/xml-data/build-dir/SPRINGDATACMNS-DATACMNS143-JOB1/target/generated-sources/delombok/org/springframework/data/mapping/PropertyReferenceException.java:134: warning - @return tag has no arguments.
19-May-2019 03:24:58 [WARNING] /opt/bamboo-home/xml-data/build-dir/SPRINGDATACMNS-DATACMNS143-JOB1/target/generated-sources/delombok/org/springframework/data/mapping/TargetAwareIdentifierAccessor.java:28: warning - @soundtrack is an unknown tag.
19-May-2019 03:24:58 [WARNING] /opt/bamboo-home/xml-data/build-dir/SPRINGDATACMNS-DATACMNS143-JOB1/target/generated-sources/delombok/org/springframework/data/repository/core/EntityInformation.java:35: warning - @return tag has no arguments.
19-May-2019 03:24:58 [WARNING] /opt/bamboo-home/xml-data/build-dir/SPRINGDATACMNS-DATACMNS143-JOB1/target/generated-sources/delombok/org/springframework/data/repository/core/EntityInformation.java:44: warning - @return tag has no arguments.
19-May-2019 03:24:58 [WARNING] /opt/bamboo-home/xml-data/build-dir/SPRINGDATACMNS-DATACMNS143-JOB1/target/generated-sources/delombok/org/springframework/data/repository/core/EntityInformation.java:72: warning - @return tag has no arguments.
19-May-2019 03:24:58 [WARNING] /opt/bamboo-home/xml-data/build-dir/SPRINGDATACMNS-DATACMNS143-JOB1/target/generated-sources/delombok/org/springframework/data/repository/core/EntityMetadata.java:30: warning - @return tag has no arguments.
19-May-2019 03:24:58 [WARNING] /opt/bamboo-home/xml-data/build-dir/SPRINGDATACMNS-DATACMNS143-JOB1/target/generated-sources/delombok/org/springframework/data/repository/core/support/AbstractRepositoryMetadata.java:69: warning - @return tag has no arguments.
19-May-2019 03:24:58 [WARNING] /opt/bamboo-home/xml-data/build-dir/SPRINGDATACMNS-DATACMNS143-JOB1/target/generated-sources/delombok/org/springframework/data/repository/core/RepositoryMetadata.java:50: warning - @return tag has no arguments.
19-May-2019 03:24:58 [WARNING] /opt/bamboo-home/xml-data/build-dir/SPRINGDATACMNS-DATACMNS143-JOB1/target/generated-sources/delombok/org/springframework/data/repository/core/RepositoryMetadata.java:59: warning - @return tag has no arguments.
19-May-2019 03:24:58 [WARNING] /opt/bamboo-home/xml-data/build-dir/SPRINGDATACMNS-DATACMNS143-JOB1/target/generated-sources/delombok/org/springframework/data/repository/core/RepositoryMetadata.java:66: warning - @return tag has no arguments.
19-May-2019 03:24:58 [WARNING] /opt/bamboo-home/xml-data/build-dir/SPRINGDATACMNS-DATACMNS143-JOB1/target/generated-sources/delombok/org/springframework/data/repository/core/RepositoryMetadata.java:73: warning - @return tag has no arguments.
19-May-2019 03:24:58 [WARNING] /opt/bamboo-home/xml-data/build-dir/SPRINGDATACMNS-DATACMNS143-JOB1/target/generated-sources/delombok/org/springframework/data/repository/core/RepositoryMetadata.java:92: warning - @return tag has no arguments.
19-May-2019 03:24:58 [WARNING] /opt/bamboo-home/xml-data/build-dir/SPRINGDATACMNS-DATACMNS143-JOB1/target/generated-sources/delombok/org/springframework/data/repository/core/CrudMethods.java:48: warning - @return tag has no arguments.
19-May-2019 03:24:58 [WARNING] /opt/bamboo-home/xml-data/build-dir/SPRINGDATACMNS-DATACMNS143-JOB1/target/generated-sources/delombok/org/springframework/data/repository/core/CrudMethods.java:64: warning - @return tag has no arguments.
19-May-2019 03:24:58 [WARNING] /opt/bamboo-home/xml-data/build-dir/SPRINGDATACMNS-DATACMNS143-JOB1/target/generated-sources/delombok/org/springframework/data/repository/core/CrudMethods.java:80: warning - @return tag has no arguments.
19-May-2019 03:24:58 [WARNING] /opt/bamboo-home/xml-data/build-dir/SPRINGDATACMNS-DATACMNS143-JOB1/target/generated-sources/delombok/org/springframework/data/repository/core/CrudMethods.java:95: warning - @return tag has no arguments.
19-May-2019 03:24:58 [WARNING] /opt/bamboo-home/xml-data/build-dir/SPRINGDATACMNS-DATACMNS143-JOB1/target/generated-sources/delombok/org/springframework/data/repository/core/support/EventPublishingRepositoryProxyPostProcessor.java:52: warning - @soundtrack is an unknown tag.
19-May-2019 03:24:58 [WARNING] /opt/bamboo-home/xml-data/build-dir/SPRINGDATACMNS-DATACMNS143-JOB1/target/generated-sources/delombok/org/springframework/data/repository/core/NamedQueries.java:33: warning - @return tag has no arguments.
19-May-2019 03:24:58 [WARNING] /opt/bamboo-home/xml-data/build-dir/SPRINGDATACMNS-DATACMNS143-JOB1/target/generated-sources/delombok/org/springframework/data/repository/core/NamedQueries.java:42: warning - @return tag has no arguments.
19-May-2019 03:24:58 [WARNING] /opt/bamboo-home/xml-data/build-dir/SPRINGDATACMNS-DATACMNS143-JOB1/target/generated-sources/delombok/org/springframework/data/repository/core/support/RepositoryFactorySupport.java:210: warning - @return tag has no arguments.
19-May-2019 03:24:58 [WARNING] /opt/bamboo-home/xml-data/build-dir/SPRINGDATACMNS-DATACMNS143-JOB1/target/generated-sources/delombok/org/springframework/data/repository/core/support/RepositoryFactorySupport.java:234: warning - @return tag has no arguments.
19-May-2019 03:24:58 [WARNING] /opt/bamboo-home/xml-data/build-dir/SPRINGDATACMNS-DATACMNS143-JOB1/target/generated-sources/delombok/org/springframework/data/repository/core/support/RepositoryFactorySupport.java:249: warning - @return tag has no arguments.
19-May-2019 03:24:58 [WARNING] /opt/bamboo-home/xml-data/build-dir/SPRINGDATACMNS-DATACMNS143-JOB1/target/generated-sources/delombok/org/springframework/data/repository/core/support/RepositoryFactorySupport.java:263: warning - @return tag has no arguments.
19-May-2019 03:24:58 [WARNING] /opt/bamboo-home/xml-data/build-dir/SPRINGDATACMNS-DATACMNS143-JOB1/target/generated-sources/delombok/org/springframework/data/repository/core/support/RepositoryFactorySupport.java:316: warning - @return tag has no arguments.
19-May-2019 03:24:58 [WARNING] /opt/bamboo-home/xml-data/build-dir/SPRINGDATACMNS-DATACMNS143-JOB1/target/generated-sources/delombok/org/springframework/data/repository/core/support/RepositoryFactorySupport.java:375: warning - @return tag has no arguments.
19-May-2019 03:24:58 [WARNING] /opt/bamboo-home/xml-data/build-dir/SPRINGDATACMNS-DATACMNS143-JOB1/target/generated-sources/delombok/org/springframework/data/repository/core/support/RepositoryFactorySupport.java:383: warning - @return tag has no arguments.
19-May-2019 03:24:58 [WARNING] /opt/bamboo-home/xml-data/build-dir/SPRINGDATACMNS-DATACMNS143-JOB1/target/generated-sources/delombok/org/springframework/data/repository/core/support/RepositoryFactorySupport.java:392: warning - @return tag has no arguments.
19-May-2019 03:24:58 [WARNING] /opt/bamboo-home/xml-data/build-dir/SPRINGDATACMNS-DATACMNS143-JOB1/target/generated-sources/delombok/org/springframework/data/repository/core/support/RepositoryFactorySupport.java:433: warning - @return tag has no arguments.
19-May-2019 03:24:58 [WARNING] /opt/bamboo-home/xml-data/build-dir/SPRINGDATACMNS-DATACMNS143-JOB1/target/generated-sources/delombok/org/springframework/data/repository/core/support/RepositoryFactorySupport.java:447: warning - @return tag has no arguments.
19-May-2019 03:24:58 [WARNING] /opt/bamboo-home/xml-data/build-dir/SPRINGDATACMNS-DATACMNS143-JOB1/target/generated-sources/delombok/org/springframework/data/repository/core/RepositoryInformation.java:34: warning - @return tag has no arguments.
19-May-2019 03:24:58 [WARNING] /opt/bamboo-home/xml-data/build-dir/SPRINGDATACMNS-DATACMNS143-JOB1/target/generated-sources/delombok/org/springframework/data/repository/core/RepositoryInformation.java:42: warning - @return tag has no arguments.
19-May-2019 03:24:58 [WARNING] /opt/bamboo-home/xml-data/build-dir/SPRINGDATACMNS-DATACMNS143-JOB1/target/generated-sources/delombok/org/springframework/data/repository/core/RepositoryInformation.java:50: warning - @return tag has no arguments.
19-May-2019 03:24:58 [WARNING] /opt/bamboo-home/xml-data/build-dir/SPRINGDATACMNS-DATACMNS143-JOB1/target/generated-sources/delombok/org/springframework/data/repository/core/RepositoryInformation.java:58: warning - @return tag has no arguments.
19-May-2019 03:24:58 [WARNING] /opt/bamboo-home/xml-data/build-dir/SPRINGDATACMNS-DATACMNS143-JOB1/target/generated-sources/delombok/org/springframework/data/repository/core/RepositoryInformation.java:67: warning - @return tag has no arguments.
19-May-2019 03:24:58 [WARNING] /opt/bamboo-home/xml-data/build-dir/SPRINGDATACMNS-DATACMNS143-JOB1/target/generated-sources/delombok/org/springframework/data/repository/core/RepositoryInformation.java:74: warning - @return tag has no arguments.
19-May-2019 03:24:58 [WARNING] /opt/bamboo-home/xml-data/build-dir/SPRINGDATACMNS-DATACMNS143-JOB1/target/generated-sources/delombok/org/springframework/data/repository/core/RepositoryInformation.java:85: warning - @return tag has no arguments.
19-May-2019 03:24:58 [WARNING] /opt/bamboo-home/xml-data/build-dir/SPRINGDATACMNS-DATACMNS143-JOB1/target/generated-sources/delombok/org/springframework/data/repository/core/support/RepositoryComposition.java:181: warning - @return tag has no arguments.
19-May-2019 03:24:58 [WARNING] /opt/bamboo-home/xml-data/build-dir/SPRINGDATACMNS-DATACMNS143-JOB1/target/generated-sources/delombok/org/springframework/data/repository/core/support/RepositoryComposition.java:194: warning - @return tag has no arguments.
19-May-2019 03:24:58 [WARNING] /opt/bamboo-home/xml-data/build-dir/SPRINGDATACMNS-DATACMNS143-JOB1/target/generated-sources/delombok/org/springframework/data/repository/core/support/RepositoryComposition.java:60: warning - @soundtrack is an unknown tag.
19-May-2019 03:24:58 [WARNING] /opt/bamboo-home/xml-data/build-dir/SPRINGDATACMNS-DATACMNS143-JOB1/target/generated-sources/delombok/org/springframework/data/repository/core/support/RepositoryComposition.java:84: warning - Missing closing '}' character for inline tag: "{@link MethodLookups#direct())
19-May-2019 03:24:58 [WARNING] method lookup."
19-May-2019 03:24:58 [WARNING] /opt/bamboo-home/xml-data/build-dir/SPRINGDATACMNS-DATACMNS143-JOB1/target/generated-sources/delombok/org/springframework/data/repository/core/support/RepositoryComposition.java:106: warning - Missing closing '}' character for inline tag: "{@link MethodLookups#direct()) method lookup."
19-May-2019 03:24:58 [WARNING] /opt/bamboo-home/xml-data/build-dir/SPRINGDATACMNS-DATACMNS143-JOB1/target/generated-sources/delombok/org/springframework/data/repository/core/support/RepositoryComposition.java:117: warning - Missing closing '}' character for inline tag: "{@link MethodLookups#direct()) method lookup."
19-May-2019 03:24:58 [WARNING] /opt/bamboo-home/xml-data/build-dir/SPRINGDATACMNS-DATACMNS143-JOB1/target/generated-sources/delombok/org/springframework/data/repository/core/support/RepositoryComposition.java:95: warning - Missing closing '}' character for inline tag: "{@link MethodLookups#direct()) method lookup."
19-May-2019 03:24:58 [WARNING] /opt/bamboo-home/xml-data/build-dir/SPRINGDATACMNS-DATACMNS143-JOB1/target/generated-sources/delombok/org/springframework/data/repository/core/support/RepositoryComposition.java:330: warning - @return tag has no arguments.
19-May-2019 03:24:58 [WARNING] /opt/bamboo-home/xml-data/build-dir/SPRINGDATACMNS-DATACMNS143-JOB1/target/generated-sources/delombok/org/springframework/data/repository/core/support/RepositoryFactoryBeanSupport.java:302: warning - @return tag has no arguments.
19-May-2019 03:24:58 [WARNING] /opt/bamboo-home/xml-data/build-dir/SPRINGDATACMNS-DATACMNS143-JOB1/target/generated-sources/delombok/org/springframework/data/repository/core/support/RepositoryFactoryInformation.java:40: warning - @return tag has no arguments.
19-May-2019 03:24:58 [WARNING] /opt/bamboo-home/xml-data/build-dir/SPRINGDATACMNS-DATACMNS143-JOB1/target/generated-sources/delombok/org/springframework/data/repository/core/support/RepositoryFactoryInformation.java:47: warning - @return tag has no arguments.
19-May-2019 03:24:58 [WARNING] /opt/bamboo-home/xml-data/build-dir/SPRINGDATACMNS-DATACMNS143-JOB1/target/generated-sources/delombok/org/springframework/data/repository/core/support/RepositoryFactoryInformation.java:55: warning - @return tag has no arguments.
19-May-2019 03:24:58 [WARNING] /opt/bamboo-home/xml-data/build-dir/SPRINGDATACMNS-DATACMNS143-JOB1/target/generated-sources/delombok/org/springframework/data/repository/core/support/RepositoryFactoryInformation.java:62: warning - @return tag has no arguments.
19-May-2019 03:24:58 [WARNING] /opt/bamboo-home/xml-data/build-dir/SPRINGDATACMNS-DATACMNS143-JOB1/target/generated-sources/delombok/org/springframework/data/repository/core/support/RepositoryFactoryBeanSupport.java:105: warning - Tag @link: reference not found: QueryLookupStrategy.Key
19-May-2019 03:24:58 [WARNING] /opt/bamboo-home/xml-data/build-dir/SPRINGDATACMNS-DATACMNS143-JOB1/target/generated-sources/delombok/org/springframework/data/repository/core/support/RepositoryFactoryBeanSupport.java:105: warning - Tag @link: reference not found: QueryLookupStrategy.Key
19-May-2019 03:24:58 [WARNING] /opt/bamboo-home/xml-data/build-dir/SPRINGDATACMNS-DATACMNS143-JOB1/target/generated-sources/delombok/org/springframework/data/repository/core/support/RepositoryFactorySupport.java:76: warning - Tag @link: reference not found: QueryLookupStrategy.Key
19-May-2019 03:24:58 [WARNING] /opt/bamboo-home/xml-data/build-dir/SPRINGDATACMNS-DATACMNS143-JOB1/target/generated-sources/delombok/org/springframework/data/repository/core/support/RepositoryFactorySupport.java:249: warning - Tag @link: can't find getRepository(Class, RepositoryFragments) in org.springframework.data.repository.core.support.RepositoryFactorySupport
19-May-2019 03:24:58 [WARNING] /opt/bamboo-home/xml-data/build-dir/SPRINGDATACMNS-DATACMNS143-JOB1/target/generated-sources/delombok/org/springframework/data/repository/core/support/RepositoryFragment.java:54: warning - @return tag has no arguments.
19-May-2019 03:24:58 [WARNING] /opt/bamboo-home/xml-data/build-dir/SPRINGDATACMNS-DATACMNS143-JOB1/target/generated-sources/delombok/org/springframework/data/repository/core/support/RepositoryFragment.java:65: warning - @return tag has no arguments.
19-May-2019 03:24:58 [WARNING] /opt/bamboo-home/xml-data/build-dir/SPRINGDATACMNS-DATACMNS143-JOB1/target/generated-sources/delombok/org/springframework/data/repository/core/support/RepositoryFragment.java:75: warning - @return tag has no arguments.
19-May-2019 03:24:58 [WARNING] /opt/bamboo-home/xml-data/build-dir/SPRINGDATACMNS-DATACMNS143-JOB1/target/generated-sources/delombok/org/springframework/data/repository/core/support/SurroundingTransactionDetectorMethodInterceptor.java:46: warning - @return tag has no arguments.
19-May-2019 03:24:58 [WARNING] /opt/bamboo-home/xml-data/build-dir/SPRINGDATACMNS-DATACMNS143-JOB1/target/generated-sources/delombok/org/springframework/data/repository/core/support/SurroundingTransactionDetectorMethodInterceptor.java:35: warning - @soundtrack is an unknown tag.
19-May-2019 03:24:58 [WARNING] /opt/bamboo-home/xml-data/build-dir/SPRINGDATACMNS-DATACMNS143-JOB1/target/generated-sources/delombok/org/springframework/data/repository/core/support/TransactionalRepositoryFactoryBeanSupport.java:102: warning - @return tag has no arguments.
19-May-2019 03:24:58 [INFO] Building jar: /opt/bamboo-home/xml-data/build-dir/SPRINGDATACMNS-DATACMNS143-JOB1/target/spring-data-commons-2.0.15.BUILD-SNAPSHOT-javadoc.jar
19-May-2019 03:24:58 [INFO]
19-May-2019 03:24:58 [INFO] --- maven-install-plugin:2.4:install (default-install) @ spring-data-commons ---
19-May-2019 03:24:58 [INFO] Installing /opt/bamboo-home/xml-data/build-dir/SPRINGDATACMNS-DATACMNS143-JOB1/target/spring-data-commons-2.0.15.BUILD-SNAPSHOT.jar to /home/bamboo/.m2/repository/org/springframework/data/spring-data-commons/2.0.15.BUILD-SNAPSHOT/spring-data-commons-2.0.15.BUILD-SNAPSHOT.jar
19-May-2019 03:24:58 [INFO] Installing /opt/bamboo-home/xml-data/build-dir/SPRINGDATACMNS-DATACMNS143-JOB1/pom.xml to /home/bamboo/.m2/repository/org/springframework/data/spring-data-commons/2.0.15.BUILD-SNAPSHOT/spring-data-commons-2.0.15.BUILD-SNAPSHOT.pom
19-May-2019 03:24:58 [INFO] Installing /opt/bamboo-home/xml-data/build-dir/SPRINGDATACMNS-DATACMNS143-JOB1/target/spring-data-commons-2.0.15.BUILD-SNAPSHOT-sources.jar to /home/bamboo/.m2/repository/org/springframework/data/spring-data-commons/2.0.15.BUILD-SNAPSHOT/spring-data-commons-2.0.15.BUILD-SNAPSHOT-sources.jar
19-May-2019 03:24:58 [INFO] Installing /opt/bamboo-home/xml-data/build-dir/SPRINGDATACMNS-DATACMNS143-JOB1/target/spring-data-commons-2.0.15.BUILD-SNAPSHOT-javadoc.jar to /home/bamboo/.m2/repository/org/springframework/data/spring-data-commons/2.0.15.BUILD-SNAPSHOT/spring-data-commons-2.0.15.BUILD-SNAPSHOT-javadoc.jar
19-May-2019 03:24:59 [INFO] Artifactory Build Info Recorder: Saving Build Info to '/opt/bamboo-home/xml-data/build-dir/SPRINGDATACMNS-DATACMNS143-JOB1/target/build-info.json'
19-May-2019 03:24:59 [INFO] Deploying artifact: https://repo.spring.io/libs-snapshot-local/org/springframework/data/spring-data-commons/2.0.15.BUILD-SNAPSHOT/spring-data-commons-2.0.15.BUILD-SNAPSHOT-sources.jar
19-May-2019 03:25:00 [INFO] Deploying artifact: https://repo.spring.io/libs-snapshot-local/org/springframework/data/spring-data-commons/2.0.15.BUILD-SNAPSHOT/spring-data-commons-2.0.15.BUILD-SNAPSHOT.jar
19-May-2019 03:25:01 [INFO] Deploying artifact: https://repo.spring.io/libs-snapshot-local/org/springframework/data/spring-data-commons/2.0.15.BUILD-SNAPSHOT/spring-data-commons-2.0.15.BUILD-SNAPSHOT-javadoc.jar
19-May-2019 03:25:01 [INFO] Deploying artifact: https://repo.spring.io/libs-snapshot-local/org/springframework/data/spring-data-commons/2.0.15.BUILD-SNAPSHOT/spring-data-commons-2.0.15.BUILD-SNAPSHOT.pom
19-May-2019 03:25:01 [INFO] Artifactory Build Info Recorder: Deploying build info ...
19-May-2019 03:25:02 [INFO] Deploying build descriptor to: https://repo.spring.io/api/build
19-May-2019 03:25:02 [INFO] Build successfully deployed. Browse it in Artifactory under https://repo.spring.io/webapp/builds/Spring%20Data%20Commons%20-%20Spring%20Data%20Commons%20-%202.0.x%20-%20Default%20Job/742
19-May-2019 03:25:02 [INFO] ------------------------------------------------------------------------
19-May-2019 03:25:02 [INFO] BUILD SUCCESS
19-May-2019 03:25:02 [INFO] ------------------------------------------------------------------------
19-May-2019 03:25:02 [INFO] Total time: 56.760 s
19-May-2019 03:25:02 [INFO] Finished at: 2019-05-19T03:25:02Z
19-May-2019 03:25:02 [INFO] Final Memory: 118M/1442M
19-May-2019 03:25:02 [INFO] ------------------------------------------------------------------------
19-May-2019 03:25:02 Parsing test results under /opt/bamboo-home/xml-data/build-dir/SPRINGDATACMNS-DATACMNS143-JOB1...
19-May-2019 03:25:03 Finished task 'Build, test and install' with result: Success
19-May-2019 03:25:03 Running post build plugin 'Docker Container Cleanup'
19-May-2019 03:25:03 Running post build plugin 'NCover Results Collector'
19-May-2019 03:25:03 Running post build plugin 'Artifactory Release Management Staging'
19-May-2019 03:25:03 Running post build plugin 'Artifactory Build Info Copier'
19-May-2019 03:25:03 Copying the buildinfo artifacts for build: SPRINGDATACMNS-DATACMNS143-JOB1-742
19-May-2019 03:25:03 Running post build plugin 'Artifactory Gradle Properties Info Copier'
19-May-2019 03:25:03 Running post build plugin 'Clover Results Collector'
19-May-2019 03:25:03 Running post build plugin 'npm Cache Cleanup'
19-May-2019 03:25:03 Running post build plugin 'Artifact Copier'
19-May-2019 03:25:03 Successfully removed working directory at '/opt/bamboo-home/xml-data/build-dir/SPRINGDATACMNS-DATACMNS143-JOB1'
19-May-2019 03:25:03 Finalising the build...
19-May-2019 03:25:03 Stopping timer.
19-May-2019 03:25:03 Build SPRINGDATACMNS-DATACMNS143-JOB1-742 completed.
19-May-2019 03:25:03 Running on server: post build plugin 'NCover Results Collector'
19-May-2019 03:25:03 Running on server: post build plugin 'Build Hanging Detection Configuration'
19-May-2019 03:25:03 Running on server: post build plugin 'Clover Delta Calculator'
19-May-2019 03:25:03 Running on server: post build plugin 'Maven Dependencies Postprocessor'
19-May-2019 03:25:03 All post build plugins have finished
19-May-2019 03:25:03 Generating build results summary...
19-May-2019 03:25:04 Saving build results to disk...
19-May-2019 03:25:04 Logging substituted variables...
19-May-2019 03:25:04 Indexing build results...
19-May-2019 03:25:04 Finished building SPRINGDATACMNS-DATACMNS143-JOB1-742.