Build #774

Build: #774 was successful

Job: Default Job was successful

Stages & jobs

  1. Default Stage

Build log

The build generated 869 lines of output. Download or view full build log

20-Jun-2019 03:24:04 Build Spring Data Commons - Spring Data Commons - 2.0.x - Default Job #774 (SPRINGDATACMNS-DATACMNS143-JOB1-774) started building on agent bamboo-23.af.pivotal.io
20-Jun-2019 03:24:04 Remote agent on host bamboo-23.af.pivotal.io
20-Jun-2019 03:24:05 Build working directory is /opt/bamboo-home/xml-data/build-dir/SPRINGDATACMNS-DATACMNS143-JOB1
20-Jun-2019 03:24:05 Executing build Spring Data Commons - Spring Data Commons - 2.0.x - Default Job #774 (SPRINGDATACMNS-DATACMNS143-JOB1-774)
20-Jun-2019 03:24:05 Starting task 'Checkout Default Repository' of type 'com.atlassian.bamboo.plugins.vcs:task.vcs.checkout'
20-Jun-2019 03:24:05 Build always requires a clean checkout
20-Jun-2019 03:24:05 Cleaning build directory '/opt/bamboo-home/xml-data/build-dir/SPRINGDATACMNS-DATACMNS143-JOB1'
20-Jun-2019 03:24:05 Checking out into /opt/bamboo-home/xml-data/build-dir/SPRINGDATACMNS-DATACMNS143-JOB1
20-Jun-2019 03:24:05 Updating source code to revision: abf2b2ddce653092e3019a123bfcdde787038836
20-Jun-2019 03:24:05 Creating local git repository in '/opt/bamboo-home/xml-data/build-dir/SPRINGDATACMNS-DATACMNS143-JOB1/.git'.
20-Jun-2019 03:24:05 Initialized empty Git repository in /opt/bamboo-home/xml-data/build-dir/SPRINGDATACMNS-DATACMNS143-JOB1/.git/
20-Jun-2019 03:24:05 Fetching 'refs/heads/2.0.x' from 'https://github.com/spring-projects/spring-data-commons.git'.
20-Jun-2019 03:24:20 From https://github.com/spring-projects/spring-data-commons
20-Jun-2019 03:24:20 * [new branch]      2.0.x      -> 2.0.x
20-Jun-2019 03:24:20 * [new tag]           1.0.0.M1       -> 1.0.0.M1
20-Jun-2019 03:24:20 * [new tag]           1.0.0.M2       -> 1.0.0.M2
20-Jun-2019 03:24:20 * [new tag]           1.0.0.M3       -> 1.0.0.M3
20-Jun-2019 03:24:20 * [new tag]           1.0.0.M4       -> 1.0.0.M4
20-Jun-2019 03:24:20 * [new tag]           1.0.0.M5       -> 1.0.0.M5
20-Jun-2019 03:24:20 * [new tag]           1.0.0.M6       -> 1.0.0.M6
20-Jun-2019 03:24:20 * [new tag]           1.0.0.M7       -> 1.0.0.M7
20-Jun-2019 03:24:20 * [new tag]           1.0.0.RC1      -> 1.0.0.RC1
20-Jun-2019 03:24:20 * [new tag]           1.0.0.RELEASE  -> 1.0.0.RELEASE
20-Jun-2019 03:24:20 * [new tag]           1.1.0.M1       -> 1.1.0.M1
20-Jun-2019 03:24:20 * [new tag]           1.1.0.M2       -> 1.1.0.M2
20-Jun-2019 03:24:20 * [new tag]           1.1.0.RC1      -> 1.1.0.RC1
20-Jun-2019 03:24:20 * [new tag]           1.1.0.RELEASE  -> 1.1.0.RELEASE
20-Jun-2019 03:24:20 * [new tag]           1.10.0.M1      -> 1.10.0.M1
20-Jun-2019 03:24:20 * [new tag]           1.10.0.RC1     -> 1.10.0.RC1
20-Jun-2019 03:24:20 * [new tag]           1.10.0.RELEASE -> 1.10.0.RELEASE
20-Jun-2019 03:24:20 * [new tag]           1.11.0.M1      -> 1.11.0.M1
20-Jun-2019 03:24:20 * [new tag]           1.11.0.RC1     -> 1.11.0.RC1
20-Jun-2019 03:24:20 * [new tag]           1.11.0.RELEASE -> 1.11.0.RELEASE
20-Jun-2019 03:24:20 * [new tag]           1.12.0.M1      -> 1.12.0.M1
20-Jun-2019 03:24:20 * [new tag]           1.12.0.RC1     -> 1.12.0.RC1
20-Jun-2019 03:24:20 * [new tag]           1.12.0.RELEASE -> 1.12.0.RELEASE
20-Jun-2019 03:24:20 * [new tag]           1.13.0.M1      -> 1.13.0.M1
20-Jun-2019 03:24:20 * [new tag]           1.2.0.M1       -> 1.2.0.M1
20-Jun-2019 03:24:20 * [new tag]           1.2.0.M2       -> 1.2.0.M2
20-Jun-2019 03:24:20 * [new tag]           1.2.0.RC1      -> 1.2.0.RC1
20-Jun-2019 03:24:20 * [new tag]           1.2.0.RELEASE  -> 1.2.0.RELEASE
20-Jun-2019 03:24:20 * [new tag]           1.3.0.M1       -> 1.3.0.M1
20-Jun-2019 03:24:20 * [new tag]           1.3.0.RC1      -> 1.3.0.RC1
20-Jun-2019 03:24:20 * [new tag]           1.3.0.RC2      -> 1.3.0.RC2
20-Jun-2019 03:24:20 * [new tag]           1.3.0.RELEASE  -> 1.3.0.RELEASE
20-Jun-2019 03:24:20 * [new tag]           1.4.0.M1       -> 1.4.0.M1
20-Jun-2019 03:24:20 * [new tag]           1.4.0.RC1      -> 1.4.0.RC1
20-Jun-2019 03:24:20 * [new tag]           1.4.0.RELEASE  -> 1.4.0.RELEASE
20-Jun-2019 03:24:20 * [new tag]           1.5.0.RELEASE  -> 1.5.0.RELEASE
20-Jun-2019 03:24:20 * [new tag]           1.6.0.M1       -> 1.6.0.M1
20-Jun-2019 03:24:20 * [new tag]           1.6.0.RC1      -> 1.6.0.RC1
20-Jun-2019 03:24:20 * [new tag]           1.6.0.RELEASE  -> 1.6.0.RELEASE
20-Jun-2019 03:24:20 * [new tag]           1.7.0.M1       -> 1.7.0.M1
20-Jun-2019 03:24:20 * [new tag]           1.7.0.RC1      -> 1.7.0.RC1
20-Jun-2019 03:24:20 * [new tag]           1.7.0.RELEASE  -> 1.7.0.RELEASE
20-Jun-2019 03:24:20 * [new tag]           1.8.0.M1       -> 1.8.0.M1
20-Jun-2019 03:24:20 * [new tag]           1.8.0.RC1      -> 1.8.0.RC1
20-Jun-2019 03:24:20 * [new tag]           1.8.0.RELEASE  -> 1.8.0.RELEASE
20-Jun-2019 03:24:20 * [new tag]           1.9.0.M1       -> 1.9.0.M1
20-Jun-2019 03:24:20 * [new tag]           1.9.0.RC1      -> 1.9.0.RC1
20-Jun-2019 03:24:20 * [new tag]           1.9.0.RELEASE  -> 1.9.0.RELEASE
20-Jun-2019 03:24:20 * [new tag]           2.0.0.M1       -> 2.0.0.M1
20-Jun-2019 03:24:20 * [new tag]           2.0.0.M2       -> 2.0.0.M2
20-Jun-2019 03:24:20 * [new tag]           2.0.0.M3       -> 2.0.0.M3
20-Jun-2019 03:24:20 * [new tag]           2.0.0.M4       -> 2.0.0.M4
20-Jun-2019 03:24:20 * [new tag]           2.0.0.RC1      -> 2.0.0.RC1
20-Jun-2019 03:24:20 * [new tag]           2.0.0.RC2      -> 2.0.0.RC2
20-Jun-2019 03:24:20 * [new tag]           2.0.0.RC3      -> 2.0.0.RC3
20-Jun-2019 03:24:20 * [new tag]           2.0.0.RELEASE  -> 2.0.0.RELEASE
20-Jun-2019 03:24:20 * [new tag]           2.0.1.RELEASE  -> 2.0.1.RELEASE
20-Jun-2019 03:24:20 * [new tag]           2.0.10.RELEASE -> 2.0.10.RELEASE
20-Jun-2019 03:24:20 * [new tag]           2.0.11.RELEASE -> 2.0.11.RELEASE
20-Jun-2019 03:24:20 * [new tag]           2.0.12.RELEASE -> 2.0.12.RELEASE
20-Jun-2019 03:24:20 * [new tag]           2.0.13.RELEASE -> 2.0.13.RELEASE
20-Jun-2019 03:24:20 * [new tag]           2.0.14.RELEASE -> 2.0.14.RELEASE
20-Jun-2019 03:24:20 * [new tag]           2.0.2.RELEASE  -> 2.0.2.RELEASE
20-Jun-2019 03:24:20 * [new tag]           2.0.3.RELEASE  -> 2.0.3.RELEASE
20-Jun-2019 03:24:20 * [new tag]           2.0.4.RELEASE  -> 2.0.4.RELEASE
20-Jun-2019 03:24:20 * [new tag]           2.0.5.RELEASE  -> 2.0.5.RELEASE
20-Jun-2019 03:24:20 * [new tag]           2.0.6.RELEASE  -> 2.0.6.RELEASE
20-Jun-2019 03:24:20 * [new tag]           2.0.7.RELEASE  -> 2.0.7.RELEASE
20-Jun-2019 03:24:20 * [new tag]           2.0.8.RELEASE  -> 2.0.8.RELEASE
20-Jun-2019 03:24:20 * [new tag]           2.0.9.RELEASE  -> 2.0.9.RELEASE
20-Jun-2019 03:24:20 Checking out revision abf2b2ddce653092e3019a123bfcdde787038836.
20-Jun-2019 03:24:20 Switched to branch '2.0.x'
20-Jun-2019 03:24:20 Updated source code to revision: abf2b2ddce653092e3019a123bfcdde787038836
20-Jun-2019 03:24:20 Finished task 'Checkout Default Repository' with result: Success
20-Jun-2019 03:24:20 Running pre-build action: Artifactory Release Staging
20-Jun-2019 03:24:20 Running pre-build action: VCS Version Collector
20-Jun-2019 03:24:20 Starting task 'Build, test and install' of type 'org.jfrog.bamboo.bamboo-artifactory-plugin:maven3Task'
20-Jun-2019 03:24:20 Bamboo Artifactory Plugin version: 2.6.3
20-Jun-2019 03:24:20
Beginning to execute external process for build 'Spring Data Commons - Spring Data Commons - 2.0.x - Default Job #774 (SPRINGDATACMNS-DATACMNS143-JOB1-774)'
... running command line:
/opt/jdk-8/bin/java -cp /opt/maven-3.5/boot/plexus-classworlds-2.5.2.jar -Dclassworlds.conf=/tmp/artifactoryM25276562282575867conf -DbuildInfoConfig.propertiesFile=/tmp/buildInfo891897416960032363.properties -Dmaven.home=/opt/maven-3.5 -Dmaven.multiModuleProjectDirectory=/opt/bamboo-home/xml-data/build-dir/SPRINGDATACMNS-DATACMNS143-JOB1 org.codehaus.plexus.classworlds.launcher.Launcher clean dependency:tree install -Pci -U -B -Dartifactory.publish.password=********
... in: /opt/bamboo-home/xml-data/build-dir/SPRINGDATACMNS-DATACMNS143-JOB1
... using extra environment variables:
bamboo_planRepository_1_branch=2.0.x
bamboo_********_username_password=********
bamboo_signing_store_password=********
bamboo_capability_system_builder_ant_Ant_1_9=/opt/ant-1.9
bamboo_capability_system_builder_ant_Ant_1_8=/opt/ant-1.8
bamboo_planRepository_1_branchDisplayName=2.0.x
bamboo_artifactory_override_resolve_repo=libs-milestone
bamboo_capability_system_builder_node_Node_js_10_16=/opt/node-10.16/bin/node
bamboo_repository_revision_number=abf2b2ddce653092e3019a123bfcdde787038836
bamboo_RIAK_BIN=/usr/sbin/riak
WRAPPER_BITS=32
bamboo_buildKey=SPRINGDATACMNS-DATACMNS143-JOB1
bamboo_repository_254541851_git_repositoryUrl=https://github.com/spring-projects/spring-data-commons.git
bamboo_bintray_password=********
bamboo_sonar_token_password=********
PWD=/opt/bamboo-home/bin
bamboo_shortJobName=Default Job
bamboo_artifactory_override_resolver_password=********
bamboo_sonatype_token=RSJChaox
bamboo_capability_system_builder_gradle___gradlew=./gradlew
bamboo_buildResultsUrl=https://build.spring.io/browse/SPRINGDATACMNS-DATACMNS143-JOB1-774
bamboo_capability_system_builder_mvn3_Maven_3_3=/opt/maven-3.3
bamboo_capability_system_builder_mvn3_Maven_3_2=/opt/maven-3.2
bamboo_capability_system_builder_mvn3_Maven_3_1=/opt/maven-3.1
bamboo_planRepository_repositoryUrl=https://github.com/spring-projects/spring-data-commons.git
bamboo_capability_system_builder_mvn3_Maven_3_6=/opt/maven-3.6
bamboo_agentId=286195717
bamboo_capability_system_builder_mvn3_Maven_3_5=/opt/maven-3.5
bamboo_capability_system_builder_mvn3_Maven_3_0=/opt/maven-3.0
bamboo_repository_254541851_previous_revision_number=abf2b2ddce653092e3019a123bfcdde787038836
bamboo_planRepository_revision=abf2b2ddce653092e3019a123bfcdde787038836
bamboo_repository_254541851_git_branch=2.0.x
bamboo_planRepository_previousRevision=abf2b2ddce653092e3019a123bfcdde787038836
bamboo_capability_remote_build=true
bamboo_repository_branch_name=2.0.x
bamboo_sonatype_token_password=********
bamboo_sonatype_user=springsource
SHLVL=1
bamboo_org_jfrog_bamboo_buildInfo_serverUrl=https://repo.spring.io
bamboo_scdf_acceptance_tests_password=********
WRAPPER_OS=linux
TERM=linux
XDG_SESSION_ID=c1
bamboo_repository_254541851_branch_name=2.0.x
bamboo_planRepository_branch=2.0.x
bamboo_org_jfrog_bamboo_release_activated=false
bamboo_planRepository_1_type=gitv2
bamboo_planRepository_branchName=2.0.x
bamboo_capability_system_jdk_JDK_12=/opt/jdk-12
WRAPPER_FILE_SEPARATOR=/
_=/opt/bamboo-home/bin/bamboo-agent.sh
bamboo_capability_system_builder_ant_Ant_1_10=/opt/ant-1.10
WRAPPER_PATH_SEPARATOR=:
bamboo_sonar_password=********
bamboo_hg_cache_directory=/opt/bamboo-home/xml-data/build-dir/_hg-repositories-cache
bamboo_planRepository_1_username=spring-buildmaster
bamboo_planRepository_type=gitv2
bamboo_git_cache_directory=/opt/bamboo-home/xml-data/build-dir/_git-repositories-cache
bamboo_artifactory_username=buildmaster
bamboo_tmp_directory=/opt/bamboo-home/temp
bamboo_planKey=SPRINGDATACMNS-DATACMNS143
bamboo_planRepository_username=spring-buildmaster
bamboo_JDK8_HOME=/opt/jdk-8
bamboo_planRepository_1_branchName=2.0.x
bamboo_sonar_version=5.6.3
bamboo_sonar_jdbc_password=********
bamboo_bintray_api_key_password=********
XDG_DATA_DIRS=/usr/local/share:/usr/share:/var/lib/snapd/desktop
bamboo_capability_system_jdk_JDK_1_11=/opt/jdk-11
bamboo_resultsUrl=https://build.spring.io/browse/SPRINGDATACMNS-DATACMNS143-JOB1-774
bamboo_capability_system_jdk_JDK_1_10=/opt/jdk-10
bamboo_build_working_directory=/opt/bamboo-home/xml-data/build-dir/SPRINGDATACMNS-DATACMNS143-JOB1
bamboo_planRepository_1_name=Plan Repository
bamboo_capability_system_os=ubuntu1804
bamboo_nexusPush_stagingProfile=buildmaster
bamboo_shortPlanName=2.0.x
MAIL=/var/mail/bamboo
bamboo_planRepository_name=Plan Repository
LOGNAME=bamboo
bamboo_buildNumber=774
SHELL=/bin/bash
bamboo_planName=Spring Data Commons - Spring Data Commons - 2.0.x
bamboo_JDK7_HOME=/opt/jdk-7
bamboo_shortPlanKey=DATACMNS143
OLDPWD=/opt/users/bamboo
bamboo_repository_254541851_git_username=spring-buildmaster
bamboo_repository_254541851_revision_number=abf2b2ddce653092e3019a123bfcdde787038836
bamboo_shortJobKey=JOB1
bamboo_artifactory_password=********
bamboo_buildTimeStamp=2019-06-20T03:24:05.129Z
bamboo_repository_previous_revision_number=abf2b2ddce653092e3019a123bfcdde787038836
bamboo_sonar_username=buildmaster
bamboo_********_password=********
bamboo_repository_git_branch=2.0.x
bamboo_buildResultKey=SPRINGDATACMNS-DATACMNS143-JOB1-774
bamboo_nexusPush_close=true
bamboo_artifactory_override_resolver_username=buildmaster
bamboo_buildPlanName=Spring Data Commons - Spring Data Commons - 2.0.x - Default Job
bamboo_planRepository_1_revision=abf2b2ddce653092e3019a123bfcdde787038836
bamboo_repository_name=Plan Repository
bamboo_signing_key_password=********
bamboo_capability_system_builder_groovy_Groovy_2_5=/opt/groovy-2.5
LANG=en_US.UTF-8
bamboo_buildFailed=false
bamboo_repository_254541851_name=Plan Repository
bamboo_capability_system_docker_executable=/usr/bin/docker
DISPLAY=localhost:1.0
bamboo_capability_system_jdk_OpenJDK_7=/opt/jdk-7
bamboo_capability_system_builder_groovy_Groovy_2_4=/opt/groovy-2.4
bamboo_artifactory_override_deployer_username=buildmaster
bamboo_capability_system_builder_command_Bash=/bin/bash
bamboo_artifactory_password_mask_a=********
bamboo_agentWorkingDirectory=/opt/bamboo-home/xml-data/build-dir
bamboo_capability_system_git_executable=/usr/bin/git
bamboo_repository_git_username=spring-buildmaster
bamboo_planRepository_1_previousRevision=abf2b2ddce653092e3019a123bfcdde787038836
bamboo_capability_os_family=unix
bamboo_planRepository_branchDisplayName=2.0.x
bamboo_capability_system_builder_maven_Artifactory_Maven_3_6=/opt/maven-3.6
bamboo_capability_system_builder_maven_Artifactory_Maven_3_5=/opt/maven-3.5
GIT_SSL_NO_VERIFY=true
bamboo_capability_system_builder_maven_Artifactory_Maven_3_3=/opt/maven-3.3
bamboo_capability_system_builder_maven_Artifactory_Maven_3_2=/opt/maven-3.2
bamboo_s3_properties=/home/bamboo/tools/s3.properties
bamboo_capability_system_builder_maven_Artifactory_Maven_3_1=/opt/maven-3.1
bamboo_artifactory_override_deploy_repo=libs-snapshot-local
bamboo_capability_system_builder_maven_Artifactory_Maven_3_0=/opt/maven-3.0
bamboo_plan_storageTag=plan-254345269
bamboo_bintray_username_password=********
USER=bamboo
bamboo_repository_git_repositoryUrl=https://github.com/spring-projects/spring-data-commons.git
bamboo_working_directory=/opt/bamboo-home/xml-data/build-dir/SPRINGDATACMNS-DATACMNS143-JOB1
bamboo_org_jfrog_bamboo_buildInfo_activated=true
bamboo_planRepository_1_repositoryUrl=https://github.com/spring-projects/spring-data-commons.git
bamboo_capability_system_jdk_JDK_1_8=/opt/jdk-8
bamboo_artifactory_override_deployer_password=********
bamboo_capability_system_jdk_JDK_1_9=/opt/jdk-9
WRAPPER_ARCH=x86
bamboo_capability_system_jdk_JDK_1_6=/opt/jdk-6
bamboo_sonatype_password=********
bamboo_capability_system_jdk_JDK_1_7=/opt/jdk-7
bamboo_sonar_ip=10.194.6.9
XDG_RUNTIME_DIR=/run/user/1002
HOME=/home/bamboo
PATH=/bin:/home/bamboo/bin:/usr/local/sbin:/usr/local/bin:/usr/sbin:/usr/bin:/sbin:/bin:/usr/games:/usr/local/games:/snap/bin:/home/bamboo/bin:/usr/local/bin:/bin:/home/bamboo/bin:/usr/local/sbin:/usr/local/bin:/usr/sbin:/usr/bin:/sbin:/bin:/usr/games:/usr/local/games:/snap/bin:/home/bamboo/bin:/usr/local/bin
20-Jun-2019 03:24:21 [INFO] Scanning for projects...
20-Jun-2019 03:24:21 [INFO] Downloading from spring-libs-snapshot: https://repo.spring.io/libs-snapshot/org/springframework/data/build/spring-data-parent/2.0.15.BUILD-SNAPSHOT/maven-metadata.xml
20-Jun-2019 03:24:22 [INFO] Downloaded from spring-libs-snapshot: https://repo.spring.io/libs-snapshot/org/springframework/data/build/spring-data-parent/2.0.15.BUILD-SNAPSHOT/maven-metadata.xml (641 B at 721 B/s)
20-Jun-2019 03:24:22 [INFO] Downloading from spring-libs-snapshot: https://repo.spring.io/libs-snapshot/org/springframework/data/build/spring-data-parent/2.0.15.BUILD-SNAPSHOT/spring-data-parent-2.0.15.BUILD-20190620.012300-85.pom
20-Jun-2019 03:24:22 [INFO] Downloaded from spring-libs-snapshot: https://repo.spring.io/libs-snapshot/org/springframework/data/build/spring-data-parent/2.0.15.BUILD-SNAPSHOT/spring-data-parent-2.0.15.BUILD-20190620.012300-85.pom (30 kB at 90 kB/s)
20-Jun-2019 03:24:22 [INFO] Downloading from spring-libs-snapshot: https://repo.spring.io/libs-snapshot/org/springframework/data/build/spring-data-build/2.0.15.BUILD-SNAPSHOT/maven-metadata.xml
20-Jun-2019 03:24:23 [INFO] Downloaded from spring-libs-snapshot: https://repo.spring.io/libs-snapshot/org/springframework/data/build/spring-data-build/2.0.15.BUILD-SNAPSHOT/maven-metadata.xml (640 B at 1.5 kB/s)
20-Jun-2019 03:24:23 [INFO] Downloading from spring-libs-snapshot: https://repo.spring.io/libs-snapshot/org/springframework/data/build/spring-data-build/2.0.15.BUILD-SNAPSHOT/spring-data-build-2.0.15.BUILD-20190620.012300-85.pom
20-Jun-2019 03:24:23 [INFO] Downloaded from spring-libs-snapshot: https://repo.spring.io/libs-snapshot/org/springframework/data/build/spring-data-build/2.0.15.BUILD-SNAPSHOT/spring-data-build-2.0.15.BUILD-20190620.012300-85.pom (6.6 kB at 18 kB/s)
20-Jun-2019 03:24:23 [INFO] Initializing Artifactory Build-Info Recording
20-Jun-2019 03:24:23 [INFO]
20-Jun-2019 03:24:23 [INFO] ------------< org.springframework.data:spring-data-commons >------------
20-Jun-2019 03:24:23 [INFO] Building Spring Data Core 2.0.15.BUILD-SNAPSHOT
20-Jun-2019 03:24:23 [INFO] --------------------------------[ jar ]---------------------------------
20-Jun-2019 03:24:24 [INFO]
20-Jun-2019 03:24:24 [INFO] --- maven-clean-plugin:2.5:clean (default-clean) @ spring-data-commons ---
20-Jun-2019 03:24:24 [INFO]
20-Jun-2019 03:24:24 [INFO] --- maven-dependency-plugin:3.0.0:tree (default-cli) @ spring-data-commons ---
20-Jun-2019 03:24:24 [INFO] org.springframework.data:spring-data-commons:jar:2.0.15.BUILD-SNAPSHOT
20-Jun-2019 03:24:24 [INFO] +- org.springframework:spring-core:jar:5.0.13.RELEASE:compile
20-Jun-2019 03:24:24 [INFO] |  \- org.springframework:spring-jcl:jar:5.0.13.RELEASE:compile
20-Jun-2019 03:24:24 [INFO] +- org.springframework:spring-beans:jar:5.0.13.RELEASE:compile
20-Jun-2019 03:24:24 [INFO] +- org.springframework:spring-context:jar:5.0.13.RELEASE:compile (optional)
20-Jun-2019 03:24:24 [INFO] |  \- org.springframework:spring-aop:jar:5.0.13.RELEASE:compile (optional)
20-Jun-2019 03:24:24 [INFO] +- org.springframework:spring-expression:jar:5.0.13.RELEASE:compile (optional)
20-Jun-2019 03:24:24 [INFO] +- org.springframework:spring-tx:jar:5.0.13.RELEASE:compile (optional)
20-Jun-2019 03:24:24 [INFO] +- org.springframework:spring-oxm:jar:5.0.13.RELEASE:compile (optional)
20-Jun-2019 03:24:24 [INFO] +- com.fasterxml.jackson.core:jackson-databind:jar:2.9.8:compile (optional)
20-Jun-2019 03:24:24 [INFO] |  +- com.fasterxml.jackson.core:jackson-annotations:jar:2.9.0:compile (optional)
20-Jun-2019 03:24:24 [INFO] |  \- com.fasterxml.jackson.core:jackson-core:jar:2.9.8:compile (optional)
20-Jun-2019 03:24:24 [INFO] +- org.springframework:spring-web:jar:5.0.13.RELEASE:compile (optional)
20-Jun-2019 03:24:24 [INFO] +- javax.servlet:javax.servlet-api:jar:3.0.1:provided
20-Jun-2019 03:24:24 [INFO] +- javax.annotation:javax.annotation-api:jar:1.3:compile (optional)
20-Jun-2019 03:24:24 [INFO] +- joda-time:joda-time:jar:2.9.9:compile (optional)
20-Jun-2019 03:24:24 [INFO] +- org.threeten:threetenbp:jar:1.3.8:compile (optional)
20-Jun-2019 03:24:24 [INFO] +- io.projectreactor:reactor-core:jar:3.1.14.RELEASE:compile (optional)
20-Jun-2019 03:24:24 [INFO] |  \- org.reactivestreams:reactive-streams:jar:1.0.2:compile (optional)
20-Jun-2019 03:24:24 [INFO] +- io.reactivex:rxjava:jar:1.3.8:compile (optional)
20-Jun-2019 03:24:24 [INFO] +- io.reactivex:rxjava-reactive-streams:jar:1.2.1:compile (optional)
20-Jun-2019 03:24:24 [INFO] +- io.reactivex.rxjava2:rxjava:jar:2.1.17:compile (optional)
20-Jun-2019 03:24:24 [INFO] +- com.querydsl:querydsl-core:jar:4.1.4:compile (optional)
20-Jun-2019 03:24:24 [INFO] |  +- com.google.code.findbugs:jsr305:jar:1.3.9:compile (optional)
20-Jun-2019 03:24:24 [INFO] |  +- com.mysema.commons:mysema-commons-lang:jar:0.2.4:compile (optional)
20-Jun-2019 03:24:24 [INFO] |  \- com.infradna.tool:bridge-method-annotation:jar:1.13:compile (optional)
20-Jun-2019 03:24:24 [INFO] +- com.querydsl:querydsl-apt:jar:4.1.4:provided
20-Jun-2019 03:24:24 [INFO] |  +- com.querydsl:querydsl-codegen:jar:4.1.4:compile
20-Jun-2019 03:24:24 [INFO] |  |  +- com.mysema.codegen:codegen:jar:0.6.8:compile
20-Jun-2019 03:24:24 [INFO] |  |  |  \- org.eclipse.jdt.core.compiler:ecj:jar:4.3.1:compile
20-Jun-2019 03:24:24 [INFO] |  |  \- org.reflections:reflections:jar:0.9.9:compile
20-Jun-2019 03:24:24 [INFO] |  |     +- org.javassist:javassist:jar:3.18.2-GA:compile
20-Jun-2019 03:24:24 [INFO] |  |     \- com.google.code.findbugs:annotations:jar:2.0.1:compile
20-Jun-2019 03:24:24 [INFO] |  \- javax.jdo:jdo-api:jar:3.0.1:provided
20-Jun-2019 03:24:24 [INFO] |     \- javax.transaction:jta:jar:1.1:provided
20-Jun-2019 03:24:24 [INFO] +- com.querydsl:querydsl-collections:jar:4.1.4:compile (optional)
20-Jun-2019 03:24:24 [INFO] +- javax.ejb:ejb-api:jar:3.0:compile (optional)
20-Jun-2019 03:24:24 [INFO] +- org.apache.geronimo.specs:geronimo-jcdi_2.0_spec:jar:1.0.1:test
20-Jun-2019 03:24:24 [INFO] +- javax.interceptor:javax.interceptor-api:jar:1.2.1:test
20-Jun-2019 03:24:24 [INFO] +- javax.enterprise:cdi-api:jar:1.0:provided (optional)
20-Jun-2019 03:24:24 [INFO] |  +- org.jboss.interceptor:jboss-interceptor-api:jar:1.1:provided (optional)
20-Jun-2019 03:24:24 [INFO] |  +- javax.annotation:jsr250-api:jar:1.0:provided (optional)
20-Jun-2019 03:24:24 [INFO] |  \- javax.inject:javax.inject:jar:1:compile
20-Jun-2019 03:24:24 [INFO] +- com.google.guava:guava:jar:19.0:compile (optional)
20-Jun-2019 03:24:24 [INFO] +- io.javaslang:javaslang:jar:2.0.6:compile (optional)
20-Jun-2019 03:24:24 [INFO] |  \- io.javaslang:javaslang-match:jar:2.0.6:compile (optional)
20-Jun-2019 03:24:24 [INFO] +- io.vavr:vavr:jar:0.9.3:compile (optional)
20-Jun-2019 03:24:24 [INFO] |  \- io.vavr:vavr-match:jar:0.9.3:compile (optional)
20-Jun-2019 03:24:24 [INFO] +- javax.el:el-api:jar:1.0:test
20-Jun-2019 03:24:24 [INFO] +- org.apache.openwebbeans:openwebbeans-se:jar:2.0.8:test
20-Jun-2019 03:24:24 [INFO] |  \- org.apache.openwebbeans:openwebbeans-impl:jar:2.0.8:test
20-Jun-2019 03:24:24 [INFO] |     +- org.apache.xbean:xbean-finder-shaded:jar:4.12:test
20-Jun-2019 03:24:24 [INFO] |     +- org.apache.xbean:xbean-asm7-shaded:jar:4.12:test
20-Jun-2019 03:24:24 [INFO] |     \- org.apache.openwebbeans:openwebbeans-spi:jar:2.0.8:test
20-Jun-2019 03:24:24 [INFO] +- org.springframework.hateoas:spring-hateoas:jar:0.25.0.RELEASE:compile (optional)
20-Jun-2019 03:24:24 [INFO] +- org.springframework:spring-webmvc:jar:5.0.13.RELEASE:compile (optional)
20-Jun-2019 03:24:24 [INFO] +- com.sun.xml.bind:jaxb-impl:jar:2.2.3U1:test
20-Jun-2019 03:24:24 [INFO] |  \- javax.xml.bind:jaxb-api:jar:2.2.2:test
20-Jun-2019 03:24:24 [INFO] |     +- javax.xml.stream:stax-api:jar:1.0-2:test
20-Jun-2019 03:24:24 [INFO] |     \- javax.activation:activation:jar:1.1:test
20-Jun-2019 03:24:24 [INFO] +- xmlunit:xmlunit:jar:1.6:test
20-Jun-2019 03:24:24 [INFO] +- org.codehaus.groovy:groovy-all:jar:2.4.4:test
20-Jun-2019 03:24:24 [INFO] +- org.jetbrains.kotlin:kotlin-stdlib:jar:1.1.61:compile (optional)
20-Jun-2019 03:24:24 [INFO] |  \- org.jetbrains:annotations:jar:13.0:compile (optional)
20-Jun-2019 03:24:24 [INFO] +- org.jetbrains.kotlin:kotlin-reflect:jar:1.1.61:compile (optional)
20-Jun-2019 03:24:24 [INFO] +- org.jetbrains.kotlin:kotlin-test:jar:1.1.61:test
20-Jun-2019 03:24:24 [INFO] +- com.nhaarman:mockito-kotlin:jar:1.5.0:test
20-Jun-2019 03:24:24 [INFO] +- org.scala-lang:scala-library:jar:2.11.7:compile (optional)
20-Jun-2019 03:24:24 [INFO] +- javax.transaction:javax.transaction-api:jar:1.2:test
20-Jun-2019 03:24:24 [INFO] +- com.jayway.jsonpath:json-path:jar:2.4.0:compile (optional)
20-Jun-2019 03:24:24 [INFO] |  \- net.minidev:json-smart:jar:2.3:compile (optional)
20-Jun-2019 03:24:24 [INFO] |     \- net.minidev:accessors-smart:jar:1.2:compile (optional)
20-Jun-2019 03:24:24 [INFO] +- org.xmlbeam:xmlprojector:jar:1.4.15:compile (optional)
20-Jun-2019 03:24:24 [INFO] +- de.schauderhaft.degraph:degraph-check:jar:0.1.4:test
20-Jun-2019 03:24:24 [INFO] |  +- de.schauderhaft.degraph:degraph-core:jar:0.1.4:test
20-Jun-2019 03:24:24 [INFO] |  |  +- org.scala-lang.modules:scala-xml_2.11:jar:1.0.3:test
20-Jun-2019 03:24:24 [INFO] |  |  +- org.scala-lang.modules:scala-parser-combinators_2.11:jar:1.0.3:test
20-Jun-2019 03:24:24 [INFO] |  |  +- org.ow2.asm:asm:jar:5.1:compile
20-Jun-2019 03:24:24 [INFO] |  |  \- com.assembla.scala-incubator:graph-core_2.11:jar:1.9.1:test
20-Jun-2019 03:24:24 [INFO] |  +- org.scalatest:scalatest_2.11:jar:2.2.4:test
20-Jun-2019 03:24:24 [INFO] |  |  \- org.scala-lang:scala-reflect:jar:2.11.2:test
20-Jun-2019 03:24:24 [INFO] |  \- org.hamcrest:hamcrest-all:jar:1.3:test
20-Jun-2019 03:24:24 [INFO] +- org.hamcrest:hamcrest-library:jar:1.3:test
20-Jun-2019 03:24:24 [INFO] +- org.hamcrest:hamcrest-core:jar:1.3:test
20-Jun-2019 03:24:24 [INFO] +- junit:junit:jar:4.12:test
20-Jun-2019 03:24:24 [INFO] +- org.mockito:mockito-core:jar:2.8.47:test
20-Jun-2019 03:24:24 [INFO] |  +- net.bytebuddy:byte-buddy:jar:1.6.14:test
20-Jun-2019 03:24:24 [INFO] |  +- net.bytebuddy:byte-buddy-agent:jar:1.6.14:test
20-Jun-2019 03:24:24 [INFO] |  \- org.objenesis:objenesis:jar:2.5:test
20-Jun-2019 03:24:24 [INFO] +- org.assertj:assertj-core:jar:3.9.1:test
20-Jun-2019 03:24:24 [INFO] +- org.springframework:spring-test:jar:5.0.13.RELEASE:test
20-Jun-2019 03:24:24 [INFO] +- org.slf4j:slf4j-api:jar:1.7.25:compile
20-Jun-2019 03:24:24 [INFO] +- ch.qos.logback:logback-classic:jar:1.2.3:test
20-Jun-2019 03:24:24 [INFO] |  \- ch.qos.logback:logback-core:jar:1.2.3:test
20-Jun-2019 03:24:24 [INFO] \- org.projectlombok:lombok:jar:1.18.4:compile (optional)
20-Jun-2019 03:24:24 [INFO]
20-Jun-2019 03:24:24 [INFO] --- maven-enforcer-plugin:1.4.1:enforce (enforce-maven-version) @ spring-data-commons ---
20-Jun-2019 03:24:24 [INFO]
20-Jun-2019 03:24:24 [INFO] --- maven-enforcer-plugin:1.4.1:enforce (enforce-rules) @ spring-data-commons ---
20-Jun-2019 03:24:24 [INFO]
20-Jun-2019 03:24:24 [INFO] --- lombok-maven-plugin:1.18.4.0:delombok (default) @ spring-data-commons ---
20-Jun-2019 03:24:30 [INFO] Delombok complete.
20-Jun-2019 03:24:30 [INFO]
20-Jun-2019 03:24:30 [INFO] --- maven-resources-plugin:2.6:resources (default-resources) @ spring-data-commons ---
20-Jun-2019 03:24:30 [INFO] Using 'UTF-8' encoding to copy filtered resources.
20-Jun-2019 03:24:30 [INFO] Copying 17 resources
20-Jun-2019 03:24:30 [INFO]
20-Jun-2019 03:24:30 [INFO] --- kotlin-maven-plugin:1.1.61:compile (compile) @ spring-data-commons ---
20-Jun-2019 03:24:30 [WARNING] No sources found skipping Kotlin compile
20-Jun-2019 03:24:30 [INFO]
20-Jun-2019 03:24:30 [INFO] --- maven-compiler-plugin:3.6.1:compile (java-compile) @ spring-data-commons ---
20-Jun-2019 03:24:30 [INFO] Changes detected - recompiling the module!
20-Jun-2019 03:24:30 [INFO] Compiling 431 source files to /opt/bamboo-home/xml-data/build-dir/SPRINGDATACMNS-DATACMNS143-JOB1/target/classes
20-Jun-2019 03:24:35 [INFO] /opt/bamboo-home/xml-data/build-dir/SPRINGDATACMNS-DATACMNS143-JOB1/src/main/java/org/springframework/data/repository/config/RepositoryConfigurationExtensionSupport.java: Some input files use or override a deprecated API.
20-Jun-2019 03:24:35 [INFO] /opt/bamboo-home/xml-data/build-dir/SPRINGDATACMNS-DATACMNS143-JOB1/src/main/java/org/springframework/data/repository/config/RepositoryConfigurationExtensionSupport.java: Recompile with -Xlint:deprecation for details.
20-Jun-2019 03:24:35 [INFO]
20-Jun-2019 03:24:35 [INFO] --- apt-maven-plugin:1.1.3:test-process (default) @ spring-data-commons ---
20-Jun-2019 03:24:36 /opt/bamboo-home/xml-data/build-dir/SPRINGDATACMNS-DATACMNS143-JOB1/src/test/java/org/springframework/data/util/ReflectionUtilsUnitTests.java:27: error: cannot find symbol
20-Jun-2019 03:24:36 import org.springframework.data.mapping.model.TypeCreatingSyntheticClassKt;
20-Jun-2019 03:24:36                                              ^
20-Jun-2019 03:24:36   symbol:   class TypeCreatingSyntheticClassKt
20-Jun-2019 03:24:36   location: package org.springframework.data.mapping.model
20-Jun-2019 03:24:36 /opt/bamboo-home/xml-data/build-dir/SPRINGDATACMNS-DATACMNS143-JOB1/src/test/java/org/springframework/data/convert/ParameterizedKotlinInstantiatorUnitTests.java:35: error: cannot find symbol
20-Jun-2019 03:24:36 import org.springframework.data.mapping.model.With32Args;
20-Jun-2019 03:24:36                                              ^
20-Jun-2019 03:24:36   symbol:   class With32Args
20-Jun-2019 03:24:36   location: package org.springframework.data.mapping.model
20-Jun-2019 03:24:36 /opt/bamboo-home/xml-data/build-dir/SPRINGDATACMNS-DATACMNS143-JOB1/src/test/java/org/springframework/data/convert/ParameterizedKotlinInstantiatorUnitTests.java:36: error: cannot find symbol
20-Jun-2019 03:24:36 import org.springframework.data.mapping.model.With33Args;
20-Jun-2019 03:24:36                                              ^
20-Jun-2019 03:24:36   symbol:   class With33Args
20-Jun-2019 03:24:36   location: package org.springframework.data.mapping.model
20-Jun-2019 03:24:36 /opt/bamboo-home/xml-data/build-dir/SPRINGDATACMNS-DATACMNS143-JOB1/src/test/java/org/springframework/data/repository/core/support/EventPublishingRepositoryProxyPostProcessorUnitTests.java:269: error: cannot find symbol
20-Jun-2019 03:24:36                 @Getter(onMethod = @__(@DomainEvents)) Collection<? extends Object> events;
20-Jun-2019 03:24:36                                     ^
20-Jun-2019 03:24:36   symbol:   class __
20-Jun-2019 03:24:36   location: class MultipleEvents
20-Jun-2019 03:24:36 /opt/bamboo-home/xml-data/build-dir/SPRINGDATACMNS-DATACMNS143-JOB1/src/test/java/org/springframework/data/repository/core/support/EventPublishingRepositoryProxyPostProcessorUnitTests.java:274: error: cannot find symbol
20-Jun-2019 03:24:36                 @Getter(onMethod = @__(@DomainEvents)) final Collection<? extends Object> events;
20-Jun-2019 03:24:36                                     ^
20-Jun-2019 03:24:36   symbol:   class __
20-Jun-2019 03:24:36   location: class EventsWithClearing
20-Jun-2019 03:24:36 /opt/bamboo-home/xml-data/build-dir/SPRINGDATACMNS-DATACMNS143-JOB1/src/test/java/org/springframework/data/repository/core/support/EventPublishingRepositoryProxyPostProcessorUnitTests.java:282: error: cannot find symbol
20-Jun-2019 03:24:36                 @Getter(onMethod = @__(@DomainEvents)) Object event;
20-Jun-2019 03:24:36                                     ^
20-Jun-2019 03:24:36   symbol:   class __
20-Jun-2019 03:24:36   location: class OneEvent
20-Jun-2019 03:24:36 6 errors
20-Jun-2019 03:24:36 [INFO]
20-Jun-2019 03:24:36 [INFO] --- maven-resources-plugin:2.6:testResources (default-testResources) @ spring-data-commons ---
20-Jun-2019 03:24:36 [INFO] Using 'UTF-8' encoding to copy filtered resources.
20-Jun-2019 03:24:36 [INFO] Copying 11 resources
20-Jun-2019 03:24:36 [INFO]
20-Jun-2019 03:24:36 [INFO] --- kotlin-maven-plugin:1.1.61:test-compile (test-compile) @ spring-data-commons ---
20-Jun-2019 03:24:42 [WARNING] /opt/bamboo-home/xml-data/build-dir/SPRINGDATACMNS-DATACMNS143-JOB1/src/test/kotlin/org/springframework/data/convert/KotlinClassGeneratingEntityInstantiatorUnitTests.kt: (54, 12) Expected type does not accept nulls in Kotlin, but the value may be null in Java
20-Jun-2019 03:24:42 [WARNING] /opt/bamboo-home/xml-data/build-dir/SPRINGDATACMNS-DATACMNS143-JOB1/src/test/kotlin/org/springframework/data/convert/KotlinClassGeneratingEntityInstantiatorUnitTests.kt: (73, 12) Expected type does not accept nulls in Kotlin, but the value may be null in Java
20-Jun-2019 03:24:42 [WARNING] /opt/bamboo-home/xml-data/build-dir/SPRINGDATACMNS-DATACMNS143-JOB1/src/test/kotlin/org/springframework/data/convert/KotlinClassGeneratingEntityInstantiatorUnitTests.kt: (92, 12) Expected type does not accept nulls in Kotlin, but the value may be null in Java
20-Jun-2019 03:24:42 [WARNING] /opt/bamboo-home/xml-data/build-dir/SPRINGDATACMNS-DATACMNS143-JOB1/src/test/kotlin/org/springframework/data/convert/KotlinClassGeneratingEntityInstantiatorUnitTests.kt: (107, 12) Expected type does not accept nulls in Kotlin, but the value may be null in Java
20-Jun-2019 03:24:42 [WARNING] /opt/bamboo-home/xml-data/build-dir/SPRINGDATACMNS-DATACMNS143-JOB1/src/test/kotlin/org/springframework/data/convert/KotlinClassGeneratingEntityInstantiatorUnitTests.kt: (129, 12) Expected type does not accept nulls in Kotlin, but the value may be null in Java
20-Jun-2019 03:24:42 [WARNING] /opt/bamboo-home/xml-data/build-dir/SPRINGDATACMNS-DATACMNS143-JOB1/src/test/kotlin/org/springframework/data/mapping/context/TypeCreatingSyntheticClass.kt: (24, 12) Parameter 'args' is never used
20-Jun-2019 03:24:42 [WARNING] /opt/bamboo-home/xml-data/build-dir/SPRINGDATACMNS-DATACMNS143-JOB1/src/test/kotlin/org/springframework/data/mapping/model/PreferredConstructorDiscovererUnitTests.kt: (35, 25) Expected type does not accept nulls in Kotlin, but the value may be null in Java
20-Jun-2019 03:24:42 [WARNING] /opt/bamboo-home/xml-data/build-dir/SPRINGDATACMNS-DATACMNS143-JOB1/src/test/kotlin/org/springframework/data/mapping/model/PreferredConstructorDiscovererUnitTests.kt: (43, 25) Expected type does not accept nulls in Kotlin, but the value may be null in Java
20-Jun-2019 03:24:42 [WARNING] /opt/bamboo-home/xml-data/build-dir/SPRINGDATACMNS-DATACMNS143-JOB1/src/test/kotlin/org/springframework/data/mapping/model/PreferredConstructorDiscovererUnitTests.kt: (51, 25) Expected type does not accept nulls in Kotlin, but the value may be null in Java
20-Jun-2019 03:24:42 [WARNING] /opt/bamboo-home/xml-data/build-dir/SPRINGDATACMNS-DATACMNS143-JOB1/src/test/kotlin/org/springframework/data/mapping/model/PreferredConstructorDiscovererUnitTests.kt: (59, 25) Expected type does not accept nulls in Kotlin, but the value may be null in Java
20-Jun-2019 03:24:42 [WARNING] /opt/bamboo-home/xml-data/build-dir/SPRINGDATACMNS-DATACMNS143-JOB1/src/test/kotlin/org/springframework/data/mapping/model/PreferredConstructorDiscovererUnitTests.kt: (67, 25) Expected type does not accept nulls in Kotlin, but the value may be null in Java
20-Jun-2019 03:24:42 [WARNING] /opt/bamboo-home/xml-data/build-dir/SPRINGDATACMNS-DATACMNS143-JOB1/src/test/kotlin/org/springframework/data/mapping/model/PreferredConstructorDiscovererUnitTests.kt: (75, 25) Expected type does not accept nulls in Kotlin, but the value may be null in Java
20-Jun-2019 03:24:42 [WARNING] /opt/bamboo-home/xml-data/build-dir/SPRINGDATACMNS-DATACMNS143-JOB1/src/test/kotlin/org/springframework/data/mapping/model/PreferredConstructorDiscovererUnitTests.kt: (103, 34) Parameter 'lastname' is never used
20-Jun-2019 03:24:42 [WARNING] /opt/bamboo-home/xml-data/build-dir/SPRINGDATACMNS-DATACMNS143-JOB1/src/test/kotlin/org/springframework/data/mapping/model/PreferredConstructorDiscovererUnitTests.kt: (109, 34) Parameter 'lastname' is never used
20-Jun-2019 03:24:42 [WARNING] /opt/bamboo-home/xml-data/build-dir/SPRINGDATACMNS-DATACMNS143-JOB1/src/test/kotlin/org/springframework/data/mapping/model/PreferredConstructorDiscovererUnitTests.kt: (118, 68) Parameter 'age' is never used
20-Jun-2019 03:24:42 [WARNING] /opt/bamboo-home/xml-data/build-dir/SPRINGDATACMNS-DATACMNS143-JOB1/src/test/kotlin/org/springframework/data/mapping/model/TypeCreatingSyntheticClass.kt: (24, 12) Parameter 'args' is never used
20-Jun-2019 03:24:42 [WARNING] /opt/bamboo-home/xml-data/build-dir/SPRINGDATACMNS-DATACMNS143-JOB1/src/test/kotlin/org/springframework/data/util/TypeCreatingSyntheticClass.kt: (24, 12) Parameter 'args' is never used
20-Jun-2019 03:24:42 [INFO]
20-Jun-2019 03:24:42 [INFO] --- maven-compiler-plugin:3.6.1:testCompile (java-test-compile) @ spring-data-commons ---
20-Jun-2019 03:24:42 [INFO] Changes detected - recompiling the module!
20-Jun-2019 03:24:42 [INFO] Compiling 269 source files to /opt/bamboo-home/xml-data/build-dir/SPRINGDATACMNS-DATACMNS143-JOB1/target/test-classes
20-Jun-2019 03:24:48 [INFO] /opt/bamboo-home/xml-data/build-dir/SPRINGDATACMNS-DATACMNS143-JOB1/src/test/java/org/springframework/data/mapping/model/AbstractPersistentPropertyUnitTests.java: Some input files use or override a deprecated API.
20-Jun-2019 03:24:48 [INFO] /opt/bamboo-home/xml-data/build-dir/SPRINGDATACMNS-DATACMNS143-JOB1/src/test/java/org/springframework/data/mapping/model/AbstractPersistentPropertyUnitTests.java: Recompile with -Xlint:deprecation for details.
20-Jun-2019 03:24:48 [INFO] /opt/bamboo-home/xml-data/build-dir/SPRINGDATACMNS-DATACMNS143-JOB1/src/test/java/org/springframework/data/convert/ParameterizedKotlinInstantiatorUnitTests.java: Some input files use unchecked or unsafe operations.
20-Jun-2019 03:24:48 [INFO] /opt/bamboo-home/xml-data/build-dir/SPRINGDATACMNS-DATACMNS143-JOB1/src/test/java/org/springframework/data/convert/ParameterizedKotlinInstantiatorUnitTests.java: Recompile with -Xlint:unchecked for details.
20-Jun-2019 03:24:48 [INFO]
20-Jun-2019 03:24:48 [INFO] --- maven-surefire-plugin:2.19.1:test (default-test) @ spring-data-commons ---
20-Jun-2019 03:24:48
20-Jun-2019 03:24:48 -------------------------------------------------------
20-Jun-2019 03:24:48 T E S T S
20-Jun-2019 03:24:48 -------------------------------------------------------
20-Jun-2019 03:24:48 Running org.springframework.data.config.TypeFilterParserUnitTests
20-Jun-2019 03:24:49 Tests run: 2, Failures: 0, Errors: 0, Skipped: 0, Time elapsed: 0.781 sec - in org.springframework.data.config.TypeFilterParserUnitTests
20-Jun-2019 03:24:49 Running org.springframework.data.type.classreading.DefaultMethodsMetadataReaderUnitTests
20-Jun-2019 03:24:49 Tests run: 4, Failures: 0, Errors: 0, Skipped: 0, Time elapsed: 0.058 sec - in org.springframework.data.type.classreading.DefaultMethodsMetadataReaderUnitTests
20-Jun-2019 03:24:49 Running org.springframework.data.type.classreading.MethodsMetadataReaderFactoryUnitTests
20-Jun-2019 03:24:49 Tests run: 4, Failures: 0, Errors: 0, Skipped: 0, Time elapsed: 0.003 sec - in org.springframework.data.type.classreading.MethodsMetadataReaderFactoryUnitTests
20-Jun-2019 03:24:49 Running org.springframework.data.auditing.config.AuditingBeanDefinitionRegistrarSupportUnitTests
20-Jun-2019 03:24:49 Tests run: 3, Failures: 0, Errors: 0, Skipped: 0, Time elapsed: 0.036 sec - in org.springframework.data.auditing.config.AuditingBeanDefinitionRegistrarSupportUnitTests
20-Jun-2019 03:24:49 Running org.springframework.data.auditing.AnnotationAuditingMetadataUnitTests
20-Jun-2019 03:24:49 Tests run: 4, Failures: 0, Errors: 0, Skipped: 0, Time elapsed: 0.024 sec - in org.springframework.data.auditing.AnnotationAuditingMetadataUnitTests
20-Jun-2019 03:24:49 Running org.springframework.data.auditing.IsNewAwareAuditingHandlerUnitTests
20-Jun-2019 03:24:49 Tests run: 13, Failures: 0, Errors: 0, Skipped: 0, Time elapsed: 0.235 sec - in org.springframework.data.auditing.IsNewAwareAuditingHandlerUnitTests
20-Jun-2019 03:24:49 Running org.springframework.data.auditing.DefaultAuditableBeanWrapperFactoryUnitTests
20-Jun-2019 03:24:49 Tests run: 10, Failures: 0, Errors: 0, Skipped: 0, Time elapsed: 0.048 sec - in org.springframework.data.auditing.DefaultAuditableBeanWrapperFactoryUnitTests
20-Jun-2019 03:24:49 Running org.springframework.data.auditing.AuditingHandlerUnitTests
20-Jun-2019 03:24:49 Tests run: 7, Failures: 0, Errors: 0, Skipped: 0, Time elapsed: 0.006 sec - in org.springframework.data.auditing.AuditingHandlerUnitTests
20-Jun-2019 03:24:49 Running org.springframework.data.auditing.ReflectionAuditingBeanWrapperUnitTests
20-Jun-2019 03:24:49 Tests run: 4, Failures: 0, Errors: 0, Skipped: 0, Time elapsed: 0.039 sec - in org.springframework.data.auditing.ReflectionAuditingBeanWrapperUnitTests
20-Jun-2019 03:24:49 Running org.springframework.data.auditing.MappingAuditableBeanWrapperFactoryUnitTests
20-Jun-2019 03:24:49 Tests run: 12, Failures: 0, Errors: 0, Skipped: 0, Time elapsed: 0.129 sec - in org.springframework.data.auditing.MappingAuditableBeanWrapperFactoryUnitTests
20-Jun-2019 03:24:49 Running org.springframework.data.domain.PageRequestUnitTests
20-Jun-2019 03:24:49 Tests run: 7, Failures: 0, Errors: 0, Skipped: 0, Time elapsed: 0.005 sec - in org.springframework.data.domain.PageRequestUnitTests
20-Jun-2019 03:24:49 Running org.springframework.data.domain.SortUnitTests
20-Jun-2019 03:24:49 Tests run: 17, Failures: 0, Errors: 0, Skipped: 0, Time elapsed: 0.011 sec - in org.springframework.data.domain.SortUnitTests
20-Jun-2019 03:24:49 Running org.springframework.data.domain.ExampleUnitTests
20-Jun-2019 03:24:49 Tests run: 3, Failures: 0, Errors: 0, Skipped: 0, Time elapsed: 0.008 sec - in org.springframework.data.domain.ExampleUnitTests
20-Jun-2019 03:24:49 Running org.springframework.data.domain.DirectionUnitTests
20-Jun-2019 03:24:49 Tests run: 2, Failures: 0, Errors: 0, Skipped: 0, Time elapsed: 0 sec - in org.springframework.data.domain.DirectionUnitTests
20-Jun-2019 03:24:49 Running org.springframework.data.domain.PageImplUnitTests
20-Jun-2019 03:24:49 Tests run: 14, Failures: 0, Errors: 0, Skipped: 0, Time elapsed: 0.012 sec - in org.springframework.data.domain.PageImplUnitTests
20-Jun-2019 03:24:49 Running org.springframework.data.domain.ExampleMatcherUnitTests
20-Jun-2019 03:24:50 Tests run: 17, Failures: 0, Errors: 0, Skipped: 0, Time elapsed: 0.011 sec - in org.springframework.data.domain.ExampleMatcherUnitTests
20-Jun-2019 03:24:50 Running org.springframework.data.domain.jaxb.SpringDataJaxbUnitTests
20-Jun-2019 03:24:50 Tests run: 3, Failures: 0, Errors: 0, Skipped: 0, Time elapsed: 0.21 sec - in org.springframework.data.domain.jaxb.SpringDataJaxbUnitTests
20-Jun-2019 03:24:50 Running org.springframework.data.domain.RangeUnitTests
20-Jun-2019 03:24:50 Tests run: 11, Failures: 0, Errors: 0, Skipped: 0, Time elapsed: 0.004 sec - in org.springframework.data.domain.RangeUnitTests
20-Jun-2019 03:24:50 Running org.springframework.data.domain.AbstractAggregateRootUnitTests
20-Jun-2019 03:24:50 Tests run: 7, Failures: 0, Errors: 0, Skipped: 0, Time elapsed: 0.001 sec - in org.springframework.data.domain.AbstractAggregateRootUnitTests
20-Jun-2019 03:24:50 Running org.springframework.data.support.CachingIsNewStrategyFactoryUnitTests
20-Jun-2019 03:24:50 Tests run: 2, Failures: 0, Errors: 0, Skipped: 0, Time elapsed: 0.011 sec - in org.springframework.data.support.CachingIsNewStrategyFactoryUnitTests
20-Jun-2019 03:24:50 Running org.springframework.data.support.PersistableIsNewStrategyUnitTests
20-Jun-2019 03:24:50 Tests run: 2, Failures: 0, Errors: 0, Skipped: 0, Time elapsed: 0 sec - in org.springframework.data.support.PersistableIsNewStrategyUnitTests
20-Jun-2019 03:24:50 Running org.springframework.data.annotation.TypeAliasUnitTests
20-Jun-2019 03:24:50 Tests run: 1, Failures: 0, Errors: 0, Skipped: 0, Time elapsed: 0.039 sec - in org.springframework.data.annotation.TypeAliasUnitTests
20-Jun-2019 03:24:50 Running org.springframework.data.DependencyTests
20-Jun-2019 03:24:52 Tests run: 1, Failures: 0, Errors: 0, Skipped: 0, Time elapsed: 2.235 sec - in org.springframework.data.DependencyTests
20-Jun-2019 03:24:52 Running org.springframework.data.history.RevisionsUnitTests
20-Jun-2019 03:24:52 Tests run: 5, Failures: 0, Errors: 0, Skipped: 0, Time elapsed: 0.018 sec - in org.springframework.data.history.RevisionsUnitTests
20-Jun-2019 03:24:52 Running org.springframework.data.history.AnnotationRevisionMetadataUnitTests
20-Jun-2019 03:24:53 Tests run: 7, Failures: 0, Errors: 0, Skipped: 0, Time elapsed: 0.834 sec - in org.springframework.data.history.AnnotationRevisionMetadataUnitTests
20-Jun-2019 03:24:53 Running org.springframework.data.history.RevisionUnitTests
20-Jun-2019 03:24:53 Tests run: 4, Failures: 0, Errors: 0, Skipped: 0, Time elapsed: 0.002 sec - in org.springframework.data.history.RevisionUnitTests
20-Jun-2019 03:24:53 Running org.springframework.data.authentication.UserCredentialsUnitTests
20-Jun-2019 03:24:53 Tests run: 8, Failures: 0, Errors: 0, Skipped: 0, Time elapsed: 0.002 sec - in org.springframework.data.authentication.UserCredentialsUnitTests
20-Jun-2019 03:24:53 Running org.springframework.data.repository.config.RepositoryConfigurationExtensionSupportUnitTests
20-Jun-2019 03:24:53 Tests run: 4, Failures: 0, Errors: 0, Skipped: 0, Time elapsed: 0.248 sec - in org.springframework.data.repository.config.RepositoryConfigurationExtensionSupportUnitTests
20-Jun-2019 03:24:53 Running org.springframework.data.repository.config.RepositoryConfigurationDelegateUnitTests
20-Jun-2019 03:24:53 Tests run: 1, Failures: 0, Errors: 0, Skipped: 0, Time elapsed: 0.029 sec - in org.springframework.data.repository.config.RepositoryConfigurationDelegateUnitTests
20-Jun-2019 03:24:53 Running org.springframework.data.repository.config.AnnotationRepositoryConfigurationSourceUnitTests
20-Jun-2019 03:24:53 Tests run: 9, Failures: 0, Errors: 0, Skipped: 0, Time elapsed: 0.043 sec - in org.springframework.data.repository.config.AnnotationRepositoryConfigurationSourceUnitTests
20-Jun-2019 03:24:53 Running org.springframework.data.repository.config.XmlRepositoryConfigurationSourceUnitTests
20-Jun-2019 03:24:53 Tests run: 1, Failures: 0, Errors: 0, Skipped: 0, Time elapsed: 0.064 sec - in org.springframework.data.repository.config.XmlRepositoryConfigurationSourceUnitTests
20-Jun-2019 03:24:53 Running org.springframework.data.repository.config.SelectionSetUnitTests
20-Jun-2019 03:24:53 Tests run: 7, Failures: 0, Errors: 0, Skipped: 0, Time elapsed: 0.004 sec - in org.springframework.data.repository.config.SelectionSetUnitTests
20-Jun-2019 03:24:53 Running org.springframework.data.repository.config.DefaultRepositoryConfigurationUnitTests
20-Jun-2019 03:24:53 Tests run: 3, Failures: 0, Errors: 0, Skipped: 0, Time elapsed: 0.015 sec - in org.springframework.data.repository.config.DefaultRepositoryConfigurationUnitTests
20-Jun-2019 03:24:53 Running org.springframework.data.repository.config.RepositoryBeanDefinitionRegistrarSupportUnitTests
20-Jun-2019 03:24:53 Tests run: 4, Failures: 0, Errors: 0, Skipped: 0, Time elapsed: 0.164 sec - in org.springframework.data.repository.config.RepositoryBeanDefinitionRegistrarSupportUnitTests
20-Jun-2019 03:24:53 Running org.springframework.data.repository.config.CustomRepositoryImplementationDetectorUnitTests
20-Jun-2019 03:24:54 Tests run: 4, Failures: 0, Errors: 0, Skipped: 0, Time elapsed: 0.117 sec - in org.springframework.data.repository.config.CustomRepositoryImplementationDetectorUnitTests
20-Jun-2019 03:24:54 Running org.springframework.data.repository.config.RepositoryBeanNameGeneratorUnitTests
20-Jun-2019 03:24:54 Tests run: 4, Failures: 0, Errors: 0, Skipped: 0, Time elapsed: 0.002 sec - in org.springframework.data.repository.config.RepositoryBeanNameGeneratorUnitTests
20-Jun-2019 03:24:54 Running org.springframework.data.repository.config.ResourceReaderRepositoryPopulatorBeanDefinitionParserIntegrationTests
20-Jun-2019 03:24:54 Tests run: 2, Failures: 0, Errors: 0, Skipped: 0, Time elapsed: 0.376 sec - in org.springframework.data.repository.config.ResourceReaderRepositoryPopulatorBeanDefinitionParserIntegrationTests
20-Jun-2019 03:24:54 Running org.springframework.data.repository.config.RepositoryBeanDefinitionRegistrarSupportIntegrationTests
20-Jun-2019 03:24:55 Tests run: 5, Failures: 0, Errors: 0, Skipped: 0, Time elapsed: 0.886 sec - in org.springframework.data.repository.config.RepositoryBeanDefinitionRegistrarSupportIntegrationTests
20-Jun-2019 03:24:55 Running org.springframework.data.repository.config.RepositoryComponentProviderUnitTests
20-Jun-2019 03:24:55 Tests run: 5, Failures: 0, Errors: 0, Skipped: 0, Time elapsed: 0.135 sec - in org.springframework.data.repository.config.RepositoryComponentProviderUnitTests
20-Jun-2019 03:24:55 Running org.springframework.data.repository.support.RepositoriesUnitTests
20-Jun-2019 03:24:55 Tests run: 8, Failures: 0, Errors: 0, Skipped: 0, Time elapsed: 0.079 sec - in org.springframework.data.repository.support.RepositoriesUnitTests
20-Jun-2019 03:24:55 Running org.springframework.data.repository.support.CrudRepositoryInvokerUnitTests
20-Jun-2019 03:24:55 Tests run: 9, Failures: 0, Errors: 0, Skipped: 0, Time elapsed: 0.073 sec - in org.springframework.data.repository.support.CrudRepositoryInvokerUnitTests
20-Jun-2019 03:24:55 Running org.springframework.data.repository.support.PaginginAndSortingRepositoryInvokerUnitTests
20-Jun-2019 03:24:55 Tests run: 4, Failures: 0, Errors: 0, Skipped: 0, Time elapsed: 0.044 sec - in org.springframework.data.repository.support.PaginginAndSortingRepositoryInvokerUnitTests
20-Jun-2019 03:24:55 Running org.springframework.data.repository.support.RepositoriesIntegrationTests
20-Jun-2019 03:24:55 Tests run: 2, Failures: 0, Errors: 0, Skipped: 0, Time elapsed: 0.101 sec - in org.springframework.data.repository.support.RepositoriesIntegrationTests
20-Jun-2019 03:24:55 Running org.springframework.data.repository.support.DomainClassConverterUnitTests
20-Jun-2019 03:24:55 Tests run: 10, Failures: 0, Errors: 0, Skipped: 0, Time elapsed: 0.072 sec - in org.springframework.data.repository.support.DomainClassConverterUnitTests
20-Jun-2019 03:24:55 Running org.springframework.data.repository.support.ReflectionRepositoryInvokerUnitTests
20-Jun-2019 03:24:55 Tests run: 19, Failures: 0, Errors: 0, Skipped: 0, Time elapsed: 0.113 sec - in org.springframework.data.repository.support.ReflectionRepositoryInvokerUnitTests
20-Jun-2019 03:24:55 Running org.springframework.data.repository.support.PageableExecutionUtilsUnitTests
20-Jun-2019 03:24:55 Tests run: 6, Failures: 0, Errors: 0, Skipped: 0, Time elapsed: 0.008 sec - in org.springframework.data.repository.support.PageableExecutionUtilsUnitTests
20-Jun-2019 03:24:55 Running org.springframework.data.repository.support.MethodParametersUnitTests
20-Jun-2019 03:24:55 Tests run: 2, Failures: 0, Errors: 0, Skipped: 0, Time elapsed: 0.001 sec - in org.springframework.data.repository.support.MethodParametersUnitTests
20-Jun-2019 03:24:55 Running org.springframework.data.repository.support.DefaultRepositoryInvokerFactoryIntegrationTests
20-Jun-2019 03:24:55 Tests run: 5, Failures: 0, Errors: 0, Skipped: 0, Time elapsed: 0.008 sec - in org.springframework.data.repository.support.DefaultRepositoryInvokerFactoryIntegrationTests
20-Jun-2019 03:24:55 Running org.springframework.data.repository.support.DomainClassConverterIntegrationTests
20-Jun-2019 03:24:56 Tests run: 1, Failures: 0, Errors: 0, Skipped: 0, Time elapsed: 0.049 sec - in org.springframework.data.repository.support.DomainClassConverterIntegrationTests
20-Jun-2019 03:24:56 Running org.springframework.data.repository.support.AnnotationAttributeUnitTests
20-Jun-2019 03:24:56 Tests run: 3, Failures: 0, Errors: 0, Skipped: 0, Time elapsed: 0 sec - in org.springframework.data.repository.support.AnnotationAttributeUnitTests
20-Jun-2019 03:24:56 Running org.springframework.data.repository.core.support.TransactionRepositoryFactoryBeanSupportUnitTests
20-Jun-2019 03:24:56 Tests run: 2, Failures: 0, Errors: 0, Skipped: 0, Time elapsed: 0.016 sec - in org.springframework.data.repository.core.support.TransactionRepositoryFactoryBeanSupportUnitTests
20-Jun-2019 03:24:56 Running org.springframework.data.repository.core.support.TransactionRepositoryProxyPostProcessorUnitTests
20-Jun-2019 03:24:56 Tests run: 6, Failures: 0, Errors: 0, Skipped: 0, Time elapsed: 0.075 sec - in org.springframework.data.repository.core.support.TransactionRepositoryProxyPostProcessorUnitTests
20-Jun-2019 03:24:56 Running org.springframework.data.repository.core.support.DefaultRepositoryInformationUnitTests
20-Jun-2019 03:24:56 Tests run: 18, Failures: 0, Errors: 0, Skipped: 0, Time elapsed: 0.021 sec - in org.springframework.data.repository.core.support.DefaultRepositoryInformationUnitTests
20-Jun-2019 03:24:56 Running org.springframework.data.repository.core.support.DefaultCrudMethodsUnitTests
20-Jun-2019 03:24:56 Tests run: 11, Failures: 0, Errors: 0, Skipped: 0, Time elapsed: 0.007 sec - in org.springframework.data.repository.core.support.DefaultCrudMethodsUnitTests
20-Jun-2019 03:24:56 Running org.springframework.data.repository.core.support.PersistentEntityInformationUnitTests
20-Jun-2019 03:24:56 Tests run: 2, Failures: 0, Errors: 0, Skipped: 0, Time elapsed: 0.005 sec - in org.springframework.data.repository.core.support.PersistentEntityInformationUnitTests
20-Jun-2019 03:24:56 Running org.springframework.data.repository.core.support.QueryExecutorMethodInterceptorUnitTests
20-Jun-2019 03:24:56 Tests run: 2, Failures: 0, Errors: 0, Skipped: 0, Time elapsed: 0.026 sec - in org.springframework.data.repository.core.support.QueryExecutorMethodInterceptorUnitTests
20-Jun-2019 03:24:56 Running org.springframework.data.repository.core.support.PersistenceExceptionTranslationRepositoryProxyPostProcessorUnitTests
20-Jun-2019 03:24:56 Tests run: 2, Failures: 0, Errors: 0, Skipped: 0, Time elapsed: 0.001 sec - in org.springframework.data.repository.core.support.PersistenceExceptionTranslationRepositoryProxyPostProcessorUnitTests
20-Jun-2019 03:24:56 Running org.springframework.data.repository.core.support.PersistableEntityInformationUnitTests
20-Jun-2019 03:24:56 Tests run: 3, Failures: 0, Errors: 0, Skipped: 0, Time elapsed: 0.007 sec - in org.springframework.data.repository.core.support.PersistableEntityInformationUnitTests
20-Jun-2019 03:24:56 Running org.springframework.data.repository.core.support.RepositoryCompositionUnitTests
20-Jun-2019 03:24:56 Tests run: 8, Failures: 0, Errors: 0, Skipped: 0, Time elapsed: 0.021 sec - in org.springframework.data.repository.core.support.RepositoryCompositionUnitTests
20-Jun-2019 03:24:56 Running org.springframework.data.repository.core.support.ReflectionEntityInformationUnitTests
20-Jun-2019 03:24:56 Tests run: 4, Failures: 0, Errors: 0, Skipped: 0, Time elapsed: 0.001 sec - in org.springframework.data.repository.core.support.ReflectionEntityInformationUnitTests
20-Jun-2019 03:24:56 Running org.springframework.data.repository.core.support.RepositoryFactorySupportUnitTests
20-Jun-2019 03:24:58 Tests run: 24, Failures: 0, Errors: 0, Skipped: 0, Time elapsed: 2.05 sec - in org.springframework.data.repository.core.support.RepositoryFactorySupportUnitTests
20-Jun-2019 03:24:58 Running org.springframework.data.repository.core.support.AbstractEntityInformationUnitTests
20-Jun-2019 03:24:58 Tests run: 5, Failures: 0, Errors: 0, Skipped: 0, Time elapsed: 0.002 sec - in org.springframework.data.repository.core.support.AbstractEntityInformationUnitTests
20-Jun-2019 03:24:58 Running org.springframework.data.repository.core.support.ReactiveRepositoryInformationUnitTests
20-Jun-2019 03:24:58 Tests run: 8, Failures: 0, Errors: 0, Skipped: 0, Time elapsed: 0.012 sec - in org.springframework.data.repository.core.support.ReactiveRepositoryInformationUnitTests
20-Jun-2019 03:24:58 Running org.springframework.data.repository.core.support.ReactiveWrapperRepositoryFactorySupportUnitTests
20-Jun-2019 03:24:58 Tests run: 5, Failures: 0, Errors: 0, Skipped: 0, Time elapsed: 0.055 sec - in org.springframework.data.repository.core.support.ReactiveWrapperRepositoryFactorySupportUnitTests
20-Jun-2019 03:24:58 Running org.springframework.data.repository.core.support.RepositoryFactoryBeanSupportUnitTests
20-Jun-2019 03:24:58 Tests run: 4, Failures: 0, Errors: 0, Skipped: 0, Time elapsed: 0.018 sec - in org.springframework.data.repository.core.support.RepositoryFactoryBeanSupportUnitTests
20-Jun-2019 03:24:58 Running org.springframework.data.repository.core.support.CustomAnnotationTransactionAttributeSourceUnitTests
20-Jun-2019 03:24:58 Tests run: 1, Failures: 0, Errors: 0, Skipped: 0, Time elapsed: 0 sec - in org.springframework.data.repository.core.support.CustomAnnotationTransactionAttributeSourceUnitTests
20-Jun-2019 03:24:58 Running org.springframework.data.repository.core.support.AbstractRepositoryMetadataUnitTests
20-Jun-2019 03:24:58 Tests run: 9, Failures: 0, Errors: 0, Skipped: 0, Time elapsed: 0.004 sec - in org.springframework.data.repository.core.support.AbstractRepositoryMetadataUnitTests
20-Jun-2019 03:24:58 Running org.springframework.data.repository.core.support.RepositoryFragmentUnitTests
20-Jun-2019 03:24:58 Tests run: 2, Failures: 0, Errors: 0, Skipped: 0, Time elapsed: 0.001 sec - in org.springframework.data.repository.core.support.RepositoryFragmentUnitTests
20-Jun-2019 03:24:58 Running org.springframework.data.repository.core.support.ExampleSpecificationAccessorUnitTests
20-Jun-2019 03:24:58 Tests run: 20, Failures: 0, Errors: 0, Skipped: 0, Time elapsed: 0.005 sec - in org.springframework.data.repository.core.support.ExampleSpecificationAccessorUnitTests
20-Jun-2019 03:24:58 Running org.springframework.data.repository.core.support.SurroundingTransactionDetectorMethodInterceptorUnitTests
20-Jun-2019 03:24:58 Tests run: 2, Failures: 0, Errors: 0, Skipped: 0, Time elapsed: 0 sec - in org.springframework.data.repository.core.support.SurroundingTransactionDetectorMethodInterceptorUnitTests
20-Jun-2019 03:24:58 Running org.springframework.data.repository.core.support.QueryExecutionResultHandlerUnitTests
20-Jun-2019 03:24:58 Tests run: 27, Failures: 0, Errors: 0, Skipped: 0, Time elapsed: 0.272 sec - in org.springframework.data.repository.core.support.QueryExecutionResultHandlerUnitTests
20-Jun-2019 03:24:58 Running org.springframework.data.repository.core.support.DefaultRepositoryMetadataUnitTests
20-Jun-2019 03:24:58 Tests run: 12, Failures: 0, Errors: 0, Skipped: 0, Time elapsed: 0.004 sec - in org.springframework.data.repository.core.support.DefaultRepositoryMetadataUnitTests
20-Jun-2019 03:24:58 Running org.springframework.data.repository.core.support.AnnotationRepositoryMetadataUnitTests
20-Jun-2019 03:24:58 Tests run: 2, Failures: 0, Errors: 0, Skipped: 0, Time elapsed: 0.001 sec - in org.springframework.data.repository.core.support.AnnotationRepositoryMetadataUnitTests
20-Jun-2019 03:24:58 Running org.springframework.data.repository.core.support.EventPublishingRepositoryProxyPostProcessorUnitTests
20-Jun-2019 03:24:58 Tests run: 17, Failures: 0, Errors: 0, Skipped: 0, Time elapsed: 0.027 sec - in org.springframework.data.repository.core.support.EventPublishingRepositoryProxyPostProcessorUnitTests
20-Jun-2019 03:24:58 Running org.springframework.data.repository.cdi.CdiRepositoryBeanUnitTests
20-Jun-2019 03:24:58 Tests run: 9, Failures: 0, Errors: 0, Skipped: 0, Time elapsed: 0.034 sec - in org.springframework.data.repository.cdi.CdiRepositoryBeanUnitTests
20-Jun-2019 03:24:58 Running org.springframework.data.repository.cdi.WebbeansCdiRepositoryExtensionSupportIntegrationTests
20-Jun-2019 03:24:58 Jun 20, 2019 3:24:58 AM org.apache.webbeans.lifecycle.AbstractLifeCycle bootstrapApplication
20-Jun-2019 03:24:58 INFO: OpenWebBeans Container is starting...
20-Jun-2019 03:24:58 Jun 20, 2019 3:24:58 AM org.apache.webbeans.config.BeansDeployer validateInjectionPoints
20-Jun-2019 03:24:58 INFO: All injection points were validated successfully.
20-Jun-2019 03:24:58 Jun 20, 2019 3:24:58 AM org.apache.webbeans.lifecycle.AbstractLifeCycle bootstrapApplication
20-Jun-2019 03:24:58 INFO: OpenWebBeans Container has started, it took [85] ms.
20-Jun-2019 03:24:58 Tests run: 2, Failures: 0, Errors: 0, Skipped: 0, Time elapsed: 0.208 sec - in org.springframework.data.repository.cdi.WebbeansCdiRepositoryExtensionSupportIntegrationTests
20-Jun-2019 03:24:58 Running org.springframework.data.repository.init.ResourceReaderRepositoryInitializerUnitTests
20-Jun-2019 03:24:58 Tests run: 3, Failures: 0, Errors: 0, Skipped: 0, Time elapsed: 0.023 sec - in org.springframework.data.repository.init.ResourceReaderRepositoryInitializerUnitTests
20-Jun-2019 03:24:58 Running org.springframework.data.repository.init.Jackson2ResourceReaderIntegrationTests
20-Jun-2019 03:24:58 Tests run: 1, Failures: 0, Errors: 0, Skipped: 0, Time elapsed: 0.047 sec - in org.springframework.data.repository.init.Jackson2ResourceReaderIntegrationTests
20-Jun-2019 03:24:58 Running org.springframework.data.repository.util.ReactiveWrapperConvertersUnitTests
20-Jun-2019 03:24:59 Tests run: 30, Failures: 0, Errors: 0, Skipped: 0, Time elapsed: 0.033 sec - in org.springframework.data.repository.util.ReactiveWrapperConvertersUnitTests
20-Jun-2019 03:24:59 Running org.springframework.data.repository.util.ClassUtilsUnitTests
20-Jun-2019 03:24:59 Tests run: 3, Failures: 0, Errors: 0, Skipped: 0, Time elapsed: 0.002 sec - in org.springframework.data.repository.util.ClassUtilsUnitTests
20-Jun-2019 03:24:59 Running org.springframework.data.repository.util.QueryExecutionConvertersUnitTests
20-Jun-2019 03:24:59 Tests run: 33, Failures: 0, Errors: 0, Skipped: 0, Time elapsed: 0.118 sec - in org.springframework.data.repository.util.QueryExecutionConvertersUnitTests
20-Jun-2019 03:24:59 Running org.springframework.data.repository.util.ReactiveWrappersUnitTests
20-Jun-2019 03:24:59 Tests run: 3, Failures: 0, Errors: 0, Skipped: 0, Time elapsed: 0.001 sec - in org.springframework.data.repository.util.ReactiveWrappersUnitTests
20-Jun-2019 03:24:59 Running org.springframework.data.repository.query.ParametersParameterAccessorUnitTests
20-Jun-2019 03:24:59 Tests run: 3, Failures: 0, Errors: 0, Skipped: 0, Time elapsed: 0.004 sec - in org.springframework.data.repository.query.ParametersParameterAccessorUnitTests
20-Jun-2019 03:24:59 Running org.springframework.data.repository.query.ParametersUnitTests
20-Jun-2019 03:24:59 Tests run: 16, Failures: 0, Errors: 0, Skipped: 0, Time elapsed: 0.009 sec - in org.springframework.data.repository.query.ParametersUnitTests
20-Jun-2019 03:24:59 Running org.springframework.data.repository.query.ReturnedTypeUnitTests
20-Jun-2019 03:24:59 Tests run: 13, Failures: 0, Errors: 0, Skipped: 0, Time elapsed: 0.028 sec - in org.springframework.data.repository.query.ReturnedTypeUnitTests
20-Jun-2019 03:24:59 Running org.springframework.data.repository.query.ResultProcessorUnitTests
20-Jun-2019 03:24:59 Tests run: 20, Failures: 0, Errors: 0, Skipped: 0, Time elapsed: 0.063 sec - in org.springframework.data.repository.query.ResultProcessorUnitTests
20-Jun-2019 03:24:59 Running org.springframework.data.repository.query.SimpleParameterAccessorUnitTests
20-Jun-2019 03:24:59 Tests run: 9, Failures: 0, Errors: 0, Skipped: 0, Time elapsed: 0.006 sec - in org.springframework.data.repository.query.SimpleParameterAccessorUnitTests
20-Jun-2019 03:24:59 Running org.springframework.data.repository.query.ExtensionAwareEvaluationContextProviderUnitTests
20-Jun-2019 03:24:59 Tests run: 17, Failures: 0, Errors: 0, Skipped: 0, Time elapsed: 0.047 sec - in org.springframework.data.repository.query.ExtensionAwareEvaluationContextProviderUnitTests
20-Jun-2019 03:24:59 Running org.springframework.data.repository.query.parser.PartTreeUnitTests
20-Jun-2019 03:24:59 Tests run: 72, Failures: 0, Errors: 0, Skipped: 0, Time elapsed: 0.045 sec - in org.springframework.data.repository.query.parser.PartTreeUnitTests
20-Jun-2019 03:24:59 Running org.springframework.data.repository.query.parser.OrderBySourceUnitTests
20-Jun-2019 03:24:59 Tests run: 7, Failures: 0, Errors: 0, Skipped: 0, Time elapsed: 0.003 sec - in org.springframework.data.repository.query.parser.OrderBySourceUnitTests
20-Jun-2019 03:24:59 Running org.springframework.data.repository.query.EvaluationContextExtensionInformationUnitTests
20-Jun-2019 03:24:59 Tests run: 1, Failures: 0, Errors: 0, Skipped: 0, Time elapsed: 0.001 sec - in org.springframework.data.repository.query.EvaluationContextExtensionInformationUnitTests
20-Jun-2019 03:24:59 Running org.springframework.data.repository.query.QueryMethodUnitTests
20-Jun-2019 03:24:59 Tests run: 20, Failures: 0, Errors: 0, Skipped: 0, Time elapsed: 0.009 sec - in org.springframework.data.repository.query.QueryMethodUnitTests
20-Jun-2019 03:24:59 Running org.springframework.data.repository.query.ParameterUnitTests
20-Jun-2019 03:24:59 Tests run: 2, Failures: 0, Errors: 0, Skipped: 0, Time elapsed: 0 sec - in org.springframework.data.repository.query.ParameterUnitTests
20-Jun-2019 03:24:59 Running org.springframework.data.mapping.MappingMetadataTests
20-Jun-2019 03:24:59 Tests run: 2, Failures: 0, Errors: 0, Skipped: 0, Time elapsed: 0.006 sec - in org.springframework.data.mapping.MappingMetadataTests
20-Jun-2019 03:24:59 Running org.springframework.data.mapping.model.IdPropertyIdentifierAccessorUnitTests
20-Jun-2019 03:24:59 Tests run: 3, Failures: 0, Errors: 0, Skipped: 0, Time elapsed: 0.003 sec - in org.springframework.data.mapping.model.IdPropertyIdentifierAccessorUnitTests
20-Jun-2019 03:24:59 Running org.springframework.data.mapping.model.SnakeCaseFieldNamingStrategyUnitTests
20-Jun-2019 03:24:59 Tests run: 1, Failures: 0, Errors: 0, Skipped: 0, Time elapsed: 0.016 sec - in org.springframework.data.mapping.model.SnakeCaseFieldNamingStrategyUnitTests
20-Jun-2019 03:24:59 Running org.springframework.data.mapping.model.ClassGeneratingPropertyAccessorFactoryDatatypeTests
20-Jun-2019 03:25:00 Tests run: 272, Failures: 0, Errors: 0, Skipped: 0, Time elapsed: 0.712 sec - in org.springframework.data.mapping.model.ClassGeneratingPropertyAccessorFactoryDatatypeTests
20-Jun-2019 03:25:00 Running org.springframework.data.mapping.model.PersistentEntityParameterValueProviderUnitTests
20-Jun-2019 03:25:00 Tests run: 2, Failures: 0, Errors: 0, Skipped: 0, Time elapsed: 0.007 sec - in org.springframework.data.mapping.model.PersistentEntityParameterValueProviderUnitTests
20-Jun-2019 03:25:00 Running org.springframework.data.mapping.model.PreferredConstructorDiscovererUnitTests
20-Jun-2019 03:25:00 Tests run: 7, Failures: 0, Errors: 0, Skipped: 0, Time elapsed: 0.033 sec - in org.springframework.data.mapping.model.PreferredConstructorDiscovererUnitTests
20-Jun-2019 03:25:00 Running org.springframework.data.mapping.model.CamelCaseAbbreviatingFieldNamingStrategyUnitTests
20-Jun-2019 03:25:00 Tests run: 1, Failures: 0, Errors: 0, Skipped: 0, Time elapsed: 0.001 sec - in org.springframework.data.mapping.model.CamelCaseAbbreviatingFieldNamingStrategyUnitTests
20-Jun-2019 03:25:00 Running org.springframework.data.mapping.model.BasicPersistentEntityUnitTests
20-Jun-2019 03:25:00 Tests run: 21, Failures: 0, Errors: 0, Skipped: 1, Time elapsed: 0.021 sec - in org.springframework.data.mapping.model.BasicPersistentEntityUnitTests
20-Jun-2019 03:25:00 Running org.springframework.data.mapping.model.SpelExpressionParameterProviderUnitTests
20-Jun-2019 03:25:00 Tests run: 5, Failures: 0, Errors: 0, Skipped: 0, Time elapsed: 0.029 sec - in org.springframework.data.mapping.model.SpelExpressionParameterProviderUnitTests
20-Jun-2019 03:25:00 Running org.springframework.data.mapping.model.ConvertingPropertyAccessorUnitTests
20-Jun-2019 03:25:00 Tests run: 8, Failures: 0, Errors: 0, Skipped: 0, Time elapsed: 0.006 sec - in org.springframework.data.mapping.model.ConvertingPropertyAccessorUnitTests
20-Jun-2019 03:25:00 Running org.springframework.data.mapping.model.ClassGeneratingPropertyAccessorFactoryEntityTypeTests
20-Jun-2019 03:25:00 Tests run: 2, Failures: 0, Errors: 0, Skipped: 0, Time elapsed: 0.005 sec - in org.springframework.data.mapping.model.ClassGeneratingPropertyAccessorFactoryEntityTypeTests
20-Jun-2019 03:25:00 Running org.springframework.data.mapping.model.ClassGeneratingPropertyAccessorFactoryTests
20-Jun-2019 03:25:00 Tests run: 511, Failures: 0, Errors: 0, Skipped: 1, Time elapsed: 0.663 sec - in org.springframework.data.mapping.model.ClassGeneratingPropertyAccessorFactoryTests
20-Jun-2019 03:25:00 Running org.springframework.data.mapping.model.AnnotationBasedPersistentPropertyUnitTests
20-Jun-2019 03:25:00 Tests run: 25, Failures: 0, Errors: 0, Skipped: 0, Time elapsed: 0.031 sec - in org.springframework.data.mapping.model.AnnotationBasedPersistentPropertyUnitTests
20-Jun-2019 03:25:00 Running org.springframework.data.mapping.model.AbstractPersistentPropertyUnitTests
20-Jun-2019 03:25:00 Tests run: 20, Failures: 0, Errors: 0, Skipped: 0, Time elapsed: 0.019 sec - in org.springframework.data.mapping.model.AbstractPersistentPropertyUnitTests
20-Jun-2019 03:25:00 Running org.springframework.data.mapping.context.PersistentEntitiesUnitTests
20-Jun-2019 03:25:00 Tests run: 3, Failures: 0, Errors: 0, Skipped: 0, Time elapsed: 0.035 sec - in org.springframework.data.mapping.context.PersistentEntitiesUnitTests
20-Jun-2019 03:25:00 Running org.springframework.data.mapping.context.AbstractMappingContextUnitTests
20-Jun-2019 03:25:01 Tests run: 22, Failures: 0, Errors: 0, Skipped: 0, Time elapsed: 0.055 sec - in org.springframework.data.mapping.context.AbstractMappingContextUnitTests
20-Jun-2019 03:25:01 Running org.springframework.data.mapping.context.AbstractMappingContextIntegrationTests
20-Jun-2019 03:25:02 Tests run: 4, Failures: 0, Errors: 0, Skipped: 0, Time elapsed: 1.457 sec - in org.springframework.data.mapping.context.AbstractMappingContextIntegrationTests
20-Jun-2019 03:25:02 Running org.springframework.data.mapping.context.DefaultPersistenPropertyPathUnitTests
20-Jun-2019 03:25:02 Tests run: 14, Failures: 0, Errors: 0, Skipped: 0, Time elapsed: 0.011 sec - in org.springframework.data.mapping.context.DefaultPersistenPropertyPathUnitTests
20-Jun-2019 03:25:02 Running org.springframework.data.mapping.context.MappingContextEventUnitTests
20-Jun-2019 03:25:02 Tests run: 3, Failures: 0, Errors: 0, Skipped: 0, Time elapsed: 0.025 sec - in org.springframework.data.mapping.context.MappingContextEventUnitTests
20-Jun-2019 03:25:02 Running org.springframework.data.mapping.context.MappingContextIsNewStrategyFactoryUnitTests
20-Jun-2019 03:25:02 Tests run: 4, Failures: 0, Errors: 0, Skipped: 0, Time elapsed: 0.009 sec - in org.springframework.data.mapping.context.MappingContextIsNewStrategyFactoryUnitTests
20-Jun-2019 03:25:02 Running org.springframework.data.mapping.context.PropertyMatchUnitTests
20-Jun-2019 03:25:02 Tests run: 5, Failures: 0, Errors: 0, Skipped: 0, Time elapsed: 0.001 sec - in org.springframework.data.mapping.context.PropertyMatchUnitTests
20-Jun-2019 03:25:02 Running org.springframework.data.mapping.PreferredConstructorDiscovererUnitTests
20-Jun-2019 03:25:02 Tests run: 6, Failures: 0, Errors: 0, Skipped: 0, Time elapsed: 0.005 sec - in org.springframework.data.mapping.PreferredConstructorDiscovererUnitTests
20-Jun-2019 03:25:02 Running org.springframework.data.mapping.TargetAwareIdentifierAccessorUnitTests
20-Jun-2019 03:25:02 Tests run: 1, Failures: 0, Errors: 0, Skipped: 0, Time elapsed: 0.001 sec - in org.springframework.data.mapping.TargetAwareIdentifierAccessorUnitTests
20-Jun-2019 03:25:02 Running org.springframework.data.mapping.PropertyReferenceExceptionUnitTests
20-Jun-2019 03:25:02 Tests run: 4, Failures: 0, Errors: 0, Skipped: 0, Time elapsed: 0.002 sec - in org.springframework.data.mapping.PropertyReferenceExceptionUnitTests
20-Jun-2019 03:25:02 Running org.springframework.data.mapping.ParameterUnitTests
20-Jun-2019 03:25:02 Tests run: 5, Failures: 0, Errors: 0, Skipped: 0, Time elapsed: 0.002 sec - in org.springframework.data.mapping.ParameterUnitTests
20-Jun-2019 03:25:02 Running org.springframework.data.mapping.SimpleTypeHolderUnitTests
20-Jun-2019 03:25:02 Tests run: 15, Failures: 0, Errors: 0, Skipped: 0, Time elapsed: 0.005 sec - in org.springframework.data.mapping.SimpleTypeHolderUnitTests
20-Jun-2019 03:25:02 Running org.springframework.data.mapping.PropertyPathUnitTests
20-Jun-2019 03:25:02 Tests run: 38, Failures: 0, Errors: 0, Skipped: 0, Time elapsed: 0.025 sec - in org.springframework.data.mapping.PropertyPathUnitTests
20-Jun-2019 03:25:02 Running org.springframework.data.web.config.SpringDataWebConfigurationIntegrationTests
20-Jun-2019 03:25:02 Tests run: 6, Failures: 0, Errors: 0, Skipped: 0, Time elapsed: 0.135 sec - in org.springframework.data.web.config.SpringDataWebConfigurationIntegrationTests
20-Jun-2019 03:25:02 Running org.springframework.data.web.config.EnableSpringDataWebSupportIntegrationTests
20-Jun-2019 03:25:03 Tests run: 11, Failures: 0, Errors: 0, Skipped: 0, Time elapsed: 0.773 sec - in org.springframework.data.web.config.EnableSpringDataWebSupportIntegrationTests
20-Jun-2019 03:25:03 Running org.springframework.data.web.config.PageableResourcesAssemblerIntegrationTests
20-Jun-2019 03:25:03 Tests run: 3, Failures: 0, Errors: 0, Skipped: 0, Time elapsed: 0.068 sec - in org.springframework.data.web.config.PageableResourcesAssemblerIntegrationTests
20-Jun-2019 03:25:03 Running org.springframework.data.web.JsonProjectingMethodInterceptorFactoryUnitTests
20-Jun-2019 03:25:03 Tests run: 14, Failures: 0, Errors: 0, Skipped: 0, Time elapsed: 0.072 sec - in org.springframework.data.web.JsonProjectingMethodInterceptorFactoryUnitTests
20-Jun-2019 03:25:03 Running org.springframework.data.web.MapDataBinderUnitTests
20-Jun-2019 03:25:03 Tests run: 6, Failures: 0, Errors: 0, Skipped: 0, Time elapsed: 0.019 sec - in org.springframework.data.web.MapDataBinderUnitTests
20-Jun-2019 03:25:03 Running org.springframework.data.web.HateoasPageableHandlerMethodArgumentResolverUnitTests
20-Jun-2019 03:25:03 Tests run: 36, Failures: 0, Errors: 0, Skipped: 0, Time elapsed: 0.061 sec - in org.springframework.data.web.HateoasPageableHandlerMethodArgumentResolverUnitTests
20-Jun-2019 03:25:03 Running org.springframework.data.web.SortHandlerMethodArgumentResolverUnitTests
20-Jun-2019 03:25:03 Tests run: 21, Failures: 0, Errors: 0, Skipped: 0, Time elapsed: 0.008 sec - in org.springframework.data.web.SortHandlerMethodArgumentResolverUnitTests
20-Jun-2019 03:25:03 Running org.springframework.data.web.PagedResourcesAssemblerArgumentResolverUnitTests
20-Jun-2019 03:25:03 Tests run: 10, Failures: 0, Errors: 0, Skipped: 0, Time elapsed: 0.013 sec - in org.springframework.data.web.PagedResourcesAssemblerArgumentResolverUnitTests
20-Jun-2019 03:25:03 Running org.springframework.data.web.HateoasSortHandlerMethodArgumentResolverUnitTests
20-Jun-2019 03:25:03 Tests run: 24, Failures: 0, Errors: 0, Skipped: 0, Time elapsed: 0.008 sec - in org.springframework.data.web.HateoasSortHandlerMethodArgumentResolverUnitTests
20-Jun-2019 03:25:03 Running org.springframework.data.web.XmlBeamHttpMessageConverterUnitTests
20-Jun-2019 03:25:03 [Fatal Error] :2:10: DOCTYPE is disallowed when the feature "http://apache.org/xml/features/disallow-doctype-decl" set to true.
20-Jun-2019 03:25:03 Tests run: 7, Failures: 0, Errors: 0, Skipped: 0, Time elapsed: 0.073 sec - in org.springframework.data.web.XmlBeamHttpMessageConverterUnitTests
20-Jun-2019 03:25:03 Running org.springframework.data.web.PageableHandlerMethodArgumentResolverUnitTests
20-Jun-2019 03:25:03 Tests run: 29, Failures: 0, Errors: 0, Skipped: 0, Time elapsed: 0.009 sec - in org.springframework.data.web.PageableHandlerMethodArgumentResolverUnitTests
20-Jun-2019 03:25:03 Running org.springframework.data.web.ProxyingHandlerMethodArgumentResolverUnitTests
20-Jun-2019 03:25:03 Tests run: 4, Failures: 0, Errors: 0, Skipped: 0, Time elapsed: 0.003 sec - in org.springframework.data.web.ProxyingHandlerMethodArgumentResolverUnitTests
20-Jun-2019 03:25:03 Running org.springframework.data.web.PagedResourcesAssemblerUnitTests
20-Jun-2019 03:25:03 Tests run: 19, Failures: 0, Errors: 0, Skipped: 0, Time elapsed: 0.013 sec - in org.springframework.data.web.PagedResourcesAssemblerUnitTests
20-Jun-2019 03:25:03 Running org.springframework.data.web.querydsl.QuerydslPredicateArgumentResolverUnitTests
20-Jun-2019 03:25:03 Tests run: 14, Failures: 0, Errors: 0, Skipped: 0, Time elapsed: 0.088 sec - in org.springframework.data.web.querydsl.QuerydslPredicateArgumentResolverUnitTests
20-Jun-2019 03:25:03 Running org.springframework.data.web.ProjectingJackson2HttpMessageConverterUnitTests
20-Jun-2019 03:25:03 Tests run: 5, Failures: 0, Errors: 0, Skipped: 0, Time elapsed: 0.006 sec - in org.springframework.data.web.ProjectingJackson2HttpMessageConverterUnitTests
20-Jun-2019 03:25:03 Running org.springframework.data.convert.SimpleTypeInformationMapperUnitTests
20-Jun-2019 03:25:03 Tests run: 5, Failures: 0, Errors: 0, Skipped: 0, Time elapsed: 0.002 sec - in org.springframework.data.convert.SimpleTypeInformationMapperUnitTests
20-Jun-2019 03:25:03 Running org.springframework.data.convert.ParameterizedKotlinInstantiatorUnitTests
20-Jun-2019 03:25:04 Tests run: 260, Failures: 0, Errors: 0, Skipped: 0, Time elapsed: 0.163 sec - in org.springframework.data.convert.ParameterizedKotlinInstantiatorUnitTests
20-Jun-2019 03:25:04 Running org.springframework.data.convert.KotlinClassGeneratingEntityInstantiatorUnitTests
20-Jun-2019 03:25:04 Tests run: 5, Failures: 0, Errors: 0, Skipped: 0, Time elapsed: 0.049 sec - in org.springframework.data.convert.KotlinClassGeneratingEntityInstantiatorUnitTests
20-Jun-2019 03:25:04 Running org.springframework.data.convert.ReflectionEntityInstantiatorUnitTests
20-Jun-2019 03:25:04 Tests run: 6, Failures: 0, Errors: 0, Skipped: 0, Time elapsed: 0.005 sec - in org.springframework.data.convert.ReflectionEntityInstantiatorUnitTests
20-Jun-2019 03:25:04 Running org.springframework.data.convert.ClassGeneratingEntityInstantiatorUnitTests
20-Jun-2019 03:25:04 Tests run: 20, Failures: 0, Errors: 0, Skipped: 0, Time elapsed: 0.018 sec - in org.springframework.data.convert.ClassGeneratingEntityInstantiatorUnitTests
20-Jun-2019 03:25:04 Running org.springframework.data.convert.ConverterBuilderUnitTests
20-Jun-2019 03:25:04 Tests run: 4, Failures: 0, Errors: 0, Skipped: 0, Time elapsed: 0.005 sec - in org.springframework.data.convert.ConverterBuilderUnitTests
20-Jun-2019 03:25:04 Running org.springframework.data.convert.MappingContextTypeInformationMapperUnitTests
20-Jun-2019 03:25:04 Tests run: 6, Failures: 0, Errors: 0, Skipped: 0, Time elapsed: 0.027 sec - in org.springframework.data.convert.MappingContextTypeInformationMapperUnitTests
20-Jun-2019 03:25:04 Running org.springframework.data.convert.DefaultTypeMapperUnitTests
20-Jun-2019 03:25:04 Tests run: 3, Failures: 0, Errors: 0, Skipped: 0, Time elapsed: 0.015 sec - in org.springframework.data.convert.DefaultTypeMapperUnitTests
20-Jun-2019 03:25:04 Running org.springframework.data.convert.ReflectionEntityInstantiatorDataClassUnitTests
20-Jun-2019 03:25:04 Tests run: 2, Failures: 0, Errors: 0, Skipped: 0, Time elapsed: 0.005 sec - in org.springframework.data.convert.ReflectionEntityInstantiatorDataClassUnitTests
20-Jun-2019 03:25:04 Running org.springframework.data.convert.ConfigurableTypeInformationMapperUnitTests
20-Jun-2019 03:25:04 Tests run: 4, Failures: 0, Errors: 0, Skipped: 0, Time elapsed: 0.002 sec - in org.springframework.data.convert.ConfigurableTypeInformationMapperUnitTests
20-Jun-2019 03:25:04 Running org.springframework.data.convert.CustomConversionsUnitTests
20-Jun-2019 03:25:04 Tests run: 14, Failures: 0, Errors: 0, Skipped: 0, Time elapsed: 0.029 sec - in org.springframework.data.convert.CustomConversionsUnitTests
20-Jun-2019 03:25:04 Running org.springframework.data.convert.ThreeTenBackPortConvertersUnitTests
20-Jun-2019 03:25:04 Tests run: 9, Failures: 0, Errors: 0, Skipped: 0, Time elapsed: 0.006 sec - in org.springframework.data.convert.ThreeTenBackPortConvertersUnitTests
20-Jun-2019 03:25:04 Running org.springframework.data.convert.Jsr310ConvertersUnitTests
20-Jun-2019 03:25:04 Tests run: 20, Failures: 0, Errors: 0, Skipped: 0, Time elapsed: 0.014 sec - in org.springframework.data.convert.Jsr310ConvertersUnitTests
20-Jun-2019 03:25:04 Running org.springframework.data.convert.EntityInstantiatorsUnitTests
20-Jun-2019 03:25:04 Tests run: 4, Failures: 0, Errors: 0, Skipped: 0, Time elapsed: 0.007 sec - in org.springframework.data.convert.EntityInstantiatorsUnitTests
20-Jun-2019 03:25:04 Running org.springframework.data.transaction.ChainedTransactionManagerTests
20-Jun-2019 03:25:04 Tests run: 7, Failures: 0, Errors: 0, Skipped: 0, Time elapsed: 0.005 sec - in org.springframework.data.transaction.ChainedTransactionManagerTests
20-Jun-2019 03:25:04 Running org.springframework.data.util.AnnotationDetectionFieldCallbackUnitTests
20-Jun-2019 03:25:04 Tests run: 3, Failures: 0, Errors: 0, Skipped: 0, Time elapsed: 0.001 sec - in org.springframework.data.util.AnnotationDetectionFieldCallbackUnitTests
20-Jun-2019 03:25:04 Running org.springframework.data.util.ReflectionUtilsUnitTests
20-Jun-2019 03:25:04 Tests run: 17, Failures: 0, Errors: 0, Skipped: 0, Time elapsed: 0.009 sec - in org.springframework.data.util.ReflectionUtilsUnitTests
20-Jun-2019 03:25:04 Running org.springframework.data.util.LazyUnitTests
20-Jun-2019 03:25:04 Tests run: 2, Failures: 0, Errors: 0, Skipped: 0, Time elapsed: 0.004 sec - in org.springframework.data.util.LazyUnitTests
20-Jun-2019 03:25:04 Running org.springframework.data.util.AnnotatedTypeScannerUnitTests
20-Jun-2019 03:25:04 Tests run: 1, Failures: 0, Errors: 0, Skipped: 0, Time elapsed: 0.016 sec - in org.springframework.data.util.AnnotatedTypeScannerUnitTests
20-Jun-2019 03:25:04 Running org.springframework.data.util.ClassTypeInformationUnitTests
20-Jun-2019 03:25:04 Tests run: 33, Failures: 0, Errors: 0, Skipped: 0, Time elapsed: 0.028 sec - in org.springframework.data.util.ClassTypeInformationUnitTests
20-Jun-2019 03:25:04 Running org.springframework.data.util.DirectFieldAccessFallbackBeanWrapperUnitTests
20-Jun-2019 03:25:04 Tests run: 4, Failures: 0, Errors: 0, Skipped: 0, Time elapsed: 0.004 sec - in org.springframework.data.util.DirectFieldAccessFallbackBeanWrapperUnitTests
20-Jun-2019 03:25:04 Running org.springframework.data.util.NullableUtilsUnitTests
20-Jun-2019 03:25:04 Tests run: 10, Failures: 0, Errors: 0, Skipped: 0, Time elapsed: 0.009 sec - in org.springframework.data.util.NullableUtilsUnitTests
20-Jun-2019 03:25:04 Running org.springframework.data.util.VersionUnitTests
20-Jun-2019 03:25:04 Tests run: 13, Failures: 0, Errors: 0, Skipped: 0, Time elapsed: 0.005 sec - in org.springframework.data.util.VersionUnitTests
20-Jun-2019 03:25:04 Running org.springframework.data.util.ParsingUtilsUnitTests
20-Jun-2019 03:25:04 Tests run: 2, Failures: 0, Errors: 0, Skipped: 0, Time elapsed: 0.002 sec - in org.springframework.data.util.ParsingUtilsUnitTests
20-Jun-2019 03:25:04 Running org.springframework.data.util.ParameterizedTypeInformationUnitTests
20-Jun-2019 03:25:04 Tests run: 10, Failures: 0, Errors: 0, Skipped: 0, Time elapsed: 0.018 sec - in org.springframework.data.util.ParameterizedTypeInformationUnitTests
20-Jun-2019 03:25:04 Running org.springframework.data.util.DataCmns511Tests
20-Jun-2019 03:25:04 Tests run: 1, Failures: 0, Errors: 0, Skipped: 0, Time elapsed: 0.001 sec - in org.springframework.data.util.DataCmns511Tests
20-Jun-2019 03:25:04 Running org.springframework.data.util.TypeDiscovererUnitTests
20-Jun-2019 03:25:04 Tests run: 12, Failures: 0, Errors: 0, Skipped: 0, Time elapsed: 0.025 sec - in org.springframework.data.util.TypeDiscovererUnitTests
20-Jun-2019 03:25:04 Running org.springframework.data.util.PairUnitTests
20-Jun-2019 03:25:04 Tests run: 5, Failures: 0, Errors: 0, Skipped: 0, Time elapsed: 0.003 sec - in org.springframework.data.util.PairUnitTests
20-Jun-2019 03:25:04 Running org.springframework.data.util.ProxyUtilsUnitTests
20-Jun-2019 03:25:04 Tests run: 3, Failures: 0, Errors: 0, Skipped: 0, Time elapsed: 0.015 sec - in org.springframework.data.util.ProxyUtilsUnitTests
20-Jun-2019 03:25:04 Running org.springframework.data.util.StreamUtilsTests
20-Jun-2019 03:25:04 Tests run: 1, Failures: 0, Errors: 0, Skipped: 0, Time elapsed: 0 sec - in org.springframework.data.util.StreamUtilsTests
20-Jun-2019 03:25:04 Running org.springframework.data.util.AnnotationDetectionMethodCallbackUnitTests
20-Jun-2019 03:25:04 Tests run: 2, Failures: 0, Errors: 0, Skipped: 0, Time elapsed: 0.001 sec - in org.springframework.data.util.AnnotationDetectionMethodCallbackUnitTests
20-Jun-2019 03:25:04 Running org.springframework.data.querydsl.SimpleEntityPathResolverUnitTests
20-Jun-2019 03:25:04 Tests run: 3, Failures: 0, Errors: 0, Skipped: 0, Time elapsed: 0.002 sec - in org.springframework.data.querydsl.SimpleEntityPathResolverUnitTests
20-Jun-2019 03:25:04 Running org.springframework.data.querydsl.binding.QuerydslPredicateBuilderUnitTests
20-Jun-2019 03:25:05 Tests run: 15, Failures: 0, Errors: 0, Skipped: 0, Time elapsed: 0.915 sec - in org.springframework.data.querydsl.binding.QuerydslPredicateBuilderUnitTests
20-Jun-2019 03:25:05 Running org.springframework.data.querydsl.binding.QuerydslBindingsUnitTests
20-Jun-2019 03:25:05 Tests run: 22, Failures: 0, Errors: 0, Skipped: 0, Time elapsed: 0.012 sec - in org.springframework.data.querydsl.binding.QuerydslBindingsUnitTests
20-Jun-2019 03:25:05 Running org.springframework.data.querydsl.binding.QuerydslDefaultBindingUnitTests
20-Jun-2019 03:25:05 Tests run: 5, Failures: 0, Errors: 0, Skipped: 0, Time elapsed: 0.003 sec - in org.springframework.data.querydsl.binding.QuerydslDefaultBindingUnitTests
20-Jun-2019 03:25:05 Running org.springframework.data.querydsl.binding.QuerydslBindingsFactoryUnitTests
20-Jun-2019 03:25:05 Tests run: 3, Failures: 0, Errors: 0, Skipped: 0, Time elapsed: 0.039 sec - in org.springframework.data.querydsl.binding.QuerydslBindingsFactoryUnitTests
20-Jun-2019 03:25:05 Running org.springframework.data.querydsl.QSortUnitTests
20-Jun-2019 03:25:05 Tests run: 12, Failures: 0, Errors: 0, Skipped: 0, Time elapsed: 0.02 sec - in org.springframework.data.querydsl.QSortUnitTests
20-Jun-2019 03:25:05 Running org.springframework.data.querydsl.QPageRequestUnitTests
20-Jun-2019 03:25:05 Tests run: 8, Failures: 0, Errors: 0, Skipped: 0, Time elapsed: 0.003 sec - in org.springframework.data.querydsl.QPageRequestUnitTests
20-Jun-2019 03:25:05 Running org.springframework.data.querydsl.QuerydslUtilsUnitTests
20-Jun-2019 03:25:05 Tests run: 2, Failures: 0, Errors: 0, Skipped: 0, Time elapsed: 0.001 sec - in org.springframework.data.querydsl.QuerydslUtilsUnitTests
20-Jun-2019 03:25:05 Running org.springframework.data.querydsl.QuerydslRepositoryInvokerAdapterUnitTests
20-Jun-2019 03:25:05 Tests run: 3, Failures: 0, Errors: 0, Skipped: 0, Time elapsed: 0.015 sec - in org.springframework.data.querydsl.QuerydslRepositoryInvokerAdapterUnitTests
20-Jun-2019 03:25:05 Running org.springframework.data.projection.SpelEvaluatingMethodInterceptorUnitTests
20-Jun-2019 03:25:05 Tests run: 6, Failures: 0, Errors: 0, Skipped: 0, Time elapsed: 0.011 sec - in org.springframework.data.projection.SpelEvaluatingMethodInterceptorUnitTests
20-Jun-2019 03:25:05 Running org.springframework.data.projection.ProjectionIntegrationTests
20-Jun-2019 03:25:05 Tests run: 1, Failures: 0, Errors: 0, Skipped: 0, Time elapsed: 0.015 sec - in org.springframework.data.projection.ProjectionIntegrationTests
20-Jun-2019 03:25:05 Running org.springframework.data.projection.SpelAwareProxyProjectionFactoryUnitTests
20-Jun-2019 03:25:05 Tests run: 5, Failures: 0, Errors: 0, Skipped: 0, Time elapsed: 0.008 sec - in org.springframework.data.projection.SpelAwareProxyProjectionFactoryUnitTests
20-Jun-2019 03:25:05 Running org.springframework.data.projection.MapAccessingMethodInterceptorUnitTests
20-Jun-2019 03:25:05 Tests run: 6, Failures: 0, Errors: 0, Skipped: 0, Time elapsed: 0.004 sec - in org.springframework.data.projection.MapAccessingMethodInterceptorUnitTests
20-Jun-2019 03:25:05 Running org.springframework.data.projection.DefaultProjectionInformationUnitTests
20-Jun-2019 03:25:05 Tests run: 6, Failures: 0, Errors: 0, Skipped: 0, Time elapsed: 0.01 sec - in org.springframework.data.projection.DefaultProjectionInformationUnitTests
20-Jun-2019 03:25:05 Running org.springframework.data.projection.DefaultMethodInvokingMethodInterceptorUnitTests
20-Jun-2019 03:25:05 Tests run: 2, Failures: 0, Errors: 0, Skipped: 1, Time elapsed: 0.001 sec - in org.springframework.data.projection.DefaultMethodInvokingMethodInterceptorUnitTests
20-Jun-2019 03:25:05 Running org.springframework.data.projection.ProxyProjectionFactoryUnitTests
20-Jun-2019 03:25:05 Tests run: 17, Failures: 0, Errors: 0, Skipped: 0, Time elapsed: 0.019 sec - in org.springframework.data.projection.ProxyProjectionFactoryUnitTests
20-Jun-2019 03:25:05 Running org.springframework.data.projection.ProjectingMethodInterceptorUnitTests
20-Jun-2019 03:25:05 Tests run: 9, Failures: 0, Errors: 0, Skipped: 0, Time elapsed: 0.021 sec - in org.springframework.data.projection.ProjectingMethodInterceptorUnitTests
20-Jun-2019 03:25:05 Running org.springframework.data.projection.PropertyAccessingMethodInterceptorUnitTests
20-Jun-2019 03:25:05 Tests run: 7, Failures: 0, Errors: 0, Skipped: 0, Time elapsed: 0.006 sec - in org.springframework.data.projection.PropertyAccessingMethodInterceptorUnitTests
20-Jun-2019 03:25:05 Running org.springframework.data.geo.GeoResultUnitTests
20-Jun-2019 03:25:05 Tests run: 4, Failures: 0, Errors: 0, Skipped: 0, Time elapsed: 0.009 sec - in org.springframework.data.geo.GeoResultUnitTests
20-Jun-2019 03:25:05 Running org.springframework.data.geo.GeoModuleIntegrationTests
20-Jun-2019 03:25:05 Tests run: 5, Failures: 0, Errors: 0, Skipped: 0, Time elapsed: 0.034 sec - in org.springframework.data.geo.GeoModuleIntegrationTests
20-Jun-2019 03:25:05 Running org.springframework.data.geo.DistanceUnitTests
20-Jun-2019 03:25:05 Tests run: 12, Failures: 0, Errors: 0, Skipped: 0, Time elapsed: 0.004 sec - in org.springframework.data.geo.DistanceUnitTests
20-Jun-2019 03:25:05 Running org.springframework.data.geo.PointUnitTests
20-Jun-2019 03:25:05 Tests run: 4, Failures: 0, Errors: 0, Skipped: 0, Time elapsed: 0.003 sec - in org.springframework.data.geo.PointUnitTests
20-Jun-2019 03:25:05 Running org.springframework.data.geo.PolygonUnitTests
20-Jun-2019 03:25:05 Tests run: 5, Failures: 0, Errors: 0, Skipped: 0, Time elapsed: 0.004 sec - in org.springframework.data.geo.PolygonUnitTests
20-Jun-2019 03:25:05 Running org.springframework.data.geo.format.PointFormatterUnitTests
20-Jun-2019 03:25:05 Tests run: 11, Failures: 0, Errors: 0, Skipped: 0, Time elapsed: 0.005 sec - in org.springframework.data.geo.format.PointFormatterUnitTests
20-Jun-2019 03:25:05 Running org.springframework.data.geo.format.DistanceFormatterUnitTests
20-Jun-2019 03:25:05 Tests run: 19, Failures: 0, Errors: 0, Skipped: 0, Time elapsed: 0.008 sec - in org.springframework.data.geo.format.DistanceFormatterUnitTests
20-Jun-2019 03:25:05 Running org.springframework.data.geo.BoxUnitTests
20-Jun-2019 03:25:05 Tests run: 4, Failures: 0, Errors: 0, Skipped: 0, Time elapsed: 0.002 sec - in org.springframework.data.geo.BoxUnitTests
20-Jun-2019 03:25:05 Running org.springframework.data.geo.GeoResultsUnitTests
20-Jun-2019 03:25:05 Tests run: 2, Failures: 0, Errors: 0, Skipped: 0, Time elapsed: 0.006 sec - in org.springframework.data.geo.GeoResultsUnitTests
20-Jun-2019 03:25:05 Running org.springframework.data.geo.CircleUnitTests
20-Jun-2019 03:25:05 Tests run: 5, Failures: 0, Errors: 0, Skipped: 0, Time elapsed: 0.002 sec - in org.springframework.data.geo.CircleUnitTests
20-Jun-2019 03:25:05
20-Jun-2019 03:25:05 Results :
20-Jun-2019 03:25:05
20-Jun-2019 03:25:05 Tests run: 2656, Failures: 0, Errors: 0, Skipped: 3
20-Jun-2019 03:25:05
20-Jun-2019 03:25:06 [INFO]
20-Jun-2019 03:25:06 [INFO] --- build-helper-maven-plugin:3.0.0:add-source (add-kotlin-source) @ spring-data-commons ---
20-Jun-2019 03:25:06 [INFO] Source directory: /opt/bamboo-home/xml-data/build-dir/SPRINGDATACMNS-DATACMNS143-JOB1/src/main/kotlin added.
20-Jun-2019 03:25:06 [INFO]
20-Jun-2019 03:25:06 [INFO] --- maven-jar-plugin:3.0.2:jar (default-jar) @ spring-data-commons ---
20-Jun-2019 03:25:06 [INFO] Building jar: /opt/bamboo-home/xml-data/build-dir/SPRINGDATACMNS-DATACMNS143-JOB1/target/spring-data-commons-2.0.15.BUILD-SNAPSHOT.jar
20-Jun-2019 03:25:06 [INFO]
20-Jun-2019 03:25:06 [INFO] >>> maven-source-plugin:3.0.1:jar (attach-sources) > generate-sources @ spring-data-commons >>>
20-Jun-2019 03:25:06 [INFO]
20-Jun-2019 03:25:06 [INFO] --- maven-enforcer-plugin:1.4.1:enforce (enforce-maven-version) @ spring-data-commons ---
20-Jun-2019 03:25:06 [INFO]
20-Jun-2019 03:25:06 [INFO] --- maven-enforcer-plugin:1.4.1:enforce (enforce-rules) @ spring-data-commons ---
20-Jun-2019 03:25:06 [INFO]
20-Jun-2019 03:25:06 [INFO] --- lombok-maven-plugin:1.18.4.0:delombok (default) @ spring-data-commons ---
20-Jun-2019 03:25:09 [INFO] Delombok complete.
20-Jun-2019 03:25:09 [INFO]
20-Jun-2019 03:25:09 [INFO] <<< maven-source-plugin:3.0.1:jar (attach-sources) < generate-sources @ spring-data-commons <<<
20-Jun-2019 03:25:09 [INFO]
20-Jun-2019 03:25:09 [INFO]
20-Jun-2019 03:25:09 [INFO] --- maven-source-plugin:3.0.1:jar (attach-sources) @ spring-data-commons ---
20-Jun-2019 03:25:09 [INFO] Building jar: /opt/bamboo-home/xml-data/build-dir/SPRINGDATACMNS-DATACMNS143-JOB1/target/spring-data-commons-2.0.15.BUILD-SNAPSHOT-sources.jar
20-Jun-2019 03:25:09 [INFO]
20-Jun-2019 03:25:09 [INFO] --- maven-javadoc-plugin:3.1.0:jar (package-javadoc) @ spring-data-commons ---
20-Jun-2019 03:25:11 [WARNING] Unable to find the resource '${shared.resources}/javadoc/spring-javadoc.css'. Using default Javadoc resources.
20-Jun-2019 03:25:15 [INFO]
20-Jun-2019 03:25:15 100 warnings
20-Jun-2019 03:25:15 [WARNING] Javadoc Warnings
20-Jun-2019 03:25:15 [WARNING] /opt/bamboo-home/xml-data/build-dir/SPRINGDATACMNS-DATACMNS143-JOB1/target/generated-sources/delombok/org/springframework/data/repository/CrudRepository.java:78: warning - @return tag has no arguments.
20-Jun-2019 03:25:15 [WARNING] /opt/bamboo-home/xml-data/build-dir/SPRINGDATACMNS-DATACMNS143-JOB1/target/generated-sources/delombok/org/springframework/data/repository/RepositoryDefinition.java:47: warning - @return tag has no arguments.
20-Jun-2019 03:25:15 [WARNING] /opt/bamboo-home/xml-data/build-dir/SPRINGDATACMNS-DATACMNS143-JOB1/target/generated-sources/delombok/org/springframework/data/repository/RepositoryDefinition.java:55: warning - @return tag has no arguments.
20-Jun-2019 03:25:15 [WARNING] /opt/bamboo-home/xml-data/build-dir/SPRINGDATACMNS-DATACMNS143-JOB1/target/generated-sources/delombok/org/springframework/data/mapping/Alias.java:121: warning - @return tag has no arguments.
20-Jun-2019 03:25:15 [WARNING] /opt/bamboo-home/xml-data/build-dir/SPRINGDATACMNS-DATACMNS143-JOB1/target/generated-sources/delombok/org/springframework/data/mapping/PersistentEntity.java:214: warning - @return tag has no arguments.
20-Jun-2019 03:25:15 [WARNING] /opt/bamboo-home/xml-data/build-dir/SPRINGDATACMNS-DATACMNS143-JOB1/target/generated-sources/delombok/org/springframework/data/mapping/PersistentEntity.java:221: warning - @return tag has no arguments.
20-Jun-2019 03:25:15 [WARNING] /opt/bamboo-home/xml-data/build-dir/SPRINGDATACMNS-DATACMNS143-JOB1/target/generated-sources/delombok/org/springframework/data/mapping/PersistentProperty.java:63: warning - @return tag has no arguments.
20-Jun-2019 03:25:15 [WARNING] /opt/bamboo-home/xml-data/build-dir/SPRINGDATACMNS-DATACMNS143-JOB1/target/generated-sources/delombok/org/springframework/data/mapping/PersistentProperty.java:82: warning - @return tag has no arguments.
20-Jun-2019 03:25:15 [WARNING] /opt/bamboo-home/xml-data/build-dir/SPRINGDATACMNS-DATACMNS143-JOB1/target/generated-sources/delombok/org/springframework/data/mapping/PersistentProperty.java:196: warning - @return tag has no arguments.
20-Jun-2019 03:25:15 [WARNING] /opt/bamboo-home/xml-data/build-dir/SPRINGDATACMNS-DATACMNS143-JOB1/target/generated-sources/delombok/org/springframework/data/mapping/PersistentProperty.java:203: warning - @return tag has no arguments.
20-Jun-2019 03:25:15 [WARNING] /opt/bamboo-home/xml-data/build-dir/SPRINGDATACMNS-DATACMNS143-JOB1/target/generated-sources/delombok/org/springframework/data/mapping/PersistentProperty.java:210: warning - @return tag has no arguments.
20-Jun-2019 03:25:15 [WARNING] /opt/bamboo-home/xml-data/build-dir/SPRINGDATACMNS-DATACMNS143-JOB1/target/generated-sources/delombok/org/springframework/data/mapping/PersistentProperty.java:217: warning - @return tag has no arguments.
20-Jun-2019 03:25:15 [WARNING] /opt/bamboo-home/xml-data/build-dir/SPRINGDATACMNS-DATACMNS143-JOB1/target/generated-sources/delombok/org/springframework/data/mapping/PersistentProperty.java:224: warning - @return tag has no arguments.
20-Jun-2019 03:25:15 [WARNING] /opt/bamboo-home/xml-data/build-dir/SPRINGDATACMNS-DATACMNS143-JOB1/target/generated-sources/delombok/org/springframework/data/mapping/PersistentProperty.java:232: warning - @return tag has no arguments.
20-Jun-2019 03:25:15 [WARNING] /opt/bamboo-home/xml-data/build-dir/SPRINGDATACMNS-DATACMNS143-JOB1/target/generated-sources/delombok/org/springframework/data/mapping/PersistentProperty.java:239: warning - @return tag has no arguments.
20-Jun-2019 03:25:15 [WARNING] /opt/bamboo-home/xml-data/build-dir/SPRINGDATACMNS-DATACMNS143-JOB1/target/generated-sources/delombok/org/springframework/data/mapping/PersistentProperty.java:272: warning - @return tag has no arguments.
20-Jun-2019 03:25:15 [WARNING] /opt/bamboo-home/xml-data/build-dir/SPRINGDATACMNS-DATACMNS143-JOB1/target/generated-sources/delombok/org/springframework/data/mapping/PersistentProperty.java:330: warning - @return tag has no arguments.
20-Jun-2019 03:25:15 [WARNING] /opt/bamboo-home/xml-data/build-dir/SPRINGDATACMNS-DATACMNS143-JOB1/target/generated-sources/delombok/org/springframework/data/mapping/PreferredConstructor.java:73: warning - @return tag has no arguments.
20-Jun-2019 03:25:15 [WARNING] /opt/bamboo-home/xml-data/build-dir/SPRINGDATACMNS-DATACMNS143-JOB1/target/generated-sources/delombok/org/springframework/data/mapping/PreferredConstructor.java:82: warning - @return tag has no arguments.
20-Jun-2019 03:25:15 [WARNING] /opt/bamboo-home/xml-data/build-dir/SPRINGDATACMNS-DATACMNS143-JOB1/target/generated-sources/delombok/org/springframework/data/mapping/PreferredConstructor.java:92: warning - @return tag has no arguments.
20-Jun-2019 03:25:15 [WARNING] /opt/bamboo-home/xml-data/build-dir/SPRINGDATACMNS-DATACMNS143-JOB1/target/generated-sources/delombok/org/springframework/data/mapping/PreferredConstructor.java:102: warning - @return tag has no arguments.
20-Jun-2019 03:25:15 [WARNING] /opt/bamboo-home/xml-data/build-dir/SPRINGDATACMNS-DATACMNS143-JOB1/target/generated-sources/delombok/org/springframework/data/mapping/PreferredConstructor.java:111: warning - @return tag has no arguments.
20-Jun-2019 03:25:15 [WARNING] /opt/bamboo-home/xml-data/build-dir/SPRINGDATACMNS-DATACMNS143-JOB1/target/generated-sources/delombok/org/springframework/data/mapping/PreferredConstructor.java:122: warning - @return tag has no arguments.
20-Jun-2019 03:25:15 [WARNING] /opt/bamboo-home/xml-data/build-dir/SPRINGDATACMNS-DATACMNS143-JOB1/target/generated-sources/delombok/org/springframework/data/mapping/PreferredConstructor.java:156: warning - @return tag has no arguments.
20-Jun-2019 03:25:15 [WARNING] /opt/bamboo-home/xml-data/build-dir/SPRINGDATACMNS-DATACMNS143-JOB1/target/generated-sources/delombok/org/springframework/data/mapping/PreferredConstructor.java:221: warning - @return tag has no arguments.
20-Jun-2019 03:25:15 [WARNING] /opt/bamboo-home/xml-data/build-dir/SPRINGDATACMNS-DATACMNS143-JOB1/target/generated-sources/delombok/org/springframework/data/mapping/PreferredConstructor.java:230: warning - @return tag has no arguments.
20-Jun-2019 03:25:15 [WARNING] /opt/bamboo-home/xml-data/build-dir/SPRINGDATACMNS-DATACMNS143-JOB1/target/generated-sources/delombok/org/springframework/data/mapping/PreferredConstructor.java:239: warning - @return tag has no arguments.
20-Jun-2019 03:25:15 [WARNING] /opt/bamboo-home/xml-data/build-dir/SPRINGDATACMNS-DATACMNS143-JOB1/target/generated-sources/delombok/org/springframework/data/mapping/PreferredConstructor.java:248: warning - @return tag has no arguments.
20-Jun-2019 03:25:15 [WARNING] /opt/bamboo-home/xml-data/build-dir/SPRINGDATACMNS-DATACMNS143-JOB1/target/generated-sources/delombok/org/springframework/data/mapping/PreferredConstructor.java:257: warning - @return tag has no arguments.
20-Jun-2019 03:25:15 [WARNING] /opt/bamboo-home/xml-data/build-dir/SPRINGDATACMNS-DATACMNS143-JOB1/target/generated-sources/delombok/org/springframework/data/mapping/PropertyPath.java:129: warning - @return tag has no arguments.
20-Jun-2019 03:25:15 [WARNING] /opt/bamboo-home/xml-data/build-dir/SPRINGDATACMNS-DATACMNS143-JOB1/target/generated-sources/delombok/org/springframework/data/mapping/PropertyPath.java:150: warning - @return tag has no arguments.
20-Jun-2019 03:25:15 [WARNING] /opt/bamboo-home/xml-data/build-dir/SPRINGDATACMNS-DATACMNS143-JOB1/target/generated-sources/delombok/org/springframework/data/mapping/PropertyPath.java:159: warning - @return tag has no arguments.
20-Jun-2019 03:25:15 [WARNING] /opt/bamboo-home/xml-data/build-dir/SPRINGDATACMNS-DATACMNS143-JOB1/target/generated-sources/delombok/org/springframework/data/mapping/PropertyPath.java:171: warning - @return tag has no arguments.
20-Jun-2019 03:25:15 [WARNING] /opt/bamboo-home/xml-data/build-dir/SPRINGDATACMNS-DATACMNS143-JOB1/target/generated-sources/delombok/org/springframework/data/mapping/PropertyPath.java:222: warning - @return tag has no arguments.
20-Jun-2019 03:25:15 [WARNING] /opt/bamboo-home/xml-data/build-dir/SPRINGDATACMNS-DATACMNS143-JOB1/target/generated-sources/delombok/org/springframework/data/mapping/PropertyPath.java:235: warning - @return tag has no arguments.
20-Jun-2019 03:25:15 [WARNING] /opt/bamboo-home/xml-data/build-dir/SPRINGDATACMNS-DATACMNS143-JOB1/target/generated-sources/delombok/org/springframework/data/util/Streamable.java:53: warning - @return tag has no arguments.
20-Jun-2019 03:25:15 [WARNING] /opt/bamboo-home/xml-data/build-dir/SPRINGDATACMNS-DATACMNS143-JOB1/target/generated-sources/delombok/org/springframework/data/util/Streamable.java:63: warning - @return tag has no arguments.
20-Jun-2019 03:25:15 [WARNING] /opt/bamboo-home/xml-data/build-dir/SPRINGDATACMNS-DATACMNS143-JOB1/target/generated-sources/delombok/org/springframework/data/util/Streamable.java:90: warning - @return tag has no arguments.
20-Jun-2019 03:25:15 [WARNING] /opt/bamboo-home/xml-data/build-dir/SPRINGDATACMNS-DATACMNS143-JOB1/target/generated-sources/delombok/org/springframework/data/util/Streamable.java:104: warning - @return tag has no arguments.
20-Jun-2019 03:25:15 [WARNING] /opt/bamboo-home/xml-data/build-dir/SPRINGDATACMNS-DATACMNS143-JOB1/target/generated-sources/delombok/org/springframework/data/util/Streamable.java:118: warning - @return tag has no arguments.
20-Jun-2019 03:25:15 [WARNING] /opt/bamboo-home/xml-data/build-dir/SPRINGDATACMNS-DATACMNS143-JOB1/target/generated-sources/delombok/org/springframework/data/mapping/PropertyReferenceException.java:123: warning - @return tag has no arguments.
20-Jun-2019 03:25:15 [WARNING] /opt/bamboo-home/xml-data/build-dir/SPRINGDATACMNS-DATACMNS143-JOB1/target/generated-sources/delombok/org/springframework/data/mapping/PropertyReferenceException.java:134: warning - @return tag has no arguments.
20-Jun-2019 03:25:15 [WARNING] /opt/bamboo-home/xml-data/build-dir/SPRINGDATACMNS-DATACMNS143-JOB1/target/generated-sources/delombok/org/springframework/data/mapping/TargetAwareIdentifierAccessor.java:28: warning - @soundtrack is an unknown tag.
20-Jun-2019 03:25:15 [WARNING] /opt/bamboo-home/xml-data/build-dir/SPRINGDATACMNS-DATACMNS143-JOB1/target/generated-sources/delombok/org/springframework/data/repository/core/EntityInformation.java:35: warning - @return tag has no arguments.
20-Jun-2019 03:25:15 [WARNING] /opt/bamboo-home/xml-data/build-dir/SPRINGDATACMNS-DATACMNS143-JOB1/target/generated-sources/delombok/org/springframework/data/repository/core/EntityInformation.java:44: warning - @return tag has no arguments.
20-Jun-2019 03:25:15 [WARNING] /opt/bamboo-home/xml-data/build-dir/SPRINGDATACMNS-DATACMNS143-JOB1/target/generated-sources/delombok/org/springframework/data/repository/core/EntityInformation.java:72: warning - @return tag has no arguments.
20-Jun-2019 03:25:15 [WARNING] /opt/bamboo-home/xml-data/build-dir/SPRINGDATACMNS-DATACMNS143-JOB1/target/generated-sources/delombok/org/springframework/data/repository/core/EntityMetadata.java:30: warning - @return tag has no arguments.
20-Jun-2019 03:25:15 [WARNING] /opt/bamboo-home/xml-data/build-dir/SPRINGDATACMNS-DATACMNS143-JOB1/target/generated-sources/delombok/org/springframework/data/repository/core/support/AbstractRepositoryMetadata.java:69: warning - @return tag has no arguments.
20-Jun-2019 03:25:15 [WARNING] /opt/bamboo-home/xml-data/build-dir/SPRINGDATACMNS-DATACMNS143-JOB1/target/generated-sources/delombok/org/springframework/data/repository/core/RepositoryMetadata.java:50: warning - @return tag has no arguments.
20-Jun-2019 03:25:15 [WARNING] /opt/bamboo-home/xml-data/build-dir/SPRINGDATACMNS-DATACMNS143-JOB1/target/generated-sources/delombok/org/springframework/data/repository/core/RepositoryMetadata.java:59: warning - @return tag has no arguments.
20-Jun-2019 03:25:15 [WARNING] /opt/bamboo-home/xml-data/build-dir/SPRINGDATACMNS-DATACMNS143-JOB1/target/generated-sources/delombok/org/springframework/data/repository/core/RepositoryMetadata.java:66: warning - @return tag has no arguments.
20-Jun-2019 03:25:15 [WARNING] /opt/bamboo-home/xml-data/build-dir/SPRINGDATACMNS-DATACMNS143-JOB1/target/generated-sources/delombok/org/springframework/data/repository/core/RepositoryMetadata.java:73: warning - @return tag has no arguments.
20-Jun-2019 03:25:15 [WARNING] /opt/bamboo-home/xml-data/build-dir/SPRINGDATACMNS-DATACMNS143-JOB1/target/generated-sources/delombok/org/springframework/data/repository/core/RepositoryMetadata.java:92: warning - @return tag has no arguments.
20-Jun-2019 03:25:15 [WARNING] /opt/bamboo-home/xml-data/build-dir/SPRINGDATACMNS-DATACMNS143-JOB1/target/generated-sources/delombok/org/springframework/data/repository/core/CrudMethods.java:48: warning - @return tag has no arguments.
20-Jun-2019 03:25:15 [WARNING] /opt/bamboo-home/xml-data/build-dir/SPRINGDATACMNS-DATACMNS143-JOB1/target/generated-sources/delombok/org/springframework/data/repository/core/CrudMethods.java:64: warning - @return tag has no arguments.
20-Jun-2019 03:25:15 [WARNING] /opt/bamboo-home/xml-data/build-dir/SPRINGDATACMNS-DATACMNS143-JOB1/target/generated-sources/delombok/org/springframework/data/repository/core/CrudMethods.java:80: warning - @return tag has no arguments.
20-Jun-2019 03:25:15 [WARNING] /opt/bamboo-home/xml-data/build-dir/SPRINGDATACMNS-DATACMNS143-JOB1/target/generated-sources/delombok/org/springframework/data/repository/core/CrudMethods.java:95: warning - @return tag has no arguments.
20-Jun-2019 03:25:15 [WARNING] /opt/bamboo-home/xml-data/build-dir/SPRINGDATACMNS-DATACMNS143-JOB1/target/generated-sources/delombok/org/springframework/data/repository/core/support/EventPublishingRepositoryProxyPostProcessor.java:52: warning - @soundtrack is an unknown tag.
20-Jun-2019 03:25:15 [WARNING] /opt/bamboo-home/xml-data/build-dir/SPRINGDATACMNS-DATACMNS143-JOB1/target/generated-sources/delombok/org/springframework/data/repository/core/NamedQueries.java:33: warning - @return tag has no arguments.
20-Jun-2019 03:25:15 [WARNING] /opt/bamboo-home/xml-data/build-dir/SPRINGDATACMNS-DATACMNS143-JOB1/target/generated-sources/delombok/org/springframework/data/repository/core/NamedQueries.java:42: warning - @return tag has no arguments.
20-Jun-2019 03:25:15 [WARNING] /opt/bamboo-home/xml-data/build-dir/SPRINGDATACMNS-DATACMNS143-JOB1/target/generated-sources/delombok/org/springframework/data/repository/core/support/RepositoryFactorySupport.java:210: warning - @return tag has no arguments.
20-Jun-2019 03:25:15 [WARNING] /opt/bamboo-home/xml-data/build-dir/SPRINGDATACMNS-DATACMNS143-JOB1/target/generated-sources/delombok/org/springframework/data/repository/core/support/RepositoryFactorySupport.java:234: warning - @return tag has no arguments.
20-Jun-2019 03:25:15 [WARNING] /opt/bamboo-home/xml-data/build-dir/SPRINGDATACMNS-DATACMNS143-JOB1/target/generated-sources/delombok/org/springframework/data/repository/core/support/RepositoryFactorySupport.java:249: warning - @return tag has no arguments.
20-Jun-2019 03:25:15 [WARNING] /opt/bamboo-home/xml-data/build-dir/SPRINGDATACMNS-DATACMNS143-JOB1/target/generated-sources/delombok/org/springframework/data/repository/core/support/RepositoryFactorySupport.java:263: warning - @return tag has no arguments.
20-Jun-2019 03:25:15 [WARNING] /opt/bamboo-home/xml-data/build-dir/SPRINGDATACMNS-DATACMNS143-JOB1/target/generated-sources/delombok/org/springframework/data/repository/core/support/RepositoryFactorySupport.java:316: warning - @return tag has no arguments.
20-Jun-2019 03:25:15 [WARNING] /opt/bamboo-home/xml-data/build-dir/SPRINGDATACMNS-DATACMNS143-JOB1/target/generated-sources/delombok/org/springframework/data/repository/core/support/RepositoryFactorySupport.java:375: warning - @return tag has no arguments.
20-Jun-2019 03:25:15 [WARNING] /opt/bamboo-home/xml-data/build-dir/SPRINGDATACMNS-DATACMNS143-JOB1/target/generated-sources/delombok/org/springframework/data/repository/core/support/RepositoryFactorySupport.java:383: warning - @return tag has no arguments.
20-Jun-2019 03:25:15 [WARNING] /opt/bamboo-home/xml-data/build-dir/SPRINGDATACMNS-DATACMNS143-JOB1/target/generated-sources/delombok/org/springframework/data/repository/core/support/RepositoryFactorySupport.java:392: warning - @return tag has no arguments.
20-Jun-2019 03:25:15 [WARNING] /opt/bamboo-home/xml-data/build-dir/SPRINGDATACMNS-DATACMNS143-JOB1/target/generated-sources/delombok/org/springframework/data/repository/core/support/RepositoryFactorySupport.java:433: warning - @return tag has no arguments.
20-Jun-2019 03:25:15 [WARNING] /opt/bamboo-home/xml-data/build-dir/SPRINGDATACMNS-DATACMNS143-JOB1/target/generated-sources/delombok/org/springframework/data/repository/core/support/RepositoryFactorySupport.java:447: warning - @return tag has no arguments.
20-Jun-2019 03:25:15 [WARNING] /opt/bamboo-home/xml-data/build-dir/SPRINGDATACMNS-DATACMNS143-JOB1/target/generated-sources/delombok/org/springframework/data/repository/core/RepositoryInformation.java:34: warning - @return tag has no arguments.
20-Jun-2019 03:25:15 [WARNING] /opt/bamboo-home/xml-data/build-dir/SPRINGDATACMNS-DATACMNS143-JOB1/target/generated-sources/delombok/org/springframework/data/repository/core/RepositoryInformation.java:42: warning - @return tag has no arguments.
20-Jun-2019 03:25:15 [WARNING] /opt/bamboo-home/xml-data/build-dir/SPRINGDATACMNS-DATACMNS143-JOB1/target/generated-sources/delombok/org/springframework/data/repository/core/RepositoryInformation.java:50: warning - @return tag has no arguments.
20-Jun-2019 03:25:15 [WARNING] /opt/bamboo-home/xml-data/build-dir/SPRINGDATACMNS-DATACMNS143-JOB1/target/generated-sources/delombok/org/springframework/data/repository/core/RepositoryInformation.java:58: warning - @return tag has no arguments.
20-Jun-2019 03:25:15 [WARNING] /opt/bamboo-home/xml-data/build-dir/SPRINGDATACMNS-DATACMNS143-JOB1/target/generated-sources/delombok/org/springframework/data/repository/core/RepositoryInformation.java:67: warning - @return tag has no arguments.
20-Jun-2019 03:25:15 [WARNING] /opt/bamboo-home/xml-data/build-dir/SPRINGDATACMNS-DATACMNS143-JOB1/target/generated-sources/delombok/org/springframework/data/repository/core/RepositoryInformation.java:74: warning - @return tag has no arguments.
20-Jun-2019 03:25:15 [WARNING] /opt/bamboo-home/xml-data/build-dir/SPRINGDATACMNS-DATACMNS143-JOB1/target/generated-sources/delombok/org/springframework/data/repository/core/RepositoryInformation.java:85: warning - @return tag has no arguments.
20-Jun-2019 03:25:15 [WARNING] /opt/bamboo-home/xml-data/build-dir/SPRINGDATACMNS-DATACMNS143-JOB1/target/generated-sources/delombok/org/springframework/data/repository/core/support/RepositoryComposition.java:181: warning - @return tag has no arguments.
20-Jun-2019 03:25:15 [WARNING] /opt/bamboo-home/xml-data/build-dir/SPRINGDATACMNS-DATACMNS143-JOB1/target/generated-sources/delombok/org/springframework/data/repository/core/support/RepositoryComposition.java:194: warning - @return tag has no arguments.
20-Jun-2019 03:25:15 [WARNING] /opt/bamboo-home/xml-data/build-dir/SPRINGDATACMNS-DATACMNS143-JOB1/target/generated-sources/delombok/org/springframework/data/repository/core/support/RepositoryComposition.java:60: warning - @soundtrack is an unknown tag.
20-Jun-2019 03:25:15 [WARNING] /opt/bamboo-home/xml-data/build-dir/SPRINGDATACMNS-DATACMNS143-JOB1/target/generated-sources/delombok/org/springframework/data/repository/core/support/RepositoryComposition.java:84: warning - Missing closing '}' character for inline tag: "{@link MethodLookups#direct())
20-Jun-2019 03:25:15 [WARNING] method lookup."
20-Jun-2019 03:25:15 [WARNING] /opt/bamboo-home/xml-data/build-dir/SPRINGDATACMNS-DATACMNS143-JOB1/target/generated-sources/delombok/org/springframework/data/repository/core/support/RepositoryComposition.java:106: warning - Missing closing '}' character for inline tag: "{@link MethodLookups#direct()) method lookup."
20-Jun-2019 03:25:15 [WARNING] /opt/bamboo-home/xml-data/build-dir/SPRINGDATACMNS-DATACMNS143-JOB1/target/generated-sources/delombok/org/springframework/data/repository/core/support/RepositoryComposition.java:117: warning - Missing closing '}' character for inline tag: "{@link MethodLookups#direct()) method lookup."
20-Jun-2019 03:25:15 [WARNING] /opt/bamboo-home/xml-data/build-dir/SPRINGDATACMNS-DATACMNS143-JOB1/target/generated-sources/delombok/org/springframework/data/repository/core/support/RepositoryComposition.java:95: warning - Missing closing '}' character for inline tag: "{@link MethodLookups#direct()) method lookup."
20-Jun-2019 03:25:15 [WARNING] /opt/bamboo-home/xml-data/build-dir/SPRINGDATACMNS-DATACMNS143-JOB1/target/generated-sources/delombok/org/springframework/data/repository/core/support/RepositoryComposition.java:330: warning - @return tag has no arguments.
20-Jun-2019 03:25:15 [WARNING] /opt/bamboo-home/xml-data/build-dir/SPRINGDATACMNS-DATACMNS143-JOB1/target/generated-sources/delombok/org/springframework/data/repository/core/support/RepositoryFactoryBeanSupport.java:302: warning - @return tag has no arguments.
20-Jun-2019 03:25:15 [WARNING] /opt/bamboo-home/xml-data/build-dir/SPRINGDATACMNS-DATACMNS143-JOB1/target/generated-sources/delombok/org/springframework/data/repository/core/support/RepositoryFactoryInformation.java:40: warning - @return tag has no arguments.
20-Jun-2019 03:25:15 [WARNING] /opt/bamboo-home/xml-data/build-dir/SPRINGDATACMNS-DATACMNS143-JOB1/target/generated-sources/delombok/org/springframework/data/repository/core/support/RepositoryFactoryInformation.java:47: warning - @return tag has no arguments.
20-Jun-2019 03:25:15 [WARNING] /opt/bamboo-home/xml-data/build-dir/SPRINGDATACMNS-DATACMNS143-JOB1/target/generated-sources/delombok/org/springframework/data/repository/core/support/RepositoryFactoryInformation.java:55: warning - @return tag has no arguments.
20-Jun-2019 03:25:15 [WARNING] /opt/bamboo-home/xml-data/build-dir/SPRINGDATACMNS-DATACMNS143-JOB1/target/generated-sources/delombok/org/springframework/data/repository/core/support/RepositoryFactoryInformation.java:62: warning - @return tag has no arguments.
20-Jun-2019 03:25:15 [WARNING] /opt/bamboo-home/xml-data/build-dir/SPRINGDATACMNS-DATACMNS143-JOB1/target/generated-sources/delombok/org/springframework/data/repository/core/support/RepositoryFactoryBeanSupport.java:105: warning - Tag @link: reference not found: QueryLookupStrategy.Key
20-Jun-2019 03:25:15 [WARNING] /opt/bamboo-home/xml-data/build-dir/SPRINGDATACMNS-DATACMNS143-JOB1/target/generated-sources/delombok/org/springframework/data/repository/core/support/RepositoryFactoryBeanSupport.java:105: warning - Tag @link: reference not found: QueryLookupStrategy.Key
20-Jun-2019 03:25:15 [WARNING] /opt/bamboo-home/xml-data/build-dir/SPRINGDATACMNS-DATACMNS143-JOB1/target/generated-sources/delombok/org/springframework/data/repository/core/support/RepositoryFactorySupport.java:76: warning - Tag @link: reference not found: QueryLookupStrategy.Key
20-Jun-2019 03:25:15 [WARNING] /opt/bamboo-home/xml-data/build-dir/SPRINGDATACMNS-DATACMNS143-JOB1/target/generated-sources/delombok/org/springframework/data/repository/core/support/RepositoryFactorySupport.java:249: warning - Tag @link: can't find getRepository(Class, RepositoryFragments) in org.springframework.data.repository.core.support.RepositoryFactorySupport
20-Jun-2019 03:25:15 [WARNING] /opt/bamboo-home/xml-data/build-dir/SPRINGDATACMNS-DATACMNS143-JOB1/target/generated-sources/delombok/org/springframework/data/repository/core/support/RepositoryFragment.java:54: warning - @return tag has no arguments.
20-Jun-2019 03:25:15 [WARNING] /opt/bamboo-home/xml-data/build-dir/SPRINGDATACMNS-DATACMNS143-JOB1/target/generated-sources/delombok/org/springframework/data/repository/core/support/RepositoryFragment.java:65: warning - @return tag has no arguments.
20-Jun-2019 03:25:15 [WARNING] /opt/bamboo-home/xml-data/build-dir/SPRINGDATACMNS-DATACMNS143-JOB1/target/generated-sources/delombok/org/springframework/data/repository/core/support/RepositoryFragment.java:75: warning - @return tag has no arguments.
20-Jun-2019 03:25:15 [WARNING] /opt/bamboo-home/xml-data/build-dir/SPRINGDATACMNS-DATACMNS143-JOB1/target/generated-sources/delombok/org/springframework/data/repository/core/support/SurroundingTransactionDetectorMethodInterceptor.java:46: warning - @return tag has no arguments.
20-Jun-2019 03:25:15 [WARNING] /opt/bamboo-home/xml-data/build-dir/SPRINGDATACMNS-DATACMNS143-JOB1/target/generated-sources/delombok/org/springframework/data/repository/core/support/SurroundingTransactionDetectorMethodInterceptor.java:35: warning - @soundtrack is an unknown tag.
20-Jun-2019 03:25:15 [WARNING] /opt/bamboo-home/xml-data/build-dir/SPRINGDATACMNS-DATACMNS143-JOB1/target/generated-sources/delombok/org/springframework/data/repository/core/support/TransactionalRepositoryFactoryBeanSupport.java:102: warning - @return tag has no arguments.
20-Jun-2019 03:25:15 [INFO] Building jar: /opt/bamboo-home/xml-data/build-dir/SPRINGDATACMNS-DATACMNS143-JOB1/target/spring-data-commons-2.0.15.BUILD-SNAPSHOT-javadoc.jar
20-Jun-2019 03:25:16 [INFO]
20-Jun-2019 03:25:16 [INFO] --- maven-install-plugin:2.4:install (default-install) @ spring-data-commons ---
20-Jun-2019 03:25:16 [INFO] Installing /opt/bamboo-home/xml-data/build-dir/SPRINGDATACMNS-DATACMNS143-JOB1/target/spring-data-commons-2.0.15.BUILD-SNAPSHOT.jar to /home/bamboo/.m2/repository/org/springframework/data/spring-data-commons/2.0.15.BUILD-SNAPSHOT/spring-data-commons-2.0.15.BUILD-SNAPSHOT.jar
20-Jun-2019 03:25:16 [INFO] Installing /opt/bamboo-home/xml-data/build-dir/SPRINGDATACMNS-DATACMNS143-JOB1/pom.xml to /home/bamboo/.m2/repository/org/springframework/data/spring-data-commons/2.0.15.BUILD-SNAPSHOT/spring-data-commons-2.0.15.BUILD-SNAPSHOT.pom
20-Jun-2019 03:25:16 [INFO] Installing /opt/bamboo-home/xml-data/build-dir/SPRINGDATACMNS-DATACMNS143-JOB1/target/spring-data-commons-2.0.15.BUILD-SNAPSHOT-sources.jar to /home/bamboo/.m2/repository/org/springframework/data/spring-data-commons/2.0.15.BUILD-SNAPSHOT/spring-data-commons-2.0.15.BUILD-SNAPSHOT-sources.jar
20-Jun-2019 03:25:16 [INFO] Installing /opt/bamboo-home/xml-data/build-dir/SPRINGDATACMNS-DATACMNS143-JOB1/target/spring-data-commons-2.0.15.BUILD-SNAPSHOT-javadoc.jar to /home/bamboo/.m2/repository/org/springframework/data/spring-data-commons/2.0.15.BUILD-SNAPSHOT/spring-data-commons-2.0.15.BUILD-SNAPSHOT-javadoc.jar
20-Jun-2019 03:25:16 [INFO] Artifactory Build Info Recorder: Saving Build Info to '/opt/bamboo-home/xml-data/build-dir/SPRINGDATACMNS-DATACMNS143-JOB1/target/build-info.json'
20-Jun-2019 03:25:16 [INFO] Deploying artifact: https://repo.spring.io/libs-snapshot-local/org/springframework/data/spring-data-commons/2.0.15.BUILD-SNAPSHOT/spring-data-commons-2.0.15.BUILD-SNAPSHOT-sources.jar
20-Jun-2019 03:25:18 [INFO] Deploying artifact: https://repo.spring.io/libs-snapshot-local/org/springframework/data/spring-data-commons/2.0.15.BUILD-SNAPSHOT/spring-data-commons-2.0.15.BUILD-SNAPSHOT.jar
20-Jun-2019 03:25:19 [INFO] Deploying artifact: https://repo.spring.io/libs-snapshot-local/org/springframework/data/spring-data-commons/2.0.15.BUILD-SNAPSHOT/spring-data-commons-2.0.15.BUILD-SNAPSHOT-javadoc.jar
20-Jun-2019 03:25:20 [INFO] Deploying artifact: https://repo.spring.io/libs-snapshot-local/org/springframework/data/spring-data-commons/2.0.15.BUILD-SNAPSHOT/spring-data-commons-2.0.15.BUILD-SNAPSHOT.pom
20-Jun-2019 03:25:20 [INFO] Artifactory Build Info Recorder: Deploying build info ...
20-Jun-2019 03:25:20 [INFO] Deploying build descriptor to: https://repo.spring.io/api/build
20-Jun-2019 03:25:20 [INFO] Build successfully deployed. Browse it in Artifactory under https://repo.spring.io/webapp/builds/Spring%20Data%20Commons%20-%20Spring%20Data%20Commons%20-%202.0.x%20-%20Default%20Job/774
20-Jun-2019 03:25:20 [INFO] ------------------------------------------------------------------------
20-Jun-2019 03:25:20 [INFO] BUILD SUCCESS
20-Jun-2019 03:25:20 [INFO] ------------------------------------------------------------------------
20-Jun-2019 03:25:20 [INFO] Total time: 59.459 s
20-Jun-2019 03:25:20 [INFO] Finished at: 2019-06-20T03:25:20Z
20-Jun-2019 03:25:20 [INFO] ------------------------------------------------------------------------
20-Jun-2019 03:25:20 Parsing test results under /opt/bamboo-home/xml-data/build-dir/SPRINGDATACMNS-DATACMNS143-JOB1...
20-Jun-2019 03:25:21 Finished task 'Build, test and install' with result: Success
20-Jun-2019 03:25:21 Running post build plugin 'Docker Container Cleanup'
20-Jun-2019 03:25:21 Running post build plugin 'NCover Results Collector'
20-Jun-2019 03:25:21 Running post build plugin 'Artifactory Release Management Staging'
20-Jun-2019 03:25:21 Running post build plugin 'Artifactory Build Info Copier'
20-Jun-2019 03:25:21 Copying the buildinfo artifacts for build: SPRINGDATACMNS-DATACMNS143-JOB1-774
20-Jun-2019 03:25:21 Running post build plugin 'Artifactory Gradle Properties Info Copier'
20-Jun-2019 03:25:21 Running post build plugin 'Clover Results Collector'
20-Jun-2019 03:25:21 Running post build plugin 'npm Cache Cleanup'
20-Jun-2019 03:25:21 Running post build plugin 'Artifact Copier'
20-Jun-2019 03:25:21 Successfully removed working directory at '/opt/bamboo-home/xml-data/build-dir/SPRINGDATACMNS-DATACMNS143-JOB1'
20-Jun-2019 03:25:21 Finalising the build...
20-Jun-2019 03:25:21 Stopping timer.
20-Jun-2019 03:25:21 Build SPRINGDATACMNS-DATACMNS143-JOB1-774 completed.
20-Jun-2019 03:25:21 Running on server: post build plugin 'NCover Results Collector'
20-Jun-2019 03:25:21 Running on server: post build plugin 'Build Hanging Detection Configuration'
20-Jun-2019 03:25:21 Running on server: post build plugin 'Clover Delta Calculator'
20-Jun-2019 03:25:21 Running on server: post build plugin 'Maven Dependencies Postprocessor'
20-Jun-2019 03:25:21 All post build plugins have finished
20-Jun-2019 03:25:21 Generating build results summary...
20-Jun-2019 03:25:22 Saving build results to disk...
20-Jun-2019 03:25:22 Logging substituted variables...
20-Jun-2019 03:25:22 Indexing build results...
20-Jun-2019 03:25:22 Finished building SPRINGDATACMNS-DATACMNS143-JOB1-774.