Nightly snapshot build and docs publishing

Build: #1629 failed Scheduled

Logs

The following logs have been generated by the jobs in this plan.
  • Expand all
  • Collapse all
Job Logs
Collapse Default Job Default Stage Download or View
13-Jan-2019 15:23:37 :spring-yarn:spring-yarn-core:install
13-Jan-2019 15:23:37 :spring-yarn:spring-yarn-core:artifactoryPublish
13-Jan-2019 15:23:38 :spring-yarn:spring-yarn-integration:install
13-Jan-2019 15:23:38 :spring-yarn:spring-yarn-integration:artifactoryPublish
13-Jan-2019 15:23:38 :spring-yarn:spring-yarn-test:install
13-Jan-2019 15:23:38 :spring-yarn:spring-yarn-test:artifactoryPublish
13-Jan-2019 15:23:38 :spring-yarn:artifactoryPublish
13-Jan-2019 15:23:38 :artifactoryPublish
13-Jan-2019 15:23:38 :artifactoryDeploy
13-Jan-2019 15:23:38 Deploying artifact: https://repo.spring.io/libs-snapshot-local/org/springframework/data/spring-data-hadoop/2.5.1.BUILD-SNAPSHOT/spring-data-hadoop-2.5.1.BUILD-SNAPSHOT-javadoc.jar
13-Jan-2019 15:23:38 Error occurred for request PUT /libs-snapshot-local/org/springframework/data/spring-data-hadoop/2.5.1.BUILD-SNAPSHOT/spring-data-hadoop-2.5.1.BUILD-SNAPSHOT-javadoc.jar;build.name=Spring+Data+Hadoop+-+Nightly+Build+-+Default+Job;build.timestamp=1547392500867;build.number=1629;vcs.revision=69367cfd2aa2589ae16ffe6f08462c9b2d88ccdd HTTP/1.1: Received fatal alert: protocol_version.
13-Jan-2019 15:23:38 :artifactoryDeploy FAILED
13-Jan-2019 15:23:38
13-Jan-2019 15:23:38 FAILURE: Build failed with an exception.
13-Jan-2019 15:23:38
13-Jan-2019 15:23:38 * What went wrong:
13-Jan-2019 15:23:38 Execution failed for task ':artifactoryDeploy'.
13-Jan-2019 15:23:38 > javax.net.ssl.SSLException: Received fatal alert: protocol_version
13-Jan-2019 15:23:38
13-Jan-2019 15:23:38 * Try:
13-Jan-2019 15:23:38 Run with --stacktrace option to get the stack trace. Run with --info or --debug option to get more log output.
13-Jan-2019 15:23:38
13-Jan-2019 15:23:38 BUILD FAILED
13-Jan-2019 15:23:38
13-Jan-2019 15:23:38 Total time: 8 mins 31.952 secs