Nightly snapshot build and docs publishing

Build: #1630 failed Scheduled

Logs

The following logs have been generated by the jobs in this plan.
  • Expand all
  • Collapse all
Job Logs
Collapse Default Job Default Stage Download or View
14-Jan-2019 15:19:35 :spring-yarn:spring-yarn-core:install
14-Jan-2019 15:19:35 :spring-yarn:spring-yarn-core:artifactoryPublish
14-Jan-2019 15:19:35 :spring-yarn:spring-yarn-integration:install
14-Jan-2019 15:19:35 :spring-yarn:spring-yarn-integration:artifactoryPublish
14-Jan-2019 15:19:35 :spring-yarn:spring-yarn-test:install
14-Jan-2019 15:19:35 :spring-yarn:spring-yarn-test:artifactoryPublish
14-Jan-2019 15:19:35 :spring-yarn:artifactoryPublish
14-Jan-2019 15:19:35 :artifactoryPublish
14-Jan-2019 15:19:35 :artifactoryDeploy
14-Jan-2019 15:19:35 Deploying artifact: https://repo.spring.io/libs-snapshot-local/org/springframework/data/spring-data-hadoop/2.5.1.BUILD-SNAPSHOT/spring-data-hadoop-2.5.1.BUILD-SNAPSHOT-javadoc.jar
14-Jan-2019 15:19:36 Error occurred for request PUT /libs-snapshot-local/org/springframework/data/spring-data-hadoop/2.5.1.BUILD-SNAPSHOT/spring-data-hadoop-2.5.1.BUILD-SNAPSHOT-javadoc.jar;build.name=Spring+Data+Hadoop+-+Nightly+Build+-+Default+Job;build.timestamp=1547478900855;build.number=1630;vcs.revision=69367cfd2aa2589ae16ffe6f08462c9b2d88ccdd HTTP/1.1: Received fatal alert: protocol_version.
14-Jan-2019 15:19:36 :artifactoryDeploy FAILED
14-Jan-2019 15:19:36
14-Jan-2019 15:19:36 FAILURE: Build failed with an exception.
14-Jan-2019 15:19:36
14-Jan-2019 15:19:36 * What went wrong:
14-Jan-2019 15:19:36 Execution failed for task ':artifactoryDeploy'.
14-Jan-2019 15:19:36 > javax.net.ssl.SSLException: Received fatal alert: protocol_version
14-Jan-2019 15:19:36
14-Jan-2019 15:19:36 * Try:
14-Jan-2019 15:19:36 Run with --stacktrace option to get the stack trace. Run with --info or --debug option to get more log output.
14-Jan-2019 15:19:36
14-Jan-2019 15:19:36 BUILD FAILED
14-Jan-2019 15:19:36
14-Jan-2019 15:19:36 Total time: 4 mins 29.495 secs