Nightly snapshot build and docs publishing

Build: #1680 failed Scheduled

Logs

The following logs have been generated by the jobs in this plan.
  • Expand all
  • Collapse all
Job Logs
Collapse Default Job Default Stage Download or View
06-Mar-2019 15:25:56 :spring-yarn:spring-yarn-core:install
06-Mar-2019 15:25:56 :spring-yarn:spring-yarn-core:artifactoryPublish
06-Mar-2019 15:25:56 :spring-yarn:spring-yarn-integration:install
06-Mar-2019 15:25:56 :spring-yarn:spring-yarn-integration:artifactoryPublish
06-Mar-2019 15:25:56 :spring-yarn:spring-yarn-test:install
06-Mar-2019 15:25:56 :spring-yarn:spring-yarn-test:artifactoryPublish
06-Mar-2019 15:25:56 :spring-yarn:artifactoryPublish
06-Mar-2019 15:25:56 :artifactoryPublish
06-Mar-2019 15:25:56 :artifactoryDeploy
06-Mar-2019 15:25:56 Deploying artifact: https://repo.spring.io/libs-snapshot-local/org/springframework/data/spring-data-hadoop/2.5.1.BUILD-SNAPSHOT/spring-data-hadoop-2.5.1.BUILD-SNAPSHOT-javadoc.jar
06-Mar-2019 15:25:56 Error occurred for request PUT /libs-snapshot-local/org/springframework/data/spring-data-hadoop/2.5.1.BUILD-SNAPSHOT/spring-data-hadoop-2.5.1.BUILD-SNAPSHOT-javadoc.jar;build.name=Spring+Data+Hadoop+-+Nightly+Build+-+Default+Job;build.timestamp=1551885301017;build.number=1680;vcs.revision=69367cfd2aa2589ae16ffe6f08462c9b2d88ccdd HTTP/1.1: Received fatal alert: protocol_version.
06-Mar-2019 15:25:56 :artifactoryDeploy FAILED
06-Mar-2019 15:25:56
06-Mar-2019 15:25:56 FAILURE: Build failed with an exception.
06-Mar-2019 15:25:56
06-Mar-2019 15:25:56 * What went wrong:
06-Mar-2019 15:25:56 Execution failed for task ':artifactoryDeploy'.
06-Mar-2019 15:25:56 > javax.net.ssl.SSLException: Received fatal alert: protocol_version
06-Mar-2019 15:25:56
06-Mar-2019 15:25:56 * Try:
06-Mar-2019 15:25:56 Run with --stacktrace option to get the stack trace. Run with --info or --debug option to get more log output.
06-Mar-2019 15:25:56
06-Mar-2019 15:25:56 BUILD FAILED
06-Mar-2019 15:25:56
06-Mar-2019 15:25:56 Total time: 10 mins 50.415 secs