Build #3

Logs

The following logs have been generated by the jobs in this branch.
  • Expand all
  • Collapse all
Job Logs
Collapse Default Job Default Stage Download or View
22-Mar-2019 07:31:41 [INFO] Downloading: https://repo.spring.io/libs-snapshot/org/springframework/spring-instrument/5.0.0.RELEASE/spring-instrument-5.0.0.RELEASE.jar
22-Mar-2019 07:31:41 [INFO] Downloading: https://repo.spring.io/libs-snapshot/org/springframework/spring-aspects/5.0.0.RELEASE/spring-aspects-5.0.0.RELEASE.jar
22-Mar-2019 07:31:41 [INFO] Downloading: https://repo.spring.io/libs-snapshot/org/hibernate/hibernate-core/5.2.9.Final/hibernate-core-5.2.9.Final.jar
22-Mar-2019 07:31:41 [INFO] Downloading: https://repo.spring.io/libs-snapshot/org/apache/xbean/xbean-asm5-shaded/3.17/xbean-asm5-shaded-3.17.jar
22-Mar-2019 07:31:41 [INFO] Downloading: https://repo.spring.io/libs-snapshot/org/apache/openwebbeans/test/cditest-owb/2.0.1/cditest-owb-2.0.1.jar
22-Mar-2019 07:31:42 [INFO] Downloaded: https://repo.spring.io/libs-snapshot/org/apache/xbean/xbean-asm5-shaded/3.17/xbean-asm5-shaded-3.17.jar (0 B at 0 B/s)
22-Mar-2019 07:31:42 [INFO] Downloaded: https://repo.spring.io/libs-snapshot/org/springframework/spring-instrument/5.0.0.RELEASE/spring-instrument-5.0.0.RELEASE.jar (1.4 kB at 5.0 kB/s)
22-Mar-2019 07:31:42 [INFO] Downloaded: https://repo.spring.io/libs-snapshot/org/springframework/spring-aspects/5.0.0.RELEASE/spring-aspects-5.0.0.RELEASE.jar (41 kB at 144 kB/s)
22-Mar-2019 07:31:42 [INFO] Downloaded: https://repo.spring.io/libs-snapshot/org/hibernate/hibernate-core/5.2.9.Final/hibernate-core-5.2.9.Final.jar (6.6 MB at 7.6 MB/s)
22-Mar-2019 07:31:42 [INFO] Downloading: https://repo.maven.apache.org/maven2/org/apache/openwebbeans/test/cditest-owb/2.0.1/cditest-owb-2.0.1.jar
22-Mar-2019 07:31:42 [INFO] ------------------------------------------------------------------------
22-Mar-2019 07:31:42 [INFO] BUILD FAILURE
22-Mar-2019 07:31:42 [INFO] ------------------------------------------------------------------------
22-Mar-2019 07:31:42 [INFO] Total time: 3.411 s
22-Mar-2019 07:31:42 [INFO] Finished at: 2019-03-22T07:31:42Z
22-Mar-2019 07:31:42 [INFO] Final Memory: 18M/290M
22-Mar-2019 07:31:42 [INFO] ------------------------------------------------------------------------
22-Mar-2019 07:31:42 [ERROR] Failed to execute goal on project spring-data-jpa: Could not resolve dependencies for project org.springframework.data:spring-data-jpa:jar:2.0.0.DATAJPA-1087-SNAPSHOT: Could not find artifact org.apache.openwebbeans.test:cditest-owb:jar:2.0.1 in spring-libs-snapshot (https://repo.spring.io/libs-snapshot) -> [Help 1]
22-Mar-2019 07:31:42 [ERROR]
22-Mar-2019 07:31:42 [ERROR] To see the full stack trace of the errors, re-run Maven with the -e switch.
22-Mar-2019 07:31:42 [ERROR] Re-run Maven using the -X switch to enable full debug logging.
22-Mar-2019 07:31:42 [ERROR]
22-Mar-2019 07:31:42 [ERROR] For more information about the errors and possible solutions, please read the following articles:
22-Mar-2019 07:31:42 [ERROR] [Help 1] http://cwiki.apache.org/confluence/display/MAVEN/DependencyResolutionException
22-Mar-2019 07:31:43 Failed to execute plugin 'Maven Dependencies Postprocessor' with error: com.thoughtworks.xstream.mapper.CannotResolveClassException: com.atlassian.bamboo.plugins.maven2.Maven2ProjectProperties