Build #4

Build result summary

Details

Completed
Duration
1 minute
Labels
None
Agent
bamboo-12.af.pivotal.io
Revision
3bd6ffc0b0854ad4708816f7f055d636ae2d6d1d 3bd6ffc0b0854ad4708816f7f055d636ae2d6d1d

No failed tests found, a possible compilation error occurred.

Responsible

No one has taken responsibility for this failure

Code commits

Author Commit Message Commit date
Spring Operator <sagan-ops@gopivotal.com> Spring Operator <sagan-ops@gopivotal.com> 3bd6ffc0b0854ad4708816f7f055d636ae2d6d1d 3bd6ffc0b0854ad4708816f7f055d636ae2d6d1d DATAJPA-1512 - URL Cleanup.
This commit updates URLs to prefer the https protocol. Redirects are not followed to avoid accidentally expanding intentionally shortened URLs (i.e. if using a URL shortener).

# Fixed URLs

## Fixed Success
These URLs were switched to an https URL with a 2xx status. While the status was successful, your review is still recommended.

* http://maven.apache.org/xsd/maven-4.0.0.xsd with 1 occurrences migrated to:
  https://maven.apache.org/xsd/maven-4.0.0.xsd ([https](https://maven.apache.org/xsd/maven-4.0.0.xsd) result 200).
* http://projects.spring.io/spring-data-jpa with 1 occurrences migrated to:
  https://projects.spring.io/spring-data-jpa ([https](https://projects.spring.io/spring-data-jpa) result 301).

# Ignored
These URLs were intentionally ignored.

* http://maven.apache.org/POM/4.0.0 with 2 occurrences
* http://www.w3.org/2001/XMLSchema-instance with 1 occurrences

Original pull request: #327

JIRA issues

IssueDescriptionStatus
Unknown Issue TypeDATAJPA-1512Could not obtain issue details from JIRA

Error summary for Default Job

The job generated some errors, drill down into the full build log for more details.

Could not find test result reports in the /opt/bamboo-home/xml-data/build-dir/SPRINGDATAJPA-DATAJPA89-JOB1 directory.
/opt/bamboo-home/xml-data/build-dir/SPRINGDATAJPA-DATAJPA89-JOB1/src/main/java/org/springframework/data/jpa/repository/query/JpaQueryLookupStrategy.java:223: error: cannot find symbol
                        EvaluationContextProvider evaluationContextProvider) {
                        ^
  symbol:   class EvaluationContextProvider
  location: class JpaQueryLookupStrategy
/opt/bamboo-home/xml-data/build-dir/SPRINGDATAJPA-DATAJPA89-JOB1/src/main/java/org/springframework/data/jpa/repository/query/JpaQueryLookupStrategy.java:116: error: cannot find symbol
                private final EvaluationContextProvider evaluationContextProvider;
                              ^
  symbol:   class EvaluationContextProvider
  location: class DeclaredQueryLookupStrategy
/opt/bamboo-home/xml-data/build-dir/SPRINGDATAJPA-DATAJPA89-JOB1/src/main/java/org/springframework/data/jpa/repository/query/JpaQueryLookupStrategy.java:126: error: cannot find symbol
                                EvaluationContextProvider evaluationContextProvider) {
                                ^
  symbol:   class EvaluationContextProvider
  location: class DeclaredQueryLookupStrategy
/opt/bamboo-home/xml-data/build-dir/SPRINGDATAJPA-DATAJPA89-JOB1/src/main/java/org/springframework/data/jpa/repository/query/QueryParameterSetterFactory.java:28: error: cannot find symbol
import org.springframework.data.repository.query.EvaluationContextProvider;
                                                ^
  symbol:   class EvaluationContextProvider
  location: package org.springframework.data.repository.query
/opt/bamboo-home/xml-data/build-dir/SPRINGDATAJPA-DATAJPA89-JOB1/src/main/java/org/springframework/data/jpa/repository/query/QueryParameterSetterFactory.java:91: error: cannot find symbol
                        EvaluationContextProvider evaluationContextProvider, Parameters<?, ?> parameters) {
                        ^
  symbol:   class EvaluationContextProvider
  location: class QueryParameterSetterFactory
/opt/bamboo-home/xml-data/build-dir/SPRINGDATAJPA-DATAJPA89-JOB1/src/main/java/org/springframework/data/jpa/repository/query/QueryParameterSetterFactory.java:129: error: cannot find symbol
                private final EvaluationContextProvider evaluationContextProvider;
                              ^
  symbol:   class EvaluationContextProvider
  location: class ExpressionBasedQueryParameterSetterFactory
/opt/bamboo-home/xml-data/build-dir/SPRINGDATAJPA-DATAJPA89-JOB1/src/main/java/org/springframework/data/jpa/repository/query/QueryParameterSetterFactory.java:138: error: cannot find symbol
                                EvaluationContextProvider evaluationContextProvider, Parameters<?, ?> parameters) {
                                ^
  symbol:   class EvaluationContextProvider
  location: class ExpressionBasedQueryParameterSetterFactory
/opt/bamboo-home/xml-data/build-dir/SPRINGDATAJPA-DATAJPA89-JOB1/src/main/java/org/springframework/data/jpa/repository/query/NativeJpaQuery.java:23: error: cannot find symbol
import org.springframework.data.repository.query.EvaluationContextProvider;
                                                ^
  symbol:   class EvaluationContextProvider
  location: package org.springframework.data.repository.query
/opt/bamboo-home/xml-data/build-dir/SPRINGDATAJPA-DATAJPA89-JOB1/src/main/java/org/springframework/data/jpa/repository/query/AbstractStringBasedJpaQuery.java:22: error: cannot find symbol
import org.springframework.data.repository.query.EvaluationContextProvider;
                                                ^
  symbol:   class EvaluationContextProvider
  location: package org.springframework.data.repository.query
/opt/bamboo-home/xml-data/build-dir/SPRINGDATAJPA-DATAJPA89-JOB1/src/main/java/org/springframework/data/jpa/repository/query/NativeJpaQuery.java:51: error: cannot find symbol
                        EvaluationContextProvider evaluationContextProvider, SpelExpressionParser parser) {
                        ^
  symbol:   class EvaluationContextProvider
  location: class NativeJpaQuery
/opt/bamboo-home/xml-data/build-dir/SPRINGDATAJPA-DATAJPA89-JOB1/src/main/java/org/springframework/data/jpa/repository/query/AbstractStringBasedJpaQuery.java:41: error: cannot find symbol
        private final EvaluationContextProvider evaluationContextProvider;
                      ^
  symbol:   class EvaluationContextProvider
  location: class AbstractStringBasedJpaQuery
/opt/bamboo-home/xml-data/build-dir/SPRINGDATAJPA-DATAJPA89-JOB1/src/main/java/org/springframework/data/jpa/repository/query/AbstractStringBasedJpaQuery.java:55: error: cannot find symbol
                        EvaluationContextProvider evaluationContextProvider, SpelExpressionParser parser) {
                        ^
  symbol:   class EvaluationContextProvider
  location: class AbstractStringBasedJpaQuery
/opt/bamboo-home/xml-data/build-dir/SPRINGDATAJPA-DATAJPA89-JOB1/src/main/java/org/springframework/data/jpa/repository/query/SimpleJpaQuery.java:21: error: cannot find symbol
import org.springframework.data.repository.query.EvaluationContextProvider;
                                                ^
  symbol:   class EvaluationContextProvider
  location: package org.springframework.data.repository.query
/opt/bamboo-home/xml-data/build-dir/SPRINGDATAJPA-DATAJPA89-JOB1/src/main/java/org/springframework/data/jpa/repository/query/SimpleJpaQuery.java:44: error: cannot find symbol
        public SimpleJpaQuery(JpaQueryMethod method, EntityManager em, EvaluationContextProvider evaluationContextProvider,
                                                                       ^
  symbol:   class EvaluationContextProvider
  location: class SimpleJpaQuery
/opt/bamboo-home/xml-data/build-dir/SPRINGDATAJPA-DATAJPA89-JOB1/src/main/java/org/springframework/data/jpa/repository/query/SimpleJpaQuery.java:59: error: cannot find symbol
                        EvaluationContextProvider evaluationContextProvider, SpelExpressionParser parser) {
                        ^
  symbol:   class EvaluationContextProvider
  location: class SimpleJpaQuery
/opt/bamboo-home/xml-data/build-dir/SPRINGDATAJPA-DATAJPA89-JOB1/src/main/java/org/springframework/data/jpa/repository/query/JpaQueryFactory.java:23: error: cannot find symbol
import org.springframework.data.repository.query.EvaluationContextProvider;
                                                ^
  symbol:   class EvaluationContextProvider
  location: package org.springframework.data.repository.query
/opt/bamboo-home/xml-data/build-dir/SPRINGDATAJPA-DATAJPA89-JOB1/src/main/java/org/springframework/data/jpa/repository/query/JpaQueryFactory.java:53: error: cannot find symbol
                        EvaluationContextProvider evaluationContextProvider) {
                        ^
  symbol:   class EvaluationContextProvider
  location: class JpaQueryFactory
/opt/bamboo-home/xml-data/build-dir/SPRINGDATAJPA-DATAJPA89-JOB1/src/main/java/org/springframework/data/jpa/repository/query/JpaQueryFactory.java:70: error: cannot find symbol
                        EvaluationContextProvider evaluationContextProvider) {
                        ^
  symbol:   class EvaluationContextProvider
  location: class JpaQueryFactory
/opt/bamboo-home/xml-data/build-dir/SPRINGDATAJPA-DATAJPA89-JOB1/src/main/java/org/springframework/data/jpa/repository/query/ParameterBinderFactory.java:26: error: cannot find symbol
import org.springframework.data.repository.query.EvaluationContextProvider;
                                                ^
  symbol:   class EvaluationContextProvider
  location: package org.springframework.data.repository.query
/opt/bamboo-home/xml-data/build-dir/SPRINGDATAJPA-DATAJPA89-JOB1/src/main/java/org/springframework/data/jpa/repository/query/ParameterBinderFactory.java:91: error: cannot find symbol
                        SpelExpressionParser parser, EvaluationContextProvider evaluationContextProvider) {
                                                     ^
  symbol:   class EvaluationContextProvider
  location: class ParameterBinderFactory