Build #3

Logs

The following logs have been generated by the jobs in this branch.
  • Expand all
  • Collapse all
Job Logs
Collapse Default Job Default Stage Download or View
22-Mar-2019 07:34:43   reason: cannot infer type-variable(s) T
22-Mar-2019 07:34:43     (actual and formal argument lists differ in length)
22-Mar-2019 07:34:43 [INFO] 1 error
22-Mar-2019 07:34:43 [INFO] -------------------------------------------------------------
22-Mar-2019 07:34:43 [INFO] ------------------------------------------------------------------------
22-Mar-2019 07:34:43 [INFO] BUILD FAILURE
22-Mar-2019 07:34:43 [INFO] ------------------------------------------------------------------------
22-Mar-2019 07:34:43 [INFO] Total time: 11.762 s
22-Mar-2019 07:34:43 [INFO] Finished at: 2019-03-22T07:34:43Z
22-Mar-2019 07:34:43 [INFO] Final Memory: 56M/735M
22-Mar-2019 07:34:43 [INFO] ------------------------------------------------------------------------
22-Mar-2019 07:34:43 [ERROR] Failed to execute goal org.apache.maven.plugins:maven-compiler-plugin:3.6.1:compile (java-compile) on project spring-data-jpa: Compilation failure
22-Mar-2019 07:34:43 [ERROR] /opt/bamboo-home/xml-data/build-dir/SPRINGDATAJPA-DATAJPA93-JOB1/src/main/java/org/springframework/data/jpa/repository/query/QueryParameterSetterFactory.java:[176,78] method getEvaluationContext in interface org.springframework.data.repository.query.QueryMethodEvaluationContextProvider cannot be applied to given types;
22-Mar-2019 07:34:43 [ERROR]   required: org.springframework.data.repository.query.QueryMethodEvaluationContextProvider.ParameterContext<T>
22-Mar-2019 07:34:43 [ERROR]   found: org.springframework.data.repository.query.Parameters<capture#1 of ?,capture#2 of ?>,java.lang.Object[]
22-Mar-2019 07:34:43 [ERROR]   reason: cannot infer type-variable(s) T
22-Mar-2019 07:34:43 [ERROR]     (actual and formal argument lists differ in length)
22-Mar-2019 07:34:43 [ERROR] -> [Help 1]
22-Mar-2019 07:34:43 [ERROR]
22-Mar-2019 07:34:43 [ERROR] To see the full stack trace of the errors, re-run Maven with the -e switch.
22-Mar-2019 07:34:43 [ERROR] Re-run Maven using the -X switch to enable full debug logging.
22-Mar-2019 07:34:43 [ERROR]
22-Mar-2019 07:34:43 [ERROR] For more information about the errors and possible solutions, please read the following articles:
22-Mar-2019 07:34:43 [ERROR] [Help 1] http://cwiki.apache.org/confluence/display/MAVEN/MojoFailureException
22-Mar-2019 07:34:43 Failed to execute plugin 'Maven Dependencies Postprocessor' with error: com.thoughtworks.xstream.mapper.CannotResolveClassException: com.atlassian.bamboo.plugins.maven2.Maven2ProjectProperties