Build #3

Build: #3 failed

Job: Default Job failed

Stages & jobs

  1. Default Stage

Build log

The build generated 256 lines of output. Download or view full build log

22-Mar-2019 07:34:27 Build Spring Data JPA - Spring Data JPA - issue-DATAJPA-1265 - Default Job #3 (SPRINGDATAJPA-DATAJPA93-JOB1-3) started building on agent bamboo-01.af.pivotal.io
22-Mar-2019 07:34:27 Remote agent on host bamboo-01.af.pivotal.io
22-Mar-2019 07:34:27 Build working directory is /opt/bamboo-home/xml-data/build-dir/SPRINGDATAJPA-DATAJPA93-JOB1
22-Mar-2019 07:34:27 Executing build Spring Data JPA - Spring Data JPA - issue-DATAJPA-1265 - Default Job #3 (SPRINGDATAJPA-DATAJPA93-JOB1-3)
22-Mar-2019 07:34:27 Starting task 'Checkout Default Repository' of type 'com.atlassian.bamboo.plugins.vcs:task.vcs.checkout'
22-Mar-2019 07:34:27 Build always requires a clean checkout
22-Mar-2019 07:34:27 Cleaning build directory '/opt/bamboo-home/xml-data/build-dir/SPRINGDATAJPA-DATAJPA93-JOB1'
22-Mar-2019 07:34:27 Checking out into /opt/bamboo-home/xml-data/build-dir/SPRINGDATAJPA-DATAJPA93-JOB1
22-Mar-2019 07:34:27 Updating source code to revision: 9ac4106d7c37f8e2b2f80bbe1f9ba267b7da6d46
22-Mar-2019 07:34:27 Creating local git repository in '/opt/bamboo-home/xml-data/build-dir/SPRINGDATAJPA-DATAJPA93-JOB1/.git'.
22-Mar-2019 07:34:27 Initialized empty Git repository in /opt/bamboo-home/xml-data/build-dir/SPRINGDATAJPA-DATAJPA93-JOB1/.git/
22-Mar-2019 07:34:28 Fetching 'refs/heads/issue/DATAJPA-1265' from 'https://github.com/spring-projects/spring-data-jpa.git'.
22-Mar-2019 07:34:30 From https://github.com/spring-projects/spring-data-jpa
22-Mar-2019 07:34:30 * [new branch]      issue/DATAJPA-1265 -> issue/DATAJPA-1265
22-Mar-2019 07:34:30 * [new tag]         1.0.0.M1   -> 1.0.0.M1
22-Mar-2019 07:34:30 * [new tag]         1.0.0.M2   -> 1.0.0.M2
22-Mar-2019 07:34:30 * [new tag]         1.0.0.RC1  -> 1.0.0.RC1
22-Mar-2019 07:34:30 * [new tag]         1.0.0.RELEASE -> 1.0.0.RELEASE
22-Mar-2019 07:34:30 * [new tag]         1.1.0.M1   -> 1.1.0.M1
22-Mar-2019 07:34:30 * [new tag]         1.1.0.RC1  -> 1.1.0.RC1
22-Mar-2019 07:34:30 * [new tag]         1.1.0.RELEASE -> 1.1.0.RELEASE
22-Mar-2019 07:34:30 * [new tag]         1.10.0.M1  -> 1.10.0.M1
22-Mar-2019 07:34:30 * [new tag]         1.10.0.RC1 -> 1.10.0.RC1
22-Mar-2019 07:34:30 * [new tag]         1.10.0.RELEASE -> 1.10.0.RELEASE
22-Mar-2019 07:34:30 * [new tag]         1.11.0.M1  -> 1.11.0.M1
22-Mar-2019 07:34:30 * [new tag]         1.2.0.M1   -> 1.2.0.M1
22-Mar-2019 07:34:30 * [new tag]         1.2.0.RC1  -> 1.2.0.RC1
22-Mar-2019 07:34:30 * [new tag]         1.2.0.RELEASE -> 1.2.0.RELEASE
22-Mar-2019 07:34:30 * [new tag]         1.3.0.RELEASE -> 1.3.0.RELEASE
22-Mar-2019 07:34:30 * [new tag]         1.4.0.M1   -> 1.4.0.M1
22-Mar-2019 07:34:30 * [new tag]         1.4.0.RC1  -> 1.4.0.RC1
22-Mar-2019 07:34:30 * [new tag]         1.4.0.RELEASE -> 1.4.0.RELEASE
22-Mar-2019 07:34:30 * [new tag]         1.5.0.M1   -> 1.5.0.M1
22-Mar-2019 07:34:30 * [new tag]         1.5.0.RC1  -> 1.5.0.RC1
22-Mar-2019 07:34:30 * [new tag]         1.5.0.RELEASE -> 1.5.0.RELEASE
22-Mar-2019 07:34:30 * [new tag]         1.6.0.M1   -> 1.6.0.M1
22-Mar-2019 07:34:30 * [new tag]         1.6.0.RC1  -> 1.6.0.RC1
22-Mar-2019 07:34:30 * [new tag]         1.6.0.RELEASE -> 1.6.0.RELEASE
22-Mar-2019 07:34:30 * [new tag]         1.7.0.M1   -> 1.7.0.M1
22-Mar-2019 07:34:30 * [new tag]         1.7.0.RC1  -> 1.7.0.RC1
22-Mar-2019 07:34:30 * [new tag]         1.7.0.RELEASE -> 1.7.0.RELEASE
22-Mar-2019 07:34:30 * [new tag]         1.8.0.M1   -> 1.8.0.M1
22-Mar-2019 07:34:30 * [new tag]         1.8.0.RC1  -> 1.8.0.RC1
22-Mar-2019 07:34:30 * [new tag]         1.8.0.RELEASE -> 1.8.0.RELEASE
22-Mar-2019 07:34:30 * [new tag]         1.9.0.M1   -> 1.9.0.M1
22-Mar-2019 07:34:30 * [new tag]         1.9.0.RC1  -> 1.9.0.RC1
22-Mar-2019 07:34:30 * [new tag]         1.9.0.RELEASE -> 1.9.0.RELEASE
22-Mar-2019 07:34:30 * [new tag]         2.0.0.M1   -> 2.0.0.M1
22-Mar-2019 07:34:30 * [new tag]         2.0.0.M2   -> 2.0.0.M2
22-Mar-2019 07:34:30 * [new tag]         2.0.0.M3   -> 2.0.0.M3
22-Mar-2019 07:34:30 * [new tag]         2.0.0.M4   -> 2.0.0.M4
22-Mar-2019 07:34:30 * [new tag]         2.0.0.RC1  -> 2.0.0.RC1
22-Mar-2019 07:34:30 * [new tag]         2.0.0.RC2  -> 2.0.0.RC2
22-Mar-2019 07:34:30 * [new tag]         2.0.0.RC3  -> 2.0.0.RC3
22-Mar-2019 07:34:30 * [new tag]         2.0.0.RELEASE -> 2.0.0.RELEASE
22-Mar-2019 07:34:30 Checking out revision 9ac4106d7c37f8e2b2f80bbe1f9ba267b7da6d46.
22-Mar-2019 07:34:30 Switched to branch 'issue/DATAJPA-1265'
22-Mar-2019 07:34:30 Updated source code to revision: 9ac4106d7c37f8e2b2f80bbe1f9ba267b7da6d46
22-Mar-2019 07:34:30 Finished task 'Checkout Default Repository' with result: Success
22-Mar-2019 07:34:30 Running pre-build action: Artifactory Release Staging
22-Mar-2019 07:34:30 Running pre-build action: VCS Version Collector
22-Mar-2019 07:34:30 Starting task 'Artifactory Maven 3' of type 'org.jfrog.bamboo.bamboo-artifactory-plugin:maven3Task'
22-Mar-2019 07:34:30 Bamboo Artifactory Plugin version: 2.5.x-SNAPSHOT
22-Mar-2019 07:34:30
Beginning to execute external process for build 'Spring Data JPA - Spring Data JPA - issue-DATAJPA-1265 - Default Job #3 (SPRINGDATAJPA-DATAJPA93-JOB1-3)'
... running command line:
/opt/jdk-8/bin/java -cp /opt/maven-3.5/boot/plexus-classworlds-2.5.2.jar -Dclassworlds.conf=/tmp/artifactoryM27233587629462901458conf -DbuildInfoConfig.propertiesFile=/tmp/buildInfo5845972670502929867.properties -Dmaven.home=/opt/maven-3.5 -Dmaven.multiModuleProjectDirectory=/opt/bamboo-home/xml-data/build-dir/SPRINGDATAJPA-DATAJPA93-JOB1 org.codehaus.plexus.classworlds.launcher.Launcher dependency:tree clean install -Pci -U -B -Dartifactory.publish.password=********
... in: /opt/bamboo-home/xml-data/build-dir/SPRINGDATAJPA-DATAJPA93-JOB1
... using extra environment variables:
bamboo_planRepository_1_branch=issue/DATAJPA-1265
IRBRC=/home/bamboo/.rvm/rubies/ruby-2.3.0/.irbrc
bamboo_********_username_password=********
bamboo_signing_store_password=********
bamboo_capability_system_builder_ant_Ant_1_9=/opt/ant-1.9
bamboo_capability_system_builder_ant_Ant_1_8=/opt/ant-1.8
bamboo_planRepository_1_branchDisplayName=issue/DATAJPA-1265
bamboo_capability_system_jdk_OpenJDK_7u181=/opt/openjdk-7
bamboo_repository_revision_number=9ac4106d7c37f8e2b2f80bbe1f9ba267b7da6d46
bamboo_capability_system_builder_node_Node_js_6=/usr/bin/node
bamboo_RIAK_BIN=/usr/sbin/riak
WRAPPER_BITS=32
bamboo_buildKey=SPRINGDATAJPA-DATAJPA93-JOB1
rvm_loaded_flag=1
bamboo_bintray_password=********
bamboo_sonar_token_password=********
rvm_version=1.27.0 (latest)
PWD=/opt/bamboo-home/bin
bamboo_shortJobName=Default Job
bamboo_capability_system_builder_gradle___gradlew=./gradlew
bamboo_buildResultsUrl=https://build.spring.io/browse/SPRINGDATAJPA-DATAJPA93-JOB1-3
bamboo_capability_system_builder_mvn3_Maven_3_3=/opt/maven-3.3
bamboo_capability_system_builder_mvn3_Maven_3_2=/opt/maven-3.2
bamboo_capability_system_builder_mvn3_Maven_3_1=/opt/maven-3.1
bamboo_planRepository_repositoryUrl=https://github.com/spring-projects/spring-data-jpa.git
bamboo_repository_262406261_previous_revision_number=388c974e7ad572ac6598e8e0fde030a226e6b445
bamboo_agentId=208568322
bamboo_capability_system_builder_mvn3_Maven_3_5=/opt/maven-3.5
MY_RUBY_HOME=/home/bamboo/.rvm/rubies/ruby-2.3.0
bamboo_capability_system_builder_mvn3_Maven_3_0=/opt/maven-3.0
rvm_path=/home/bamboo/.rvm
bamboo_planRepository_revision=9ac4106d7c37f8e2b2f80bbe1f9ba267b7da6d46
bamboo_planRepository_previousRevision=388c974e7ad572ac6598e8e0fde030a226e6b445
bamboo_capability_remote_build=true
bamboo_repository_branch_name=issue/DATAJPA-1265
bamboo_sonatype_token_password=********
SHLVL=1
bamboo_org_jfrog_bamboo_buildInfo_serverUrl=https://repo.spring.io
bamboo_scdf_acceptance_tests_password=********
WRAPPER_OS=linux
bamboo_repository_262406261_name=Plan Repository
EC2_HOME=/opt/ec2-api-tools
XDG_SESSION_ID=c1
bamboo_capability_Agent=bamboo-01.af.pivotal.io
bamboo_planRepository_branch=issue/DATAJPA-1265
bamboo_org_jfrog_bamboo_release_activated=false
bamboo_planRepository_1_type=gitv2
bamboo_planRepository_branchName=issue/DATAJPA-1265
bamboo_repository_262406261_git_repositoryUrl=https://github.com/spring-projects/spring-data-jpa.git
WRAPPER_FILE_SEPARATOR=/
_=/opt/bamboo-home/bin/bamboo-agent.sh
bamboo_repository_262406261_branch_name=issue/DATAJPA-1265
WRAPPER_PATH_SEPARATOR=:
bamboo_sonar_password=********
bamboo_hg_cache_directory=/opt/bamboo-home/xml-data/build-dir/_hg-repositories-cache
bamboo_planRepository_1_username=spring-buildmaster
bamboo_planRepository_type=gitv2
bamboo_git_cache_directory=/opt/bamboo-home/xml-data/build-dir/_git-repositories-cache
bamboo_artifactory_username=buildmaster
rvm_stored_umask=0002
bamboo_repository_262406261_git_username=spring-buildmaster
bamboo_tmp_directory=/opt/bamboo-home/temp
GEM_PATH=/home/bamboo/.rvm/gems/ruby-2.3.0:/home/bamboo/.rvm/gems/ruby-2.3.0@global
bamboo_planKey=SPRINGDATAJPA-DATAJPA93
bamboo_planRepository_username=spring-buildmaster
bamboo_JDK8_HOME=/opt/jdk-8
NLSPATH=/usr/dt/lib/nls/msg/%L/%N.cat
bamboo_planRepository_1_branchName=issue/DATAJPA-1265
bamboo_sonar_version=5.6.3
XDG_DATA_DIRS=/usr/local/share:/usr/share:/var/lib/snapd/desktop
bamboo_capability_system_jdk_JDK_1_11=/opt/jdk-11
bamboo_resultsUrl=https://build.spring.io/browse/SPRINGDATAJPA-DATAJPA93-JOB1-3
bamboo_capability_system_jdk_JDK_1_10=/opt/jdk-10
bamboo_build_working_directory=/opt/bamboo-home/xml-data/build-dir/SPRINGDATAJPA-DATAJPA93-JOB1
bamboo_planRepository_1_name=Plan Repository
bamboo_capability_system_os=ubuntu1604
bamboo_nexusPush_stagingProfile=buildmaster
bamboo_shortPlanName=issue-DATAJPA-1265
MAIL=/var/mail/bamboo
bamboo_planRepository_name=Plan Repository
LOGNAME=bamboo
bamboo_buildNumber=3
rvm_user_install_flag=1
SHELL=/bin/bash
bamboo_planName=Spring Data JPA - Spring Data JPA - issue-DATAJPA-1265
bamboo_JDK7_HOME=/opt/jdk-7
bamboo_shortPlanKey=DATAJPA93
OLDPWD=/opt/users/bamboo
GEM_HOME=/home/bamboo/.rvm/gems/ruby-2.3.0
bamboo_shortJobKey=JOB1
bamboo_artifactory_password=********
bamboo_buildTimeStamp=2019-03-22T07:34:27.208Z
bamboo_repository_previous_revision_number=388c974e7ad572ac6598e8e0fde030a226e6b445
RUBY_VERSION=ruby-2.3.0
bamboo_sonar_username=buildmaster
_system_name=Ubuntu
bamboo_********_password=********
bamboo_repository_git_branch=issue/DATAJPA-1265
bamboo_buildResultKey=SPRINGDATAJPA-DATAJPA93-JOB1-3
bamboo_nexusPush_close=true
bamboo_buildPlanName=Spring Data JPA - Spring Data JPA - issue-DATAJPA-1265 - Default Job
bamboo_planRepository_1_revision=9ac4106d7c37f8e2b2f80bbe1f9ba267b7da6d46
_system_arch=x86_64
bamboo_repository_name=Plan Repository
rvm_bin_path=/home/bamboo/.rvm/bin
bamboo_signing_key_password=********
XFILESEARCHPATH=/usr/dt/app-defaults/%L/Dt
rvm_prefix=/home/bamboo
LANG=en_US.UTF-8
bamboo_buildFailed=false
bamboo_capability_system_docker_executable=/usr/bin/docker
DISPLAY=localhost:1.0
bamboo_capability_system_builder_groovy_Groovy_2_4=/opt/groovy-2.4
bamboo_capability_system_builder_command_Bash=/bin/bash
bamboo_artifactory_password_mask_a=********
bamboo_agentWorkingDirectory=/opt/bamboo-home/xml-data/build-dir
bamboo_capability_system_git_executable=/usr/bin/git
bamboo_repository_git_username=spring-buildmaster
bamboo_planRepository_1_previousRevision=388c974e7ad572ac6598e8e0fde030a226e6b445
bamboo_capability_os_family=unix
NVM_NODEJS_ORG_MIRROR=http://nodejs.org/dist
bamboo_planRepository_branchDisplayName=issue/DATAJPA-1265
NODE_PATH=/usr/lib/nodejs:/usr/lib/node_modules:/usr/share/javascript
bamboo_capability_system_builder_maven_Artifactory_Maven_3_5=/opt/maven-3.5
GIT_SSL_NO_VERIFY=true
bamboo_capability_system_builder_maven_Artifactory_Maven_3_3=/opt/maven-3.3
NVM_DIR=/home/bamboo/.nvm
bamboo_capability_system_builder_maven_Artifactory_Maven_3_2=/opt/maven-3.2
bamboo_s3_properties=/home/bamboo/tools/s3.properties
bamboo_capability_system_builder_maven_Artifactory_Maven_3_1=/opt/maven-3.1
bamboo_capability_system_builder_maven_Artifactory_Maven_3_0=/opt/maven-3.0
_system_type=Linux
bamboo_plan_storageTag=plan-262209770
bamboo_bintray_username_password=********
_system_version=16.04
USER=bamboo
bamboo_repository_git_repositoryUrl=https://github.com/spring-projects/spring-data-jpa.git
bamboo_repository_262406261_revision_number=9ac4106d7c37f8e2b2f80bbe1f9ba267b7da6d46
bamboo_repository_262406261_git_branch=issue/DATAJPA-1265
bamboo_working_directory=/opt/bamboo-home/xml-data/build-dir/SPRINGDATAJPA-DATAJPA93-JOB1
bamboo_org_jfrog_bamboo_buildInfo_activated=true
bamboo_planRepository_1_repositoryUrl=https://github.com/spring-projects/spring-data-jpa.git
bamboo_capability_system_jdk_JDK_1_8=/opt/jdk-8
bamboo_capability_system_jdk_JDK_1_9=/opt/jdk-9
WRAPPER_ARCH=x86
bamboo_capability_system_jdk_JDK_1_6=/opt/jdk-6
bamboo_sonatype_password=********
bamboo_capability_system_jdk_JDK_1_7=/opt/jdk-7
bamboo_sonar_ip=10.194.6.9
XDG_RUNTIME_DIR=/run/user/505
HOME=/home/bamboo
PATH=/bin:/home/bamboo/.rvm/gems/ruby-2.3.0/bin:/home/bamboo/.rvm/gems/ruby-2.3.0@global/bin:/home/bamboo/.rvm/rubies/ruby-2.3.0/bin:/home/bamboo/bin:/usr/local/bin:/usr/bin:/bin:/usr/local/games:/usr/games:/snap/bin:/home/bamboo/bin:/usr/local/bin:/opt/ec2-api-tools/bin:/home/bamboo/.rvm/bin:/bin:/home/bamboo/.rvm/gems/ruby-2.3.0/bin:/home/bamboo/.rvm/gems/ruby-2.3.0@global/bin:/home/bamboo/.rvm/rubies/ruby-2.3.0/bin:/home/bamboo/bin:/usr/local/bin:/usr/bin:/bin:/usr/local/games:/usr/games:/snap/bin:/home/bamboo/bin:/usr/local/bin:/opt/ec2-api-tools/bin:/home/bamboo/.rvm/bin
22-Mar-2019 07:34:31 [INFO] Scanning for projects...
22-Mar-2019 07:34:31 [INFO] Downloading: https://repo.spring.io/libs-snapshot/org/springframework/data/build/spring-data-parent/2.1.0.BUILD-SNAPSHOT/maven-metadata.xml
22-Mar-2019 07:34:32 [INFO] Downloaded: https://repo.spring.io/libs-snapshot/org/springframework/data/build/spring-data-parent/2.1.0.BUILD-SNAPSHOT/maven-metadata.xml (641 B at 1.0 kB/s)
22-Mar-2019 07:34:32 [INFO] Downloading: https://repo.spring.io/libs-snapshot/org/springframework/data/build/spring-data-build/2.1.0.BUILD-SNAPSHOT/maven-metadata.xml
22-Mar-2019 07:34:32 [INFO] Downloaded: https://repo.spring.io/libs-snapshot/org/springframework/data/build/spring-data-build/2.1.0.BUILD-SNAPSHOT/maven-metadata.xml (640 B at 3.8 kB/s)
22-Mar-2019 07:34:32 [INFO] Initializing Artifactory Build-Info Recording
22-Mar-2019 07:34:32 [INFO]
22-Mar-2019 07:34:32 [INFO] ------------------------------------------------------------------------
22-Mar-2019 07:34:32 [INFO] Building Spring Data JPA 2.1.0.DATAJPA-1265-SNAPSHOT
22-Mar-2019 07:34:32 [INFO] ------------------------------------------------------------------------
22-Mar-2019 07:34:32 [INFO] Downloading: https://repo.spring.io/libs-snapshot/org/springframework/data/spring-data-commons/2.1.0.DATACMNS-1260-SNAPSHOT/maven-metadata.xml
22-Mar-2019 07:34:33 [INFO] Downloaded: https://repo.spring.io/libs-snapshot/org/springframework/data/spring-data-commons/2.1.0.DATACMNS-1260-SNAPSHOT/maven-metadata.xml (1.3 kB at 2.1 kB/s)
22-Mar-2019 07:34:33 [INFO] Downloading: https://repo.spring.io/libs-snapshot/org/springframework/data/spring-data-commons/2.1.0.DATACMNS-1260-SNAPSHOT/spring-data-commons-2.1.0.DATACMNS-1260-20180815.032401-182.pom
22-Mar-2019 07:34:34 [INFO] Downloaded: https://repo.spring.io/libs-snapshot/org/springframework/data/spring-data-commons/2.1.0.DATACMNS-1260-SNAPSHOT/spring-data-commons-2.1.0.DATACMNS-1260-20180815.032401-182.pom (10 kB at 9.1 kB/s)
22-Mar-2019 07:34:34 [INFO] Downloading: https://repo.spring.io/libs-snapshot/org/hibernate/hibernate-core/5.2.12.Final/hibernate-core-5.2.12.Final.pom
22-Mar-2019 07:34:34 [INFO] Downloaded: https://repo.spring.io/libs-snapshot/org/hibernate/hibernate-core/5.2.12.Final/hibernate-core-5.2.12.Final.pom (0 B at 0 B/s)
22-Mar-2019 07:34:34 [INFO] Downloading: https://repo.spring.io/libs-snapshot/org/springframework/data/spring-data-commons/2.1.0.DATACMNS-1260-SNAPSHOT/spring-data-commons-2.1.0.DATACMNS-1260-20180815.032401-182.jar
22-Mar-2019 07:34:34 [INFO] Downloading: https://repo.spring.io/libs-snapshot/org/hibernate/hibernate-core/5.2.12.Final/hibernate-core-5.2.12.Final.jar
22-Mar-2019 07:34:34 [INFO] Downloaded: https://repo.spring.io/libs-snapshot/org/hibernate/hibernate-core/5.2.12.Final/hibernate-core-5.2.12.Final.jar (0 B at 0 B/s)
22-Mar-2019 07:34:36 [INFO] Downloaded: https://repo.spring.io/libs-snapshot/org/springframework/data/spring-data-commons/2.1.0.DATACMNS-1260-SNAPSHOT/spring-data-commons-2.1.0.DATACMNS-1260-20180815.032401-182.jar (1.1 MB at 662 kB/s)
22-Mar-2019 07:34:36 [INFO]
22-Mar-2019 07:34:36 [INFO] --- maven-dependency-plugin:3.0.0:tree (default-cli) @ spring-data-jpa ---
22-Mar-2019 07:34:36 [INFO] org.springframework.data:spring-data-jpa:jar:2.1.0.DATAJPA-1265-SNAPSHOT
22-Mar-2019 07:34:36 [INFO] +- org.springframework.data:spring-data-commons:jar:2.1.0.DATACMNS-1260-SNAPSHOT:compile
22-Mar-2019 07:34:36 [INFO] +- org.springframework:spring-orm:jar:5.1.0.RELEASE:compile
22-Mar-2019 07:34:36 [INFO] |  \- org.springframework:spring-jdbc:jar:5.1.0.RELEASE:compile
22-Mar-2019 07:34:36 [INFO] +- org.springframework:spring-context:jar:5.1.0.RELEASE:compile
22-Mar-2019 07:34:36 [INFO] |  \- org.springframework:spring-expression:jar:5.1.0.RELEASE:compile
22-Mar-2019 07:34:36 [INFO] +- org.springframework:spring-aop:jar:5.1.0.RELEASE:compile
22-Mar-2019 07:34:36 [INFO] +- org.springframework:spring-tx:jar:5.1.0.RELEASE:compile
22-Mar-2019 07:34:36 [INFO] +- org.springframework:spring-beans:jar:5.1.0.RELEASE:compile
22-Mar-2019 07:34:36 [INFO] +- org.springframework:spring-instrument:jar:5.1.0.RELEASE:provided
22-Mar-2019 07:34:36 [INFO] +- org.springframework:spring-core:jar:5.1.0.RELEASE:compile
22-Mar-2019 07:34:36 [INFO] |  \- org.springframework:spring-jcl:jar:5.1.0.RELEASE:compile
22-Mar-2019 07:34:36 [INFO] +- org.aspectj:aspectjrt:jar:1.9.1:compile
22-Mar-2019 07:34:36 [INFO] +- org.aspectj:aspectjweaver:jar:1.9.1:test
22-Mar-2019 07:34:36 [INFO] +- org.springframework:spring-aspects:jar:5.1.0.RELEASE:compile (optional)
22-Mar-2019 07:34:36 [INFO] +- org.hsqldb:hsqldb:jar:2.2.8:test
22-Mar-2019 07:34:36 [INFO] +- joda-time:joda-time:jar:2.10:compile (optional)
22-Mar-2019 07:34:36 [INFO] +- org.threeten:threetenbp:jar:1.3.7:compile (optional)
22-Mar-2019 07:34:36 [INFO] +- org.eclipse.persistence:org.eclipse.persistence.jpa:jar:2.6.5:compile (optional)
22-Mar-2019 07:34:36 [INFO] |  +- org.eclipse.persistence:javax.persistence:jar:2.1.1:compile (optional)
22-Mar-2019 07:34:36 [INFO] |  +- org.eclipse.persistence:org.eclipse.persistence.asm:jar:2.6.5:compile (optional)
22-Mar-2019 07:34:36 [INFO] |  +- org.eclipse.persistence:org.eclipse.persistence.antlr:jar:2.6.5:compile (optional)
22-Mar-2019 07:34:36 [INFO] |  +- org.glassfish:javax.json:jar:1.0.4:compile (optional)
22-Mar-2019 07:34:36 [INFO] |  +- org.eclipse.persistence:org.eclipse.persistence.jpa.jpql:jar:2.6.5:compile (optional)
22-Mar-2019 07:34:36 [INFO] |  \- org.eclipse.persistence:org.eclipse.persistence.core:jar:2.6.5:compile (optional)
22-Mar-2019 07:34:36 [INFO] +- org.hibernate:hibernate-core:jar:5.2.12.Final:compile (optional)
22-Mar-2019 07:34:36 [INFO] |  +- org.jboss.logging:jboss-logging:jar:3.3.0.Final:compile (optional)
22-Mar-2019 07:34:36 [INFO] |  +- org.hibernate.javax.persistence:hibernate-jpa-2.1-api:jar:1.0.0.Final:compile (optional)
22-Mar-2019 07:34:36 [INFO] |  +- org.javassist:javassist:jar:3.20.0-GA:compile
22-Mar-2019 07:34:36 [INFO] |  +- antlr:antlr:jar:2.7.7:compile (optional)
22-Mar-2019 07:34:36 [INFO] |  +- org.jboss.spec.javax.transaction:jboss-transaction-api_1.2_spec:jar:1.0.1.Final:compile (optional)
22-Mar-2019 07:34:36 [INFO] |  +- org.jboss:jandex:jar:2.0.3.Final:compile (optional)
22-Mar-2019 07:34:36 [INFO] |  +- com.fasterxml:classmate:jar:1.3.0:compile (optional)
22-Mar-2019 07:34:36 [INFO] |  +- dom4j:dom4j:jar:1.6.1:compile (optional)
22-Mar-2019 07:34:36 [INFO] |  \- org.hibernate.common:hibernate-commons-annotations:jar:5.0.1.Final:compile (optional)
22-Mar-2019 07:34:36 [INFO] +- com.querydsl:querydsl-apt:jar:4.2.1:provided
22-Mar-2019 07:34:36 [INFO] |  \- com.querydsl:querydsl-codegen:jar:4.2.1:provided
22-Mar-2019 07:34:36 [INFO] |     +- com.mysema.codegen:codegen:jar:0.6.8:provided
22-Mar-2019 07:34:36 [INFO] |     |  \- org.eclipse.jdt.core.compiler:ecj:jar:4.3.1:provided
22-Mar-2019 07:34:36 [INFO] |     \- org.reflections:reflections:jar:0.9.9:provided
22-Mar-2019 07:34:36 [INFO] |        \- com.google.code.findbugs:annotations:jar:2.0.1:provided
22-Mar-2019 07:34:36 [INFO] +- com.querydsl:querydsl-jpa:jar:4.2.1:compile (optional)
22-Mar-2019 07:34:36 [INFO] |  +- com.querydsl:querydsl-core:jar:4.2.1:compile
22-Mar-2019 07:34:36 [INFO] |  |  +- com.google.code.findbugs:jsr305:jar:1.3.9:compile
22-Mar-2019 07:34:36 [INFO] |  |  +- com.mysema.commons:mysema-commons-lang:jar:0.2.4:compile
22-Mar-2019 07:34:36 [INFO] |  |  \- com.infradna.tool:bridge-method-annotation:jar:1.13:compile
22-Mar-2019 07:34:36 [INFO] |  \- javax.inject:javax.inject:jar:1:compile
22-Mar-2019 07:34:36 [INFO] +- org.apache.geronimo.specs:geronimo-jcdi_2.0_spec:jar:1.0.1:test
22-Mar-2019 07:34:36 [INFO] +- javax.interceptor:javax.interceptor-api:jar:1.2.1:test
22-Mar-2019 07:34:36 [INFO] +- javax.enterprise:cdi-api:jar:1.0:provided (optional)
22-Mar-2019 07:34:36 [INFO] |  +- org.jboss.interceptor:jboss-interceptor-api:jar:1.1:provided (optional)
22-Mar-2019 07:34:36 [INFO] |  \- javax.annotation:jsr250-api:jar:1.0:provided (optional)
22-Mar-2019 07:34:36 [INFO] +- javax.annotation:javax.annotation-api:jar:1.3:test
22-Mar-2019 07:34:36 [INFO] +- org.apache.openwebbeans:openwebbeans-se:jar:2.0.6:test
22-Mar-2019 07:34:36 [INFO] |  \- org.apache.openwebbeans:openwebbeans-impl:jar:2.0.6:test
22-Mar-2019 07:34:36 [INFO] |     +- org.apache.xbean:xbean-finder-shaded:jar:4.8:test
22-Mar-2019 07:34:36 [INFO] |     +- org.apache.xbean:xbean-asm6-shaded:jar:4.8:test
22-Mar-2019 07:34:36 [INFO] |     \- org.apache.openwebbeans:openwebbeans-spi:jar:2.0.6:test
22-Mar-2019 07:34:36 [INFO] +- com.google.guava:guava:jar:17.0:test
22-Mar-2019 07:34:36 [INFO] +- org.hamcrest:hamcrest-library:jar:1.3:test
22-Mar-2019 07:34:36 [INFO] +- org.hamcrest:hamcrest-core:jar:1.3:test
22-Mar-2019 07:34:36 [INFO] +- junit:junit:jar:4.12:test
22-Mar-2019 07:34:36 [INFO] +- org.mockito:mockito-core:jar:2.20.0:test
22-Mar-2019 07:34:36 [INFO] |  +- net.bytebuddy:byte-buddy:jar:1.8.13:test
22-Mar-2019 07:34:36 [INFO] |  +- net.bytebuddy:byte-buddy-agent:jar:1.8.13:test
22-Mar-2019 07:34:36 [INFO] |  \- org.objenesis:objenesis:jar:2.6:test
22-Mar-2019 07:34:36 [INFO] +- org.assertj:assertj-core:jar:3.11.1:test
22-Mar-2019 07:34:36 [INFO] +- org.springframework:spring-test:jar:5.1.0.RELEASE:test
22-Mar-2019 07:34:36 [INFO] +- org.slf4j:slf4j-api:jar:1.7.25:compile
22-Mar-2019 07:34:36 [INFO] +- ch.qos.logback:logback-classic:jar:1.2.3:test
22-Mar-2019 07:34:36 [INFO] |  \- ch.qos.logback:logback-core:jar:1.2.3:test
22-Mar-2019 07:34:36 [INFO] \- org.projectlombok:lombok:jar:1.18.2:compile (optional)
22-Mar-2019 07:34:36 [INFO]
22-Mar-2019 07:34:36 [INFO] --- maven-clean-plugin:2.5:clean (default-clean) @ spring-data-jpa ---
22-Mar-2019 07:34:36 [INFO]
22-Mar-2019 07:34:36 [INFO] --- maven-enforcer-plugin:1.4.1:enforce (enforce-maven-version) @ spring-data-jpa ---
22-Mar-2019 07:34:37 [INFO]
22-Mar-2019 07:34:37 [INFO] --- jacoco-maven-plugin:0.8.0:prepare-agent (jacoco-initialize) @ spring-data-jpa ---
22-Mar-2019 07:34:37 [INFO] argLine set to -javaagent:/home/bamboo/.m2/repository/org/jacoco/org.jacoco.agent/0.8.0/org.jacoco.agent-0.8.0-runtime.jar=destfile=/opt/bamboo-home/xml-data/build-dir/SPRINGDATAJPA-DATAJPA93-JOB1/target/jacoco.exec
22-Mar-2019 07:34:37 [INFO]
22-Mar-2019 07:34:37 [INFO] --- lombok-maven-plugin:1.18.0.0:delombok (default) @ spring-data-jpa ---
22-Mar-2019 07:34:39 /opt/bamboo-home/xml-data/build-dir/SPRINGDATAJPA-DATAJPA93-JOB1/src/main/java/org/springframework/data/jpa/repository/query/QueryParameterSetterFactory.java:176: error: method getEvaluationContext in interface QueryMethodEvaluationContextProvider cannot be applied to given types;
22-Mar-2019 07:34:39                         EvaluationContext context = evaluationContextProvider.getEvaluationContext(parameters, values);
22-Mar-2019 07:34:39                                                                              ^
22-Mar-2019 07:34:39   required: ParameterContext<T>
22-Mar-2019 07:34:39   found: Parameters<CAP#1,CAP#2>,Object[]
22-Mar-2019 07:34:39   reason: cannot infer type-variable(s) T
22-Mar-2019 07:34:39     (actual and formal argument lists differ in length)
22-Mar-2019 07:34:39   where T is a type-variable:
22-Mar-2019 07:34:39     T extends Parameters<?,?> declared in method <T>getEvaluationContext(ParameterContext<T>)
22-Mar-2019 07:34:39   where CAP#1,CAP#2 are fresh type-variables:
22-Mar-2019 07:34:39     CAP#1 extends Parameters<CAP#1,CAP#2> from capture of ?
22-Mar-2019 07:34:39     CAP#2 extends Parameter from capture of ?
22-Mar-2019 07:34:39 [INFO] Delombok complete.
22-Mar-2019 07:34:39 [INFO]
22-Mar-2019 07:34:39 [INFO] --- apt-maven-plugin:1.1.3:process (sources) @ spring-data-jpa ---
22-Mar-2019 07:34:39 [INFO] Downloading: https://repo.spring.io/plugins-release/org/hibernate/hibernate-jpamodelgen/1.3.0.Final/hibernate-jpamodelgen-1.3.0.Final.pom
22-Mar-2019 07:34:39 [INFO] Downloaded: https://repo.spring.io/plugins-release/org/hibernate/hibernate-jpamodelgen/1.3.0.Final/hibernate-jpamodelgen-1.3.0.Final.pom (17 kB at 61 kB/s)
22-Mar-2019 07:34:39 [INFO] Downloading: https://repo.spring.io/plugins-release/org/hibernate/hibernate-jpamodelgen/1.3.0.Final/hibernate-jpamodelgen-1.3.0.Final.jar
22-Mar-2019 07:34:39 [INFO] Downloaded: https://repo.spring.io/plugins-release/org/hibernate/hibernate-jpamodelgen/1.3.0.Final/hibernate-jpamodelgen-1.3.0.Final.jar (182 kB at 412 kB/s)
22-Mar-2019 07:34:41 [INFO]
22-Mar-2019 07:34:41 [INFO] --- maven-resources-plugin:2.6:resources (default-resources) @ spring-data-jpa ---
22-Mar-2019 07:34:41 [INFO] Using 'UTF-8' encoding to copy filtered resources.
22-Mar-2019 07:34:41 [INFO] Copying 14 resources
22-Mar-2019 07:34:41 [INFO]
22-Mar-2019 07:34:41 [INFO] --- kotlin-maven-plugin:1.2.70:compile (compile) @ spring-data-jpa ---
22-Mar-2019 07:34:41 [WARNING] No sources found skipping Kotlin compile
22-Mar-2019 07:34:41 [INFO]
22-Mar-2019 07:34:41 [INFO] --- maven-compiler-plugin:3.6.1:compile (java-compile) @ spring-data-jpa ---
22-Mar-2019 07:34:41 [INFO] Changes detected - recompiling the module!
22-Mar-2019 07:34:41 [INFO] Compiling 112 source files to /opt/bamboo-home/xml-data/build-dir/SPRINGDATAJPA-DATAJPA93-JOB1/target/classes
22-Mar-2019 07:34:43 [INFO] /opt/bamboo-home/xml-data/build-dir/SPRINGDATAJPA-DATAJPA93-JOB1/src/main/java/org/springframework/data/jpa/domain/Specifications.java: Some input files use or override a deprecated API.
22-Mar-2019 07:34:43 [INFO] /opt/bamboo-home/xml-data/build-dir/SPRINGDATAJPA-DATAJPA93-JOB1/src/main/java/org/springframework/data/jpa/domain/Specifications.java: Recompile with -Xlint:deprecation for details.
22-Mar-2019 07:34:43 [INFO] -------------------------------------------------------------
22-Mar-2019 07:34:43 [ERROR] COMPILATION ERROR :
22-Mar-2019 07:34:43 [INFO] -------------------------------------------------------------
22-Mar-2019 07:34:43 [ERROR] /opt/bamboo-home/xml-data/build-dir/SPRINGDATAJPA-DATAJPA93-JOB1/src/main/java/org/springframework/data/jpa/repository/query/QueryParameterSetterFactory.java:[176,78] method getEvaluationContext in interface org.springframework.data.repository.query.QueryMethodEvaluationContextProvider cannot be applied to given types;
22-Mar-2019 07:34:43   required: org.springframework.data.repository.query.QueryMethodEvaluationContextProvider.ParameterContext<T>
22-Mar-2019 07:34:43   found: org.springframework.data.repository.query.Parameters<capture#1 of ?,capture#2 of ?>,java.lang.Object[]
22-Mar-2019 07:34:43   reason: cannot infer type-variable(s) T
22-Mar-2019 07:34:43     (actual and formal argument lists differ in length)
22-Mar-2019 07:34:43 [INFO] 1 error
22-Mar-2019 07:34:43 [INFO] -------------------------------------------------------------
22-Mar-2019 07:34:43 [INFO] ------------------------------------------------------------------------
22-Mar-2019 07:34:43 [INFO] BUILD FAILURE
22-Mar-2019 07:34:43 [INFO] ------------------------------------------------------------------------
22-Mar-2019 07:34:43 [INFO] Total time: 11.762 s
22-Mar-2019 07:34:43 [INFO] Finished at: 2019-03-22T07:34:43Z
22-Mar-2019 07:34:43 [INFO] Final Memory: 56M/735M
22-Mar-2019 07:34:43 [INFO] ------------------------------------------------------------------------
22-Mar-2019 07:34:43 [ERROR] Failed to execute goal org.apache.maven.plugins:maven-compiler-plugin:3.6.1:compile (java-compile) on project spring-data-jpa: Compilation failure
22-Mar-2019 07:34:43 [ERROR] /opt/bamboo-home/xml-data/build-dir/SPRINGDATAJPA-DATAJPA93-JOB1/src/main/java/org/springframework/data/jpa/repository/query/QueryParameterSetterFactory.java:[176,78] method getEvaluationContext in interface org.springframework.data.repository.query.QueryMethodEvaluationContextProvider cannot be applied to given types;
22-Mar-2019 07:34:43 [ERROR]   required: org.springframework.data.repository.query.QueryMethodEvaluationContextProvider.ParameterContext<T>
22-Mar-2019 07:34:43 [ERROR]   found: org.springframework.data.repository.query.Parameters<capture#1 of ?,capture#2 of ?>,java.lang.Object[]
22-Mar-2019 07:34:43 [ERROR]   reason: cannot infer type-variable(s) T
22-Mar-2019 07:34:43 [ERROR]     (actual and formal argument lists differ in length)
22-Mar-2019 07:34:43 [ERROR] -> [Help 1]
22-Mar-2019 07:34:43 [ERROR]
22-Mar-2019 07:34:43 [ERROR] To see the full stack trace of the errors, re-run Maven with the -e switch.
22-Mar-2019 07:34:43 [ERROR] Re-run Maven using the -X switch to enable full debug logging.
22-Mar-2019 07:34:43 [ERROR]
22-Mar-2019 07:34:43 [ERROR] For more information about the errors and possible solutions, please read the following articles:
22-Mar-2019 07:34:43 [ERROR] [Help 1] http://cwiki.apache.org/confluence/display/MAVEN/MojoFailureException
22-Mar-2019 07:34:43
22-Mar-2019 07:34:43 Failing task since return code of [/opt/jdk-8/bin/java -cp /opt/maven-3.5/boot/plexus-classworlds-2.5.2.jar -Dclassworlds.conf=/tmp/artifactoryM27233587629462901458conf -DbuildInfoConfig.propertiesFile=/tmp/buildInfo5845972670502929867.properties -Dmaven.home=/opt/maven-3.5 -Dmaven.multiModuleProjectDirectory=/opt/bamboo-home/xml-data/build-dir/SPRINGDATAJPA-DATAJPA93-JOB1 org.codehaus.plexus.classworlds.launcher.Launcher dependency:tree clean install -Pci -U -B -Dartifactory.publish.password=********] was 1 while expected 0
22-Mar-2019 07:34:43 Parsing test results under /opt/bamboo-home/xml-data/build-dir/SPRINGDATAJPA-DATAJPA93-JOB1...
22-Mar-2019 07:34:43 Finished task 'Artifactory Maven 3' with result: Failed
22-Mar-2019 07:34:43 Running post build plugin 'Docker Container Cleanup'
22-Mar-2019 07:34:43 Running post build plugin 'NCover Results Collector'
22-Mar-2019 07:34:43 Running post build plugin 'Artifactory Release Management Staging'
22-Mar-2019 07:34:43 Running post build plugin 'Artifactory Build Info Copier'
22-Mar-2019 07:34:43 Running post build plugin 'Artifactory Gradle Properties Info Copier'
22-Mar-2019 07:34:43 Running post build plugin 'Clover Results Collector'
22-Mar-2019 07:34:43 Running post build plugin 'npm Cache Cleanup'
22-Mar-2019 07:34:43 Running post build plugin 'Artifact Copier'
22-Mar-2019 07:34:43 Successfully removed working directory at '/opt/bamboo-home/xml-data/build-dir/SPRINGDATAJPA-DATAJPA93-JOB1'
22-Mar-2019 07:34:43 Finalising the build...
22-Mar-2019 07:34:43 Stopping timer.
22-Mar-2019 07:34:43 Build SPRINGDATAJPA-DATAJPA93-JOB1-3 completed.
22-Mar-2019 07:34:43 Running on server: post build plugin 'NCover Results Collector'
22-Mar-2019 07:34:43 Running on server: post build plugin 'Build Hanging Detection Configuration'
22-Mar-2019 07:34:43 Running on server: post build plugin 'Clover Delta Calculator'
22-Mar-2019 07:34:43 Running on server: post build plugin 'Maven Dependencies Postprocessor'
22-Mar-2019 07:34:43 Failed to execute plugin 'Maven Dependencies Postprocessor' with error: com.thoughtworks.xstream.mapper.CannotResolveClassException: com.atlassian.bamboo.plugins.maven2.Maven2ProjectProperties
22-Mar-2019 07:34:43 All post build plugins have finished
22-Mar-2019 07:34:43 Generating build results summary...
22-Mar-2019 07:34:43 Saving build results to disk...
22-Mar-2019 07:34:43 Logging substituted variables...
22-Mar-2019 07:34:43 Indexing build results...
22-Mar-2019 07:34:43 Finished building SPRINGDATAJPA-DATAJPA93-JOB1-3.