Build #3

Build result summary

Details

Completed
Duration
13 seconds
Labels
None
Revision
9309b7011cf967b5e1ed77b0a9baa5b8fa1b4116 9309b7011cf967b5e1ed77b0a9baa5b8fa1b4116
Failing since
#2 (Changes by Spring Operator <sagan-ops@gopivotal.com>)
No failed tests found, a possible compilation error occurred.

Responsible

This build has been failing since #2
No one has taken responsibility

Code commits

Author Commit Message Commit date
Spring Operator <sagan-ops@gopivotal.com> Spring Operator <sagan-ops@gopivotal.com> 9309b7011cf967b5e1ed77b0a9baa5b8fa1b4116 9309b7011cf967b5e1ed77b0a9baa5b8fa1b4116 DATAJPA-1512 - URL Cleanup.
This commit updates URLs to prefer the https protocol. Redirects are not followed to avoid accidentally expanding intentionally shortened URLs (i.e. if using a URL shortener).

# Fixed URLs

## Fixed Success
These URLs were switched to an https URL with a 2xx status. While the status was successful, your review is still recommended.

* [ ] http://www.apache.org/licenses/ with 1 occurrences migrated to:
  https://www.apache.org/licenses/ ([https](https://www.apache.org/licenses/) result 200).
* [ ] http://www.apache.org/licenses/LICENSE-2.0 with 341 occurrences migrated to:
  https://www.apache.org/licenses/LICENSE-2.0 ([https](https://www.apache.org/licenses/LICENSE-2.0) result 200).

Original Pull Request: #363

Jira issues

IssueDescriptionStatus
Unknown Issue TypeDATAJPA-1512Could not obtain issue details from Jira
Unknown Issue TypeLICENSE-2Could not obtain issue details from Jira

Error summary for Default Job

The job generated some errors, drill down into the full build log for more details.

Could not find test result reports in the /opt/bamboo-home/xml-data/build-dir/SPRINGDATAJPA-DATAJPA99-JOB1 directory.
/opt/bamboo-home/xml-data/build-dir/SPRINGDATAJPA-DATAJPA99-JOB1/src/main/java/org/springframework/data/jpa/repository/query/JpaQueryLookupStrategy.java:223: error: cannot find symbol
                        EvaluationContextProvider evaluationContextProvider) {
                        ^
  symbol:   class EvaluationContextProvider
  location: class JpaQueryLookupStrategy
/opt/bamboo-home/xml-data/build-dir/SPRINGDATAJPA-DATAJPA99-JOB1/src/main/java/org/springframework/data/jpa/repository/query/JpaQueryLookupStrategy.java:116: error: cannot find symbol
                private final EvaluationContextProvider evaluationContextProvider;
                              ^
  symbol:   class EvaluationContextProvider
  location: class DeclaredQueryLookupStrategy
/opt/bamboo-home/xml-data/build-dir/SPRINGDATAJPA-DATAJPA99-JOB1/src/main/java/org/springframework/data/jpa/repository/query/JpaQueryLookupStrategy.java:126: error: cannot find symbol
                                EvaluationContextProvider evaluationContextProvider) {
                                ^
  symbol:   class EvaluationContextProvider
  location: class DeclaredQueryLookupStrategy
/opt/bamboo-home/xml-data/build-dir/SPRINGDATAJPA-DATAJPA99-JOB1/src/main/java/org/springframework/data/jpa/repository/query/QueryParameterSetterFactory.java:28: error: cannot find symbol
import org.springframework.data.repository.query.EvaluationContextProvider;
                                                ^
  symbol:   class EvaluationContextProvider
  location: package org.springframework.data.repository.query
/opt/bamboo-home/xml-data/build-dir/SPRINGDATAJPA-DATAJPA99-JOB1/src/main/java/org/springframework/data/jpa/repository/query/QueryParameterSetterFactory.java:91: error: cannot find symbol
                        EvaluationContextProvider evaluationContextProvider, Parameters<?, ?> parameters) {
                        ^
  symbol:   class EvaluationContextProvider
  location: class QueryParameterSetterFactory
/opt/bamboo-home/xml-data/build-dir/SPRINGDATAJPA-DATAJPA99-JOB1/src/main/java/org/springframework/data/jpa/repository/query/QueryParameterSetterFactory.java:129: error: cannot find symbol
                private final EvaluationContextProvider evaluationContextProvider;
                              ^
  symbol:   class EvaluationContextProvider
  location: class ExpressionBasedQueryParameterSetterFactory
/opt/bamboo-home/xml-data/build-dir/SPRINGDATAJPA-DATAJPA99-JOB1/src/main/java/org/springframework/data/jpa/repository/query/QueryParameterSetterFactory.java:138: error: cannot find symbol
                                EvaluationContextProvider evaluationContextProvider, Parameters<?, ?> parameters) {
                                ^
  symbol:   class EvaluationContextProvider
  location: class ExpressionBasedQueryParameterSetterFactory
/opt/bamboo-home/xml-data/build-dir/SPRINGDATAJPA-DATAJPA99-JOB1/src/main/java/org/springframework/data/jpa/repository/query/NativeJpaQuery.java:23: error: cannot find symbol
import org.springframework.data.repository.query.EvaluationContextProvider;
                                                ^
  symbol:   class EvaluationContextProvider
  location: package org.springframework.data.repository.query
/opt/bamboo-home/xml-data/build-dir/SPRINGDATAJPA-DATAJPA99-JOB1/src/main/java/org/springframework/data/jpa/repository/query/AbstractStringBasedJpaQuery.java:23: error: cannot find symbol
import org.springframework.data.repository.query.EvaluationContextProvider;
                                                ^
  symbol:   class EvaluationContextProvider
  location: package org.springframework.data.repository.query
/opt/bamboo-home/xml-data/build-dir/SPRINGDATAJPA-DATAJPA99-JOB1/src/main/java/org/springframework/data/jpa/repository/query/NativeJpaQuery.java:52: error: cannot find symbol
                        EvaluationContextProvider evaluationContextProvider, SpelExpressionParser parser) {
                        ^
  symbol:   class EvaluationContextProvider
  location: class NativeJpaQuery
/opt/bamboo-home/xml-data/build-dir/SPRINGDATAJPA-DATAJPA99-JOB1/src/main/java/org/springframework/data/jpa/repository/query/AbstractStringBasedJpaQuery.java:40: error: cannot find symbol
        private final EvaluationContextProvider evaluationContextProvider;
                      ^
  symbol:   class EvaluationContextProvider
  location: class AbstractStringBasedJpaQuery
/opt/bamboo-home/xml-data/build-dir/SPRINGDATAJPA-DATAJPA99-JOB1/src/main/java/org/springframework/data/jpa/repository/query/AbstractStringBasedJpaQuery.java:54: error: cannot find symbol
                        EvaluationContextProvider evaluationContextProvider, SpelExpressionParser parser) {
                        ^
  symbol:   class EvaluationContextProvider
  location: class AbstractStringBasedJpaQuery
/opt/bamboo-home/xml-data/build-dir/SPRINGDATAJPA-DATAJPA99-JOB1/src/main/java/org/springframework/data/jpa/repository/query/SimpleJpaQuery.java:21: error: cannot find symbol
import org.springframework.data.repository.query.EvaluationContextProvider;
                                                ^
  symbol:   class EvaluationContextProvider
  location: package org.springframework.data.repository.query
/opt/bamboo-home/xml-data/build-dir/SPRINGDATAJPA-DATAJPA99-JOB1/src/main/java/org/springframework/data/jpa/repository/query/SimpleJpaQuery.java:44: error: cannot find symbol
        public SimpleJpaQuery(JpaQueryMethod method, EntityManager em, EvaluationContextProvider evaluationContextProvider,
                                                                       ^
  symbol:   class EvaluationContextProvider
  location: class SimpleJpaQuery
/opt/bamboo-home/xml-data/build-dir/SPRINGDATAJPA-DATAJPA99-JOB1/src/main/java/org/springframework/data/jpa/repository/query/SimpleJpaQuery.java:59: error: cannot find symbol
                        EvaluationContextProvider evaluationContextProvider, SpelExpressionParser parser) {
                        ^
  symbol:   class EvaluationContextProvider
  location: class SimpleJpaQuery
/opt/bamboo-home/xml-data/build-dir/SPRINGDATAJPA-DATAJPA99-JOB1/src/main/java/org/springframework/data/jpa/repository/query/JpaQueryFactory.java:23: error: cannot find symbol
import org.springframework.data.repository.query.EvaluationContextProvider;
                                                ^
  symbol:   class EvaluationContextProvider
  location: package org.springframework.data.repository.query
/opt/bamboo-home/xml-data/build-dir/SPRINGDATAJPA-DATAJPA99-JOB1/src/main/java/org/springframework/data/jpa/repository/query/JpaQueryFactory.java:53: error: cannot find symbol
                        EvaluationContextProvider evaluationContextProvider) {
                        ^
  symbol:   class EvaluationContextProvider
  location: class JpaQueryFactory
/opt/bamboo-home/xml-data/build-dir/SPRINGDATAJPA-DATAJPA99-JOB1/src/main/java/org/springframework/data/jpa/repository/query/JpaQueryFactory.java:70: error: cannot find symbol
                        EvaluationContextProvider evaluationContextProvider) {
                        ^
  symbol:   class EvaluationContextProvider
  location: class JpaQueryFactory
/opt/bamboo-home/xml-data/build-dir/SPRINGDATAJPA-DATAJPA99-JOB1/src/main/java/org/springframework/data/jpa/repository/query/ParameterBinderFactory.java:26: error: cannot find symbol
import org.springframework.data.repository.query.EvaluationContextProvider;
                                                ^
  symbol:   class EvaluationContextProvider
  location: package org.springframework.data.repository.query
/opt/bamboo-home/xml-data/build-dir/SPRINGDATAJPA-DATAJPA99-JOB1/src/main/java/org/springframework/data/jpa/repository/query/ParameterBinderFactory.java:91: error: cannot find symbol
                        SpelExpressionParser parser, EvaluationContextProvider evaluationContextProvider) {
                                                     ^
  symbol:   class EvaluationContextProvider
  location: class ParameterBinderFactory