Build: #2588 failed

Job: Default Job failed

Stages & jobs

  1. Default Stage

Job result summary

Completed
Duration
3 minutes
Agent
bamboo-18.af.pivotal.io
Revision
29bf74c24cc0a733c446aa737c70078a4fd9f33d 29bf74c24cc0a733c446aa737c70078a4fd9f33d
Total tests
3959
Fixed in
#2589 (Scheduled)

Tests

  • 3,959 tests in total
  • 1 test failed
  • 1 failure is new
  • 40 tests were quarantined / skipped
  • 2 minutes taken in total.
New test failures 1
Status Test Duration
Collapse Failed CursorReadingTaskUnitTests stopTaskWhileEmittingMessages History
< 1 sec
java.lang.IllegalStateException: Cursor cursor is not longer open.

Error summary

The build generated some errors. See the full build log for more details.

OpenJDK 64-Bit Server VM warning: ignoring option PermSize=256m; support was removed in 8.0
Exception in thread "SimpleAsyncTaskExecutor-1" org.springframework.data.mongodb.UncategorizedMongoDbException: Query failed with error code 175 and error message 'all indexes on collection dropped' on server 127.0.0.1:27017; nested exception is com.mongodb.MongoQueryException: Query failed with error code 175 and error message 'all indexes on collection dropped' on server 127.0.0.1:27017
        at org.springframework.data.mongodb.core.MongoExceptionTranslator.translateExceptionIfPossible(MongoExceptionTranslator.java:138)
        at org.springframework.data.mongodb.core.messaging.CursorReadingTask.execute(CursorReadingTask.java:267)
        at org.springframework.data.mongodb.core.messaging.CursorReadingTask.run(CursorReadingTask.java:82)
        at java.lang.Thread.run(Thread.java:748)
Caused by: com.mongodb.MongoQueryException: Query failed with error code 175 and error message 'all indexes on collection dropped' on server 127.0.0.1:27017
        at com.mongodb.operation.QueryHelper.translateCommandException(QueryHelper.java:29)
        at com.mongodb.operation.QueryBatchCursor.getMore(QueryBatchCursor.java:229)
        at com.mongodb.operation.QueryBatchCursor.tryHasNext(QueryBatchCursor.java:193)
        at com.mongodb.operation.QueryBatchCursor.tryNext(QueryBatchCursor.java:177)
        at com.mongodb.client.internal.MongoBatchCursorAdapter.tryNext(MongoBatchCursorAdapter.java:74)
        at org.springframework.data.mongodb.core.messaging.CursorReadingTask.getNext(CursorReadingTask.java:230)
        at org.springframework.data.mongodb.core.messaging.CursorReadingTask.execute(CursorReadingTask.java:264)
        ... 2 more
Exception in thread "SimpleAsyncTaskExecutor-1" org.springframework.data.mongodb.UncategorizedMongoDbException: Query failed with error code 96 and error message 'collection dropped between getMore calls' on server 127.0.0.1:27017; nested exception is com.mongodb.MongoQueryException: Query failed with error code 96 and error message 'collection dropped between getMore calls' on server 127.0.0.1:27017
        at org.springframework.data.mongodb.core.MongoExceptionTranslator.translateExceptionIfPossible(MongoExceptionTranslator.java:138)
        at org.springframework.data.mongodb.core.messaging.CursorReadingTask.execute(CursorReadingTask.java:267)
        at org.springframework.data.mongodb.core.messaging.CursorReadingTask.run(CursorReadingTask.java:82)
        at java.lang.Thread.run(Thread.java:748)
Caused by: com.mongodb.MongoQueryException: Query failed with error code 96 and error message 'collection dropped between getMore calls' on server 127.0.0.1:27017
        at com.mongodb.operation.QueryHelper.translateCommandException(QueryHelper.java:29)
        at com.mongodb.operation.QueryBatchCursor.getMore(QueryBatchCursor.java:229)
        at com.mongodb.operation.QueryBatchCursor.tryHasNext(QueryBatchCursor.java:193)
        at com.mongodb.operation.QueryBatchCursor.tryNext(QueryBatchCursor.java:177)
        at com.mongodb.client.internal.MongoBatchCursorAdapter.tryNext(MongoBatchCursorAdapter.java:74)
        at org.springframework.data.mongodb.core.messaging.CursorReadingTask.getNext(CursorReadingTask.java:230)
        at org.springframework.data.mongodb.core.messaging.CursorReadingTask.execute(CursorReadingTask.java:264)
        ... 2 more
Exception in thread "thread 1" java.lang.UnsupportedOperationException
        at java.lang.Thread.stop(Thread.java:872)
        at edu.umd.cs.mtc.TestFramework.signalError(TestFramework.java:643)
        at edu.umd.cs.mtc.TestFramework.access$2(TestFramework.java:636)
        at edu.umd.cs.mtc.TestFramework$2.run(TestFramework.java:600)
        at java.lang.Thread.run(Thread.java:748)