Build: #2593 was successful

Job: Default Job was successful

Stages & jobs

  1. Default Stage

Build log

The build generated 1,356 lines of output.The output is too long and has been truncated to the last 1,000 lines. Download or view full build log

21-Jun-2019 03:32:36 [INFO] Tests run: 7, Failures: 0, Errors: 0, Skipped: 0, Time elapsed: 0.003 s - in org.springframework.data.mongodb.core.index.IndexInfoUnitTests
21-Jun-2019 03:32:36 [INFO] Running org.springframework.data.mongodb.core.index.MongoPersistentEntityIndexResolverUnitTests$GeoSpatialIndexResolutionTests
21-Jun-2019 03:32:36 [INFO] Tests run: 6, Failures: 0, Errors: 0, Skipped: 0, Time elapsed: 0 s - in org.springframework.data.mongodb.core.index.MongoPersistentEntityIndexResolverUnitTests$GeoSpatialIndexResolutionTests
21-Jun-2019 03:32:36 [INFO] Running org.springframework.data.mongodb.core.index.ReactiveMongoPersistentEntityIndexCreatorUnitTests
21-Jun-2019 03:32:36 [INFO] Tests run: 3, Failures: 0, Errors: 0, Skipped: 0, Time elapsed: 0.009 s - in org.springframework.data.mongodb.core.index.ReactiveMongoPersistentEntityIndexCreatorUnitTests
21-Jun-2019 03:32:36 [INFO] Running org.springframework.data.mongodb.core.index.MongoPersistentEntityIndexResolverUnitTests$TextIndexedResolutionTests
21-Jun-2019 03:32:36 [INFO] Tests run: 12, Failures: 0, Errors: 0, Skipped: 0, Time elapsed: 0.004 s - in org.springframework.data.mongodb.core.index.MongoPersistentEntityIndexResolverUnitTests$TextIndexedResolutionTests
21-Jun-2019 03:32:36 [INFO] Running org.springframework.data.mongodb.core.MongoOperationsExtensionsTests
21-Jun-2019 03:32:39 [INFO] Tests run: 75, Failures: 0, Errors: 0, Skipped: 0, Time elapsed: 3.362 s - in org.springframework.data.mongodb.core.MongoOperationsExtensionsTests
21-Jun-2019 03:32:39 [INFO] Running org.springframework.data.mongodb.core.DefaultIndexOperationsIntegrationTests
21-Jun-2019 03:32:40 [INFO] Tests run: 6, Failures: 0, Errors: 0, Skipped: 0, Time elapsed: 0.663 s - in org.springframework.data.mongodb.core.DefaultIndexOperationsIntegrationTests
21-Jun-2019 03:32:40 [INFO] Running org.springframework.data.mongodb.core.ExecutableUpdateOperationSupportTests
21-Jun-2019 03:32:41 [INFO] Tests run: 18, Failures: 0, Errors: 0, Skipped: 0, Time elapsed: 0.872 s - in org.springframework.data.mongodb.core.ExecutableUpdateOperationSupportTests
21-Jun-2019 03:32:41 [INFO] Running org.springframework.data.mongodb.core.MongoTemplateCollationTests
21-Jun-2019 03:32:43 [INFO] Tests run: 5, Failures: 0, Errors: 0, Skipped: 0, Time elapsed: 2.154 s - in org.springframework.data.mongodb.core.MongoTemplateCollationTests
21-Jun-2019 03:32:43 [INFO] Running org.springframework.data.mongodb.core.DefaultReactiveIndexOperationsTests
21-Jun-2019 03:32:45 [INFO] Tests run: 5, Failures: 0, Errors: 0, Skipped: 0, Time elapsed: 1.988 s - in org.springframework.data.mongodb.core.DefaultReactiveIndexOperationsTests
21-Jun-2019 03:32:45 [INFO] Running org.springframework.data.mongodb.core.ReactiveMongoTemplateCollationTests
21-Jun-2019 03:32:45 [INFO] Tests run: 1, Failures: 0, Errors: 0, Skipped: 0, Time elapsed: 0.329 s - in org.springframework.data.mongodb.core.ReactiveMongoTemplateCollationTests
21-Jun-2019 03:32:45 [INFO] Running org.springframework.data.mongodb.core.CollationUnitTests
21-Jun-2019 03:32:45 [INFO] Tests run: 24, Failures: 0, Errors: 0, Skipped: 0, Time elapsed: 0.003 s - in org.springframework.data.mongodb.core.CollationUnitTests
21-Jun-2019 03:32:45 [INFO] Running org.springframework.data.mongodb.core.SerializationUtilsUnitTests
21-Jun-2019 03:32:45 [INFO] Tests run: 8, Failures: 0, Errors: 0, Skipped: 0, Time elapsed: 0.006 s - in org.springframework.data.mongodb.core.SerializationUtilsUnitTests
21-Jun-2019 03:32:45 [INFO] Running org.springframework.data.mongodb.core.DefaultIndexOperationsUnitTests
21-Jun-2019 03:32:45 [INFO] Tests run: 5, Failures: 0, Errors: 0, Skipped: 0, Time elapsed: 0.02 s - in org.springframework.data.mongodb.core.DefaultIndexOperationsUnitTests
21-Jun-2019 03:32:45 [INFO] Running org.springframework.data.mongodb.core.MongoTemplateUnitTests
21-Jun-2019 03:32:47 [WARNING] Tests run: 140, Failures: 0, Errors: 0, Skipped: 1, Time elapsed: 1.292 s - in org.springframework.data.mongodb.core.MongoTemplateUnitTests
21-Jun-2019 03:32:47 [INFO] Running org.springframework.data.mongodb.core.messaging.DefaultMessageListenerContainerTests
21-Jun-2019 03:32:48 Exception in thread "SimpleAsyncTaskExecutor-1" org.springframework.data.mongodb.UncategorizedMongoDbException: Query failed with error code 96 and error message 'collection dropped between getMore calls' on server 127.0.0.1:27017; nested exception is com.mongodb.MongoQueryException: Query failed with error code 96 and error message 'collection dropped between getMore calls' on server 127.0.0.1:27017
21-Jun-2019 03:32:48         at org.springframework.data.mongodb.core.MongoExceptionTranslator.translateExceptionIfPossible(MongoExceptionTranslator.java:138)
21-Jun-2019 03:32:48         at org.springframework.data.mongodb.core.messaging.CursorReadingTask.execute(CursorReadingTask.java:267)
21-Jun-2019 03:32:48         at org.springframework.data.mongodb.core.messaging.CursorReadingTask.run(CursorReadingTask.java:82)
21-Jun-2019 03:32:48         at java.lang.Thread.run(Thread.java:748)
21-Jun-2019 03:32:48 Caused by: com.mongodb.MongoQueryException: Query failed with error code 96 and error message 'collection dropped between getMore calls' on server 127.0.0.1:27017
21-Jun-2019 03:32:48         at com.mongodb.operation.QueryHelper.translateCommandException(QueryHelper.java:29)
21-Jun-2019 03:32:48         at com.mongodb.operation.QueryBatchCursor.getMore(QueryBatchCursor.java:229)
21-Jun-2019 03:32:48         at com.mongodb.operation.QueryBatchCursor.tryHasNext(QueryBatchCursor.java:193)
21-Jun-2019 03:32:48         at com.mongodb.operation.QueryBatchCursor.tryNext(QueryBatchCursor.java:177)
21-Jun-2019 03:32:48         at com.mongodb.client.internal.MongoBatchCursorAdapter.tryNext(MongoBatchCursorAdapter.java:74)
21-Jun-2019 03:32:48         at org.springframework.data.mongodb.core.messaging.CursorReadingTask.getNext(CursorReadingTask.java:230)
21-Jun-2019 03:32:48         at org.springframework.data.mongodb.core.messaging.CursorReadingTask.execute(CursorReadingTask.java:264)
21-Jun-2019 03:32:48         ... 2 more
21-Jun-2019 03:32:49 2019-06-21 03:32:49,981 ERROR rContainer$DecoratingLoggingErrorHandler: 306 - Unexpected error occurred while listening to MongoDB.
21-Jun-2019 03:32:49 org.springframework.data.mongodb.UncategorizedMongoDbException: Query failed with error code 96 and error message 'collection dropped between getMore calls' on server 127.0.0.1:27017; nested exception is com.mongodb.MongoQueryException: Query failed with error code 96 and error message 'collection dropped between getMore calls' on server 127.0.0.1:27017
21-Jun-2019 03:32:49         at org.springframework.data.mongodb.core.MongoExceptionTranslator.translateExceptionIfPossible(MongoExceptionTranslator.java:138)
21-Jun-2019 03:32:49         at org.springframework.data.mongodb.core.messaging.CursorReadingTask.execute(CursorReadingTask.java:267)
21-Jun-2019 03:32:49         at org.springframework.data.mongodb.core.messaging.CursorReadingTask.run(CursorReadingTask.java:82)
21-Jun-2019 03:32:49         at java.lang.Thread.run(Thread.java:748)
21-Jun-2019 03:32:49 Caused by: com.mongodb.MongoQueryException: Query failed with error code 96 and error message 'collection dropped between getMore calls' on server 127.0.0.1:27017
21-Jun-2019 03:32:49         at com.mongodb.operation.QueryHelper.translateCommandException(QueryHelper.java:29)
21-Jun-2019 03:32:49         at com.mongodb.operation.QueryBatchCursor.getMore(QueryBatchCursor.java:229)
21-Jun-2019 03:32:49         at com.mongodb.operation.QueryBatchCursor.tryHasNext(QueryBatchCursor.java:193)
21-Jun-2019 03:32:49         at com.mongodb.operation.QueryBatchCursor.tryNext(QueryBatchCursor.java:177)
21-Jun-2019 03:32:49         at com.mongodb.client.internal.MongoBatchCursorAdapter.tryNext(MongoBatchCursorAdapter.java:74)
21-Jun-2019 03:32:49         at org.springframework.data.mongodb.core.messaging.CursorReadingTask.getNext(CursorReadingTask.java:230)
21-Jun-2019 03:32:49         at org.springframework.data.mongodb.core.messaging.CursorReadingTask.execute(CursorReadingTask.java:264)
21-Jun-2019 03:32:49         ... 2 common frames omitted
21-Jun-2019 03:32:49 Exception in thread "SimpleAsyncTaskExecutor-1" org.springframework.data.mongodb.UncategorizedMongoDbException: Query failed with error code 96 and error message 'collection dropped between getMore calls' on server 127.0.0.1:27017; nested exception is com.mongodb.MongoQueryException: Query failed with error code 96 and error message 'collection dropped between getMore calls' on server 127.0.0.1:27017
21-Jun-2019 03:32:49         at org.springframework.data.mongodb.core.MongoExceptionTranslator.translateExceptionIfPossible(MongoExceptionTranslator.java:138)
21-Jun-2019 03:32:49         at org.springframework.data.mongodb.core.messaging.CursorReadingTask.execute(CursorReadingTask.java:267)
21-Jun-2019 03:32:49         at org.springframework.data.mongodb.core.messaging.CursorReadingTask.run(CursorReadingTask.java:82)
21-Jun-2019 03:32:49         at java.lang.Thread.run(Thread.java:748)
21-Jun-2019 03:32:49 Caused by: com.mongodb.MongoQueryException: Query failed with error code 96 and error message 'collection dropped between getMore calls' on server 127.0.0.1:27017
21-Jun-2019 03:32:49         at com.mongodb.operation.QueryHelper.translateCommandException(QueryHelper.java:29)
21-Jun-2019 03:32:49         at com.mongodb.operation.QueryBatchCursor.getMore(QueryBatchCursor.java:229)
21-Jun-2019 03:32:49         at com.mongodb.operation.QueryBatchCursor.tryHasNext(QueryBatchCursor.java:193)
21-Jun-2019 03:32:49         at com.mongodb.operation.QueryBatchCursor.tryNext(QueryBatchCursor.java:177)
21-Jun-2019 03:32:49         at com.mongodb.client.internal.MongoBatchCursorAdapter.tryNext(MongoBatchCursorAdapter.java:74)
21-Jun-2019 03:32:49         at org.springframework.data.mongodb.core.messaging.CursorReadingTask.getNext(CursorReadingTask.java:230)
21-Jun-2019 03:32:49         at org.springframework.data.mongodb.core.messaging.CursorReadingTask.execute(CursorReadingTask.java:264)
21-Jun-2019 03:32:49         ... 2 more
21-Jun-2019 03:32:51 [WARNING] Tests run: 10, Failures: 0, Errors: 0, Skipped: 6, Time elapsed: 4.258 s - in org.springframework.data.mongodb.core.messaging.DefaultMessageListenerContainerTests
21-Jun-2019 03:32:51 [INFO] Running org.springframework.data.mongodb.core.messaging.CursorReadingTaskUnitTests
21-Jun-2019 03:32:51 [INFO] Tests run: 4, Failures: 0, Errors: 0, Skipped: 0, Time elapsed: 0.252 s - in org.springframework.data.mongodb.core.messaging.CursorReadingTaskUnitTests
21-Jun-2019 03:32:51 [INFO] Running org.springframework.data.mongodb.core.messaging.ChangeStreamTests
21-Jun-2019 03:32:51 [WARNING] Tests run: 1, Failures: 0, Errors: 0, Skipped: 1, Time elapsed: 0.004 s - in org.springframework.data.mongodb.core.messaging.ChangeStreamTests
21-Jun-2019 03:32:51 [INFO] Running org.springframework.data.mongodb.core.messaging.ChangeStreamTaskUnitTests
21-Jun-2019 03:32:51 [INFO] Tests run: 3, Failures: 0, Errors: 0, Skipped: 0, Time elapsed: 0.023 s - in org.springframework.data.mongodb.core.messaging.ChangeStreamTaskUnitTests
21-Jun-2019 03:32:51 [INFO] Running org.springframework.data.mongodb.core.messaging.TaskFactoryUnitTests
21-Jun-2019 03:32:51 [INFO] Tests run: 3, Failures: 0, Errors: 0, Skipped: 0, Time elapsed: 0.016 s - in org.springframework.data.mongodb.core.messaging.TaskFactoryUnitTests
21-Jun-2019 03:32:51 [INFO] Running org.springframework.data.mongodb.core.messaging.TailableCursorTests
21-Jun-2019 03:33:06 [INFO] Tests run: 5, Failures: 0, Errors: 0, Skipped: 0, Time elapsed: 14.293 s - in org.springframework.data.mongodb.core.messaging.TailableCursorTests
21-Jun-2019 03:33:06 [INFO] Running org.springframework.data.mongodb.core.messaging.DefaultMessageListenerContainerUnitTests
21-Jun-2019 03:33:06 [INFO] Tests run: 6, Failures: 0, Errors: 0, Skipped: 0, Time elapsed: 0.326 s - in org.springframework.data.mongodb.core.messaging.DefaultMessageListenerContainerUnitTests
21-Jun-2019 03:33:06 [INFO] Running org.springframework.data.mongodb.core.messaging.TailableCursorRequestUnitTests
21-Jun-2019 03:33:06 [INFO] Tests run: 1, Failures: 0, Errors: 0, Skipped: 0, Time elapsed: 0 s - in org.springframework.data.mongodb.core.messaging.TailableCursorRequestUnitTests
21-Jun-2019 03:33:06 [INFO] Running org.springframework.data.mongodb.core.ReactiveMongoTemplateTransactionTests
21-Jun-2019 03:33:06 [WARNING] Tests run: 1, Failures: 0, Errors: 0, Skipped: 1, Time elapsed: 0 s - in org.springframework.data.mongodb.core.ReactiveMongoTemplateTransactionTests
21-Jun-2019 03:33:06 [INFO] Running org.springframework.data.mongodb.core.ReactiveRemoveOperationExtensionsTests
21-Jun-2019 03:33:06 [INFO] Tests run: 4, Failures: 0, Errors: 0, Skipped: 0, Time elapsed: 0.45 s - in org.springframework.data.mongodb.core.ReactiveRemoveOperationExtensionsTests
21-Jun-2019 03:33:06 [INFO] Running org.springframework.data.mongodb.core.MongoAdminIntegrationTests
21-Jun-2019 03:33:06 [INFO] Tests run: 2, Failures: 0, Errors: 0, Skipped: 0, Time elapsed: 0.015 s - in org.springframework.data.mongodb.core.MongoAdminIntegrationTests
21-Jun-2019 03:33:06 [INFO] Running org.springframework.data.mongodb.core.CloseableIterableCursorAdapterUnitTests
21-Jun-2019 03:33:06 [INFO] Tests run: 3, Failures: 0, Errors: 0, Skipped: 0, Time elapsed: 0.016 s - in org.springframework.data.mongodb.core.CloseableIterableCursorAdapterUnitTests
21-Jun-2019 03:33:06 [INFO] Running org.springframework.data.mongodb.core.mapreduce.MapReduceCountsUnitTests
21-Jun-2019 03:33:06 [INFO] Tests run: 2, Failures: 0, Errors: 0, Skipped: 0, Time elapsed: 0.003 s - in org.springframework.data.mongodb.core.mapreduce.MapReduceCountsUnitTests
21-Jun-2019 03:33:06 [INFO] Running org.springframework.data.mongodb.core.mapreduce.ReactiveMapReduceTests
21-Jun-2019 03:33:07 [INFO] Tests run: 8, Failures: 0, Errors: 0, Skipped: 0, Time elapsed: 0.717 s - in org.springframework.data.mongodb.core.mapreduce.ReactiveMapReduceTests
21-Jun-2019 03:33:07 [INFO] Running org.springframework.data.mongodb.core.mapreduce.MapReduceTests
21-Jun-2019 03:33:08 [WARNING] Tests run: 10, Failures: 0, Errors: 0, Skipped: 1, Time elapsed: 1.058 s - in org.springframework.data.mongodb.core.mapreduce.MapReduceTests
21-Jun-2019 03:33:08 [INFO] Running org.springframework.data.mongodb.core.mapreduce.MapReduceOptionsTests
21-Jun-2019 03:33:08 [INFO] Tests run: 3, Failures: 0, Errors: 0, Skipped: 0, Time elapsed: 0.002 s - in org.springframework.data.mongodb.core.mapreduce.MapReduceOptionsTests
21-Jun-2019 03:33:08 [INFO] Running org.springframework.data.mongodb.core.mapreduce.GroupByTests
21-Jun-2019 03:33:08 [INFO] Tests run: 7, Failures: 0, Errors: 0, Skipped: 0, Time elapsed: 0.189 s - in org.springframework.data.mongodb.core.mapreduce.GroupByTests
21-Jun-2019 03:33:08 [INFO] Running org.springframework.data.mongodb.core.mapreduce.MapReduceResultsUnitTests
21-Jun-2019 03:33:08 [INFO] Tests run: 4, Failures: 0, Errors: 0, Skipped: 0, Time elapsed: 0.001 s - in org.springframework.data.mongodb.core.mapreduce.MapReduceResultsUnitTests
21-Jun-2019 03:33:08 [INFO] Running org.springframework.data.mongodb.core.ReactiveMongoOperationsExtensionsTests
21-Jun-2019 03:33:09 [INFO] Tests run: 60, Failures: 0, Errors: 0, Skipped: 0, Time elapsed: 0.813 s - in org.springframework.data.mongodb.core.ReactiveMongoOperationsExtensionsTests
21-Jun-2019 03:33:09 [INFO] Running org.springframework.data.mongodb.core.ChangeStreamOptionsUnitTests
21-Jun-2019 03:33:09 [INFO] Tests run: 3, Failures: 0, Errors: 0, Skipped: 0, Time elapsed: 0 s - in org.springframework.data.mongodb.core.ChangeStreamOptionsUnitTests
21-Jun-2019 03:33:09 [INFO] Running org.springframework.data.mongodb.core.EntityOperationUnitTests
21-Jun-2019 03:33:09 [INFO] Tests run: 1, Failures: 0, Errors: 0, Skipped: 0, Time elapsed: 0.009 s - in org.springframework.data.mongodb.core.EntityOperationUnitTests
21-Jun-2019 03:33:09 [INFO] Running org.springframework.data.mongodb.core.ExecutableRemoveOperationExtensionsTests
21-Jun-2019 03:33:10 [INFO] Tests run: 2, Failures: 0, Errors: 0, Skipped: 0, Time elapsed: 0.314 s - in org.springframework.data.mongodb.core.ExecutableRemoveOperationExtensionsTests
21-Jun-2019 03:33:10 [INFO] Running org.springframework.data.mongodb.core.validation.CriteriaValidatorUnitTests
21-Jun-2019 03:33:10 [INFO] Tests run: 2, Failures: 0, Errors: 0, Skipped: 0, Time elapsed: 0.001 s - in org.springframework.data.mongodb.core.validation.CriteriaValidatorUnitTests
21-Jun-2019 03:33:10 [INFO] Running org.springframework.data.mongodb.core.SimpleMongoDbFactoryUnitTests
21-Jun-2019 03:33:10 [INFO] Tests run: 5, Failures: 0, Errors: 0, Skipped: 0, Time elapsed: 0.019 s - in org.springframework.data.mongodb.core.SimpleMongoDbFactoryUnitTests
21-Jun-2019 03:33:10 [INFO] Running org.springframework.data.mongodb.core.DefaultBulkOperationsIntegrationTests
21-Jun-2019 03:33:10 [INFO] Tests run: 22, Failures: 0, Errors: 0, Skipped: 0, Time elapsed: 0.04 s - in org.springframework.data.mongodb.core.DefaultBulkOperationsIntegrationTests
21-Jun-2019 03:33:10 [INFO] Running org.springframework.data.mongodb.core.ExecutableAggregationOperationExtensionsTests
21-Jun-2019 03:33:10 [INFO] Tests run: 2, Failures: 0, Errors: 0, Skipped: 0, Time elapsed: 0.253 s - in org.springframework.data.mongodb.core.ExecutableAggregationOperationExtensionsTests
21-Jun-2019 03:33:10 [INFO] Running org.springframework.data.mongodb.core.MongoTemplateDbRefTests
21-Jun-2019 03:33:11 [INFO] Tests run: 7, Failures: 0, Errors: 0, Skipped: 0, Time elapsed: 0.637 s - in org.springframework.data.mongodb.core.MongoTemplateDbRefTests
21-Jun-2019 03:33:11 [INFO] Running org.springframework.data.mongodb.core.ReactiveMongoTemplateTests
21-Jun-2019 03:33:15 [WARNING] Tests run: 80, Failures: 0, Errors: 0, Skipped: 8, Time elapsed: 4.017 s - in org.springframework.data.mongodb.core.ReactiveMongoTemplateTests
21-Jun-2019 03:33:15 [INFO] Running org.springframework.data.mongodb.core.MongoTemplateValidationTests
21-Jun-2019 03:33:17 [INFO] Tests run: 9, Failures: 0, Errors: 0, Skipped: 0, Time elapsed: 2.271 s - in org.springframework.data.mongodb.core.MongoTemplateValidationTests
21-Jun-2019 03:33:17 [INFO] Running org.springframework.data.mongodb.core.ReactiveMongoTemplateIndexTests
21-Jun-2019 03:33:17 [INFO] Tests run: 5, Failures: 0, Errors: 0, Skipped: 0, Time elapsed: 0.338 s - in org.springframework.data.mongodb.core.ReactiveMongoTemplateIndexTests
21-Jun-2019 03:33:17 [INFO] Running org.springframework.data.mongodb.core.UnwrapAndReadDocumentCallbackUnitTests
21-Jun-2019 03:33:17 [INFO] Tests run: 4, Failures: 0, Errors: 0, Skipped: 0, Time elapsed: 0.024 s - in org.springframework.data.mongodb.core.UnwrapAndReadDocumentCallbackUnitTests
21-Jun-2019 03:33:17 [INFO] Running org.springframework.data.mongodb.core.QueryCursorPreparerUnitTests
21-Jun-2019 03:33:17 [INFO] Tests run: 9, Failures: 0, Errors: 0, Skipped: 0, Time elapsed: 0.023 s - in org.springframework.data.mongodb.core.QueryCursorPreparerUnitTests
21-Jun-2019 03:33:17 [INFO] Running org.springframework.data.mongodb.core.mapping.MappingTests
21-Jun-2019 03:33:19 [INFO] Tests run: 24, Failures: 0, Errors: 0, Skipped: 0, Time elapsed: 1.855 s - in org.springframework.data.mongodb.core.mapping.MappingTests
21-Jun-2019 03:33:19 [INFO] Running org.springframework.data.mongodb.core.mapping.MongoMappingContextUnitTests
21-Jun-2019 03:33:19 [INFO] Tests run: 12, Failures: 0, Errors: 0, Skipped: 0, Time elapsed: 0.09 s - in org.springframework.data.mongodb.core.mapping.MongoMappingContextUnitTests
21-Jun-2019 03:33:19 [INFO] Running org.springframework.data.mongodb.core.mapping.event.AbstractMongoEventListenerUnitTests
21-Jun-2019 03:33:19 [INFO] Tests run: 11, Failures: 0, Errors: 0, Skipped: 0, Time elapsed: 0.006 s - in org.springframework.data.mongodb.core.mapping.event.AbstractMongoEventListenerUnitTests
21-Jun-2019 03:33:19 [INFO] Running org.springframework.data.mongodb.core.mapping.event.ApplicationContextEventTests
21-Jun-2019 03:33:21 [INFO] Tests run: 12, Failures: 0, Errors: 0, Skipped: 0, Time elapsed: 1.346 s - in org.springframework.data.mongodb.core.mapping.event.ApplicationContextEventTests
21-Jun-2019 03:33:21 [INFO] Running org.springframework.data.mongodb.core.mapping.event.AuditingEventListenerUnitTests
21-Jun-2019 03:33:21 [INFO] Tests run: 5, Failures: 0, Errors: 0, Skipped: 0, Time elapsed: 0.03 s - in org.springframework.data.mongodb.core.mapping.event.AuditingEventListenerUnitTests
21-Jun-2019 03:33:21 [INFO] Running org.springframework.data.mongodb.core.mapping.event.LoggingEventListenerTests
21-Jun-2019 03:33:21 [INFO] Tests run: 5, Failures: 0, Errors: 0, Skipped: 0, Time elapsed: 0.006 s - in org.springframework.data.mongodb.core.mapping.event.LoggingEventListenerTests
21-Jun-2019 03:33:21 [INFO] Running org.springframework.data.mongodb.core.mapping.event.ValidatingMongoEventListenerTests
21-Jun-2019 03:33:23 [INFO] Tests run: 2, Failures: 0, Errors: 0, Skipped: 0, Time elapsed: 2.106 s - in org.springframework.data.mongodb.core.mapping.event.ValidatingMongoEventListenerTests
21-Jun-2019 03:33:23 [INFO] Running org.springframework.data.mongodb.core.mapping.event.AuditingEntityCallbackUnitTests
21-Jun-2019 03:33:23 [INFO] Tests run: 5, Failures: 0, Errors: 0, Skipped: 0, Time elapsed: 0.011 s - in org.springframework.data.mongodb.core.mapping.event.AuditingEntityCallbackUnitTests
21-Jun-2019 03:33:23 [INFO] Running org.springframework.data.mongodb.core.mapping.GeoIndexedTests
21-Jun-2019 03:33:23 [INFO] Tests run: 1, Failures: 0, Errors: 0, Skipped: 0, Time elapsed: 0.137 s - in org.springframework.data.mongodb.core.mapping.GeoIndexedTests
21-Jun-2019 03:33:23 [INFO] Running org.springframework.data.mongodb.core.mapping.MongoPersistentPropertyComparatorUnitTests
21-Jun-2019 03:33:23 [INFO] Tests run: 1, Failures: 0, Errors: 0, Skipped: 0, Time elapsed: 0 s - in org.springframework.data.mongodb.core.mapping.MongoPersistentPropertyComparatorUnitTests
21-Jun-2019 03:33:23 [INFO] Running org.springframework.data.mongodb.core.mapping.BasicMongoPersistentPropertyUnitTests
21-Jun-2019 03:33:23 [INFO] Tests run: 20, Failures: 0, Errors: 0, Skipped: 0, Time elapsed: 0.02 s - in org.springframework.data.mongodb.core.mapping.BasicMongoPersistentPropertyUnitTests
21-Jun-2019 03:33:23 [INFO] Running org.springframework.data.mongodb.core.mapping.BasicMongoPersistentEntityUnitTests
21-Jun-2019 03:33:23 [INFO] Tests run: 16, Failures: 0, Errors: 0, Skipped: 0, Time elapsed: 0.034 s - in org.springframework.data.mongodb.core.mapping.BasicMongoPersistentEntityUnitTests
21-Jun-2019 03:33:23 [INFO] Running org.springframework.data.mongodb.core.mapping.GenericMappingTests
21-Jun-2019 03:33:23 [INFO] Tests run: 2, Failures: 0, Errors: 0, Skipped: 0, Time elapsed: 0.013 s - in org.springframework.data.mongodb.core.mapping.GenericMappingTests
21-Jun-2019 03:33:23 [INFO] Running org.springframework.data.mongodb.core.ExecutableInsertOperationSupportUnitTests
21-Jun-2019 03:33:23 [INFO] Tests run: 7, Failures: 0, Errors: 0, Skipped: 0, Time elapsed: 0.015 s - in org.springframework.data.mongodb.core.ExecutableInsertOperationSupportUnitTests
21-Jun-2019 03:33:23 [INFO] Running org.springframework.data.mongodb.core.ExecutableUpdateOperationExtensionsTests
21-Jun-2019 03:33:23 [INFO] Tests run: 2, Failures: 0, Errors: 0, Skipped: 0, Time elapsed: 0.345 s - in org.springframework.data.mongodb.core.ExecutableUpdateOperationExtensionsTests
21-Jun-2019 03:33:23 [INFO] Running org.springframework.data.mongodb.core.ReactiveAggregationOperationSupportUnitTests
21-Jun-2019 03:33:23 [INFO] Tests run: 7, Failures: 0, Errors: 0, Skipped: 0, Time elapsed: 0.155 s - in org.springframework.data.mongodb.core.ReactiveAggregationOperationSupportUnitTests
21-Jun-2019 03:33:23 [INFO] Running org.springframework.data.mongodb.core.GeoCommandStatisticsUnitTests
21-Jun-2019 03:33:23 [INFO] Tests run: 3, Failures: 0, Errors: 0, Skipped: 0, Time elapsed: 0 s - in org.springframework.data.mongodb.core.GeoCommandStatisticsUnitTests
21-Jun-2019 03:33:23 [INFO] Running org.springframework.data.mongodb.core.MongoTemplateTransactionTests
21-Jun-2019 03:33:23 [WARNING] Tests run: 1, Failures: 0, Errors: 0, Skipped: 1, Time elapsed: 0.014 s - in org.springframework.data.mongodb.core.MongoTemplateTransactionTests
21-Jun-2019 03:33:23 [INFO] Running org.springframework.data.mongodb.core.SessionBoundMongoTemplateTests
21-Jun-2019 03:33:23 [WARNING] Tests run: 1, Failures: 0, Errors: 0, Skipped: 1, Time elapsed: 0.002 s - in org.springframework.data.mongodb.core.SessionBoundMongoTemplateTests
21-Jun-2019 03:33:23 [INFO] Running org.springframework.data.mongodb.core.MongoExceptionTranslatorUnitTests
21-Jun-2019 03:33:23 [INFO] Tests run: 11, Failures: 0, Errors: 0, Skipped: 0, Time elapsed: 0.004 s - in org.springframework.data.mongodb.core.MongoExceptionTranslatorUnitTests
21-Jun-2019 03:33:23 [INFO] Running org.springframework.data.mongodb.core.DefaultBulkOperationsUnitTests
21-Jun-2019 03:33:23 [INFO] Tests run: 11, Failures: 0, Errors: 0, Skipped: 0, Time elapsed: 0.06 s - in org.springframework.data.mongodb.core.DefaultBulkOperationsUnitTests
21-Jun-2019 03:33:23 [INFO] Running org.springframework.data.mongodb.core.QueryByExampleTests
21-Jun-2019 03:33:24 [INFO] Tests run: 10, Failures: 0, Errors: 0, Skipped: 0, Time elapsed: 0.094 s - in org.springframework.data.mongodb.core.QueryByExampleTests
21-Jun-2019 03:33:24 [INFO] Running org.springframework.data.mongodb.core.SimpleReactiveMongoDatabaseFactoryUnitTests
21-Jun-2019 03:33:24 [INFO] Tests run: 2, Failures: 0, Errors: 0, Skipped: 0, Time elapsed: 0.001 s - in org.springframework.data.mongodb.core.SimpleReactiveMongoDatabaseFactoryUnitTests
21-Jun-2019 03:33:24 [INFO] Running org.springframework.data.mongodb.core.spel.ExpressionNodeUnitTests
21-Jun-2019 03:33:24 [INFO] Tests run: 1, Failures: 0, Errors: 0, Skipped: 0, Time elapsed: 0.078 s - in org.springframework.data.mongodb.core.spel.ExpressionNodeUnitTests
21-Jun-2019 03:33:24 [INFO] Running org.springframework.data.mongodb.core.ExecutableAggregationOperationSupportUnitTests
21-Jun-2019 03:33:24 [INFO] Tests run: 10, Failures: 0, Errors: 0, Skipped: 0, Time elapsed: 0.008 s - in org.springframework.data.mongodb.core.ExecutableAggregationOperationSupportUnitTests
21-Jun-2019 03:33:24 [INFO] Running org.springframework.data.mongodb.core.ReactiveFindOperationSupportTests
21-Jun-2019 03:33:26 [INFO] Tests run: 43, Failures: 0, Errors: 0, Skipped: 0, Time elapsed: 2.627 s - in org.springframework.data.mongodb.core.ReactiveFindOperationSupportTests
21-Jun-2019 03:33:26 [INFO] Running org.springframework.data.mongodb.core.convert.GeoConvertersUnitTests
21-Jun-2019 03:33:26 [INFO] Tests run: 11, Failures: 0, Errors: 0, Skipped: 0, Time elapsed: 0.006 s - in org.springframework.data.mongodb.core.convert.GeoConvertersUnitTests
21-Jun-2019 03:33:26 [INFO] Running org.springframework.data.mongodb.core.convert.CustomConvertersUnitTests
21-Jun-2019 03:33:26 [INFO] Tests run: 5, Failures: 0, Errors: 0, Skipped: 0, Time elapsed: 0.023 s - in org.springframework.data.mongodb.core.convert.CustomConvertersUnitTests
21-Jun-2019 03:33:26 [INFO] Running org.springframework.data.mongodb.core.convert.GeoJsonConverterUnitTests
21-Jun-2019 03:33:26 [INFO] Tests run: 27, Failures: 0, Errors: 0, Skipped: 0, Time elapsed: 0.007 s - in org.springframework.data.mongodb.core.convert.GeoJsonConverterUnitTests
21-Jun-2019 03:33:26 [INFO] Running org.springframework.data.mongodb.core.convert.GeoJsonConverterUnitTests$DocumentToGeoJsonMultiPointConverterUnitTests
21-Jun-2019 03:33:26 [INFO] Tests run: 3, Failures: 0, Errors: 0, Skipped: 0, Time elapsed: 0.002 s - in org.springframework.data.mongodb.core.convert.GeoJsonConverterUnitTests$DocumentToGeoJsonMultiPointConverterUnitTests
21-Jun-2019 03:33:26 [INFO] Running org.springframework.data.mongodb.core.convert.GeoJsonConverterUnitTests$DocumentToGeoJsonMultiLineStringConverterUnitTests
21-Jun-2019 03:33:26 [INFO] Tests run: 3, Failures: 0, Errors: 0, Skipped: 0, Time elapsed: 0.001 s - in org.springframework.data.mongodb.core.convert.GeoJsonConverterUnitTests$DocumentToGeoJsonMultiLineStringConverterUnitTests
21-Jun-2019 03:33:26 [INFO] Running org.springframework.data.mongodb.core.convert.LazyLoadingInterceptorUnitTests
21-Jun-2019 03:33:26 [INFO] Tests run: 1, Failures: 0, Errors: 0, Skipped: 0, Time elapsed: 0.007 s - in org.springframework.data.mongodb.core.convert.LazyLoadingInterceptorUnitTests
21-Jun-2019 03:33:26 [INFO] Running org.springframework.data.mongodb.core.convert.GeoJsonConverterUnitTests$DocumentToGeoJsonPointConverterUnitTests
21-Jun-2019 03:33:26 [INFO] Tests run: 3, Failures: 0, Errors: 0, Skipped: 0, Time elapsed: 0 s - in org.springframework.data.mongodb.core.convert.GeoJsonConverterUnitTests$DocumentToGeoJsonPointConverterUnitTests
21-Jun-2019 03:33:26 [INFO] Running org.springframework.data.mongodb.core.convert.DbRefMappingMongoConverterUnitTests
21-Jun-2019 03:33:27 [INFO] Tests run: 25, Failures: 0, Errors: 0, Skipped: 0, Time elapsed: 0.234 s - in org.springframework.data.mongodb.core.convert.DbRefMappingMongoConverterUnitTests
21-Jun-2019 03:33:27 [INFO] Running org.springframework.data.mongodb.core.convert.NamedMongoScriptConvertsUnitTests$NamedMongoScriptToDocumentConverterUnitTests
21-Jun-2019 03:33:27 [INFO] Tests run: 3, Failures: 0, Errors: 0, Skipped: 0, Time elapsed: 0.001 s - in org.springframework.data.mongodb.core.convert.NamedMongoScriptConvertsUnitTests$NamedMongoScriptToDocumentConverterUnitTests
21-Jun-2019 03:33:27 [INFO] Running org.springframework.data.mongodb.core.convert.QueryMapperUnitTests
21-Jun-2019 03:33:27 [INFO] Tests run: 64, Failures: 0, Errors: 0, Skipped: 0, Time elapsed: 0.203 s - in org.springframework.data.mongodb.core.convert.QueryMapperUnitTests
21-Jun-2019 03:33:27 [INFO] Running org.springframework.data.mongodb.core.convert.GeoJsonConverterUnitTests$DocumentToGeoJsonLineStringConverterUnitTests
21-Jun-2019 03:33:27 [INFO] Tests run: 3, Failures: 0, Errors: 0, Skipped: 0, Time elapsed: 0 s - in org.springframework.data.mongodb.core.convert.GeoJsonConverterUnitTests$DocumentToGeoJsonLineStringConverterUnitTests
21-Jun-2019 03:33:27 [INFO] Running org.springframework.data.mongodb.core.convert.MappingMongoConverterUnitTests
21-Jun-2019 03:33:27 [WARNING] Tests run: 131, Failures: 0, Errors: 0, Skipped: 3, Time elapsed: 0.479 s - in org.springframework.data.mongodb.core.convert.MappingMongoConverterUnitTests
21-Jun-2019 03:33:27 [INFO] Running org.springframework.data.mongodb.core.convert.NamedMongoScriptConvertsUnitTests$DocumentToNamedMongoScriptConverterUnitTests
21-Jun-2019 03:33:27 [INFO] Tests run: 3, Failures: 0, Errors: 0, Skipped: 0, Time elapsed: 0.001 s - in org.springframework.data.mongodb.core.convert.NamedMongoScriptConvertsUnitTests$DocumentToNamedMongoScriptConverterUnitTests
21-Jun-2019 03:33:27 [INFO] Running org.springframework.data.mongodb.core.convert.ObjectPathUnitTests
21-Jun-2019 03:33:27 [INFO] Tests run: 6, Failures: 0, Errors: 0, Skipped: 0, Time elapsed: 0.04 s - in org.springframework.data.mongodb.core.convert.ObjectPathUnitTests
21-Jun-2019 03:33:27 [INFO] Running org.springframework.data.mongodb.core.convert.AbstractMongoConverterUnitTests
21-Jun-2019 03:33:27 [INFO] Tests run: 1, Failures: 0, Errors: 0, Skipped: 0, Time elapsed: 0.03 s - in org.springframework.data.mongodb.core.convert.AbstractMongoConverterUnitTests
21-Jun-2019 03:33:27 [INFO] Running org.springframework.data.mongodb.core.convert.MongoExampleMapperUnitTests
21-Jun-2019 03:33:27 [INFO] Tests run: 27, Failures: 0, Errors: 0, Skipped: 0, Time elapsed: 0.085 s - in org.springframework.data.mongodb.core.convert.MongoExampleMapperUnitTests
21-Jun-2019 03:33:27 [INFO] Running org.springframework.data.mongodb.core.convert.DefaultMongoTypeMapperUnitTests
21-Jun-2019 03:33:27 [INFO] Tests run: 17, Failures: 0, Errors: 0, Skipped: 0, Time elapsed: 0.005 s - in org.springframework.data.mongodb.core.convert.DefaultMongoTypeMapperUnitTests
21-Jun-2019 03:33:27 [INFO] Running org.springframework.data.mongodb.core.convert.UpdateMapperUnitTests
21-Jun-2019 03:33:28 [INFO] Tests run: 72, Failures: 0, Errors: 0, Skipped: 0, Time elapsed: 0.18 s - in org.springframework.data.mongodb.core.convert.UpdateMapperUnitTests
21-Jun-2019 03:33:28 [INFO] Running org.springframework.data.mongodb.core.convert.GeoJsonConverterUnitTests$DocumentToGeoJsonMultiPolygonConverterUnitTests
21-Jun-2019 03:33:28 [INFO] Tests run: 3, Failures: 0, Errors: 0, Skipped: 0, Time elapsed: 0 s - in org.springframework.data.mongodb.core.convert.GeoJsonConverterUnitTests$DocumentToGeoJsonMultiPolygonConverterUnitTests
21-Jun-2019 03:33:28 [INFO] Running org.springframework.data.mongodb.core.convert.MappingMongoConverterTests
21-Jun-2019 03:33:28 [INFO] Tests run: 2, Failures: 0, Errors: 0, Skipped: 0, Time elapsed: 0.092 s - in org.springframework.data.mongodb.core.convert.MappingMongoConverterTests
21-Jun-2019 03:33:28 [INFO] Running org.springframework.data.mongodb.core.convert.GeoJsonConverterUnitTests$DocumentToGeoJsonPolygonConverterUnitTests
21-Jun-2019 03:33:28 [INFO] Tests run: 4, Failures: 0, Errors: 0, Skipped: 0, Time elapsed: 0 s - in org.springframework.data.mongodb.core.convert.GeoJsonConverterUnitTests$DocumentToGeoJsonPolygonConverterUnitTests
21-Jun-2019 03:33:28 [INFO] Running org.springframework.data.mongodb.core.convert.MongoConvertersIntegrationTests
21-Jun-2019 03:33:28 [INFO] Tests run: 4, Failures: 0, Errors: 0, Skipped: 0, Time elapsed: 0.183 s - in org.springframework.data.mongodb.core.convert.MongoConvertersIntegrationTests
21-Jun-2019 03:33:28 [INFO] Running org.springframework.data.mongodb.core.convert.NamedMongoScriptConvertsUnitTests
21-Jun-2019 03:33:28 [INFO] Tests run: 6, Failures: 0, Errors: 0, Skipped: 0, Time elapsed: 0.003 s - in org.springframework.data.mongodb.core.convert.NamedMongoScriptConvertsUnitTests
21-Jun-2019 03:33:28 [INFO] Running org.springframework.data.mongodb.core.convert.DefaultDbRefResolverUnitTests
21-Jun-2019 03:33:28 [INFO] Tests run: 5, Failures: 0, Errors: 0, Skipped: 0, Time elapsed: 0.007 s - in org.springframework.data.mongodb.core.convert.DefaultDbRefResolverUnitTests
21-Jun-2019 03:33:28 [INFO] Running org.springframework.data.mongodb.core.convert.GeoJsonConverterUnitTests$GeoJsonToDocumentConverterUnitTests
21-Jun-2019 03:33:28 [INFO] Tests run: 8, Failures: 0, Errors: 0, Skipped: 0, Time elapsed: 0.003 s - in org.springframework.data.mongodb.core.convert.GeoJsonConverterUnitTests$GeoJsonToDocumentConverterUnitTests
21-Jun-2019 03:33:28 [INFO] Running org.springframework.data.mongodb.core.convert.DocumentAccessorUnitTests
21-Jun-2019 03:33:28 [INFO] Tests run: 7, Failures: 0, Errors: 0, Skipped: 0, Time elapsed: 0.006 s - in org.springframework.data.mongodb.core.convert.DocumentAccessorUnitTests
21-Jun-2019 03:33:28 [INFO] Running org.springframework.data.mongodb.core.convert.DataMongo273Tests
21-Jun-2019 03:33:28 [WARNING] Tests run: 3, Failures: 0, Errors: 0, Skipped: 1, Time elapsed: 0.015 s - in org.springframework.data.mongodb.core.convert.DataMongo273Tests
21-Jun-2019 03:33:28 [INFO] Running org.springframework.data.mongodb.core.convert.NumberToNumberConverterFactoryUnitTests
21-Jun-2019 03:33:28 [INFO] Tests run: 5, Failures: 0, Errors: 0, Skipped: 0, Time elapsed: 0.01 s - in org.springframework.data.mongodb.core.convert.NumberToNumberConverterFactoryUnitTests
21-Jun-2019 03:33:28 [INFO] Running org.springframework.data.mongodb.core.convert.MongoJsonSchemaMapperUnitTests
21-Jun-2019 03:33:28 [INFO] Tests run: 9, Failures: 0, Errors: 0, Skipped: 0, Time elapsed: 0.015 s - in org.springframework.data.mongodb.core.convert.MongoJsonSchemaMapperUnitTests
21-Jun-2019 03:33:28 [INFO] Running org.springframework.data.mongodb.core.convert.TermToStringConverterUnitTests
21-Jun-2019 03:33:28 [INFO] Tests run: 2, Failures: 0, Errors: 0, Skipped: 0, Time elapsed: 0.008 s - in org.springframework.data.mongodb.core.convert.TermToStringConverterUnitTests
21-Jun-2019 03:33:28 [INFO] Running org.springframework.data.mongodb.core.convert.MongoConvertersUnitTests
21-Jun-2019 03:33:28 [INFO] Tests run: 14, Failures: 0, Errors: 0, Skipped: 0, Time elapsed: 0.008 s - in org.springframework.data.mongodb.core.convert.MongoConvertersUnitTests
21-Jun-2019 03:33:28 [INFO] Running org.springframework.data.mongodb.core.NoExplicitIdTests
21-Jun-2019 03:33:30 [INFO] Tests run: 3, Failures: 0, Errors: 0, Skipped: 0, Time elapsed: 2.252 s - in org.springframework.data.mongodb.core.NoExplicitIdTests
21-Jun-2019 03:33:30 [INFO] Running org.springframework.data.mongodb.core.ReactiveAggregationOperationExtensionsTests
21-Jun-2019 03:33:31 [INFO] Tests run: 3, Failures: 0, Errors: 0, Skipped: 0, Time elapsed: 0.428 s - in org.springframework.data.mongodb.core.ReactiveAggregationOperationExtensionsTests
21-Jun-2019 03:33:31 [INFO] Running org.springframework.data.mongodb.core.aggregation.GraphLookupOperationUnitTests
21-Jun-2019 03:33:31 [INFO] Tests run: 10, Failures: 0, Errors: 0, Skipped: 0, Time elapsed: 0.007 s - in org.springframework.data.mongodb.core.aggregation.GraphLookupOperationUnitTests
21-Jun-2019 03:33:31 [INFO] Running org.springframework.data.mongodb.core.aggregation.FacetOperationUnitTests
21-Jun-2019 03:33:31 [INFO] Tests run: 5, Failures: 0, Errors: 0, Skipped: 0, Time elapsed: 0.011 s - in org.springframework.data.mongodb.core.aggregation.FacetOperationUnitTests
21-Jun-2019 03:33:31 [INFO] Running org.springframework.data.mongodb.core.aggregation.UnwindOperationUnitTests
21-Jun-2019 03:33:31 [INFO] Tests run: 7, Failures: 0, Errors: 0, Skipped: 0, Time elapsed: 0.003 s - in org.springframework.data.mongodb.core.aggregation.UnwindOperationUnitTests
21-Jun-2019 03:33:31 [INFO] Running org.springframework.data.mongodb.core.aggregation.LookupOperationUnitTests
21-Jun-2019 03:33:31 [INFO] Tests run: 12, Failures: 0, Errors: 0, Skipped: 0, Time elapsed: 0.004 s - in org.springframework.data.mongodb.core.aggregation.LookupOperationUnitTests
21-Jun-2019 03:33:31 [INFO] Running org.springframework.data.mongodb.core.aggregation.CountOperationUnitTests
21-Jun-2019 03:33:31 [INFO] Tests run: 3, Failures: 0, Errors: 0, Skipped: 0, Time elapsed: 0 s - in org.springframework.data.mongodb.core.aggregation.CountOperationUnitTests
21-Jun-2019 03:33:31 [INFO] Running org.springframework.data.mongodb.core.aggregation.ReactiveAggregationUnitTests
21-Jun-2019 03:33:31 [INFO] Tests run: 8, Failures: 0, Errors: 0, Skipped: 0, Time elapsed: 0.035 s - in org.springframework.data.mongodb.core.aggregation.ReactiveAggregationUnitTests
21-Jun-2019 03:33:31 [INFO] Running org.springframework.data.mongodb.core.aggregation.GroupOperationUnitTests
21-Jun-2019 03:33:31 [INFO] Tests run: 18, Failures: 0, Errors: 0, Skipped: 0, Time elapsed: 0.011 s - in org.springframework.data.mongodb.core.aggregation.GroupOperationUnitTests
21-Jun-2019 03:33:31 [INFO] Running org.springframework.data.mongodb.core.aggregation.SpelExpressionTransformerUnitTests
21-Jun-2019 03:33:31 [WARNING] Tests run: 154, Failures: 0, Errors: 0, Skipped: 4, Time elapsed: 0.085 s - in org.springframework.data.mongodb.core.aggregation.SpelExpressionTransformerUnitTests
21-Jun-2019 03:33:31 [INFO] Running org.springframework.data.mongodb.core.aggregation.TypeBasedAggregationOperationContextUnitTests
21-Jun-2019 03:33:31 [INFO] Tests run: 19, Failures: 0, Errors: 0, Skipped: 0, Time elapsed: 0.039 s - in org.springframework.data.mongodb.core.aggregation.TypeBasedAggregationOperationContextUnitTests
21-Jun-2019 03:33:31 [INFO] Running org.springframework.data.mongodb.core.aggregation.AggregationOptionsTests
21-Jun-2019 03:33:31 [INFO] Tests run: 3, Failures: 0, Errors: 0, Skipped: 0, Time elapsed: 0 s - in org.springframework.data.mongodb.core.aggregation.AggregationOptionsTests
21-Jun-2019 03:33:31 [INFO] Running org.springframework.data.mongodb.core.aggregation.CondExpressionUnitTests
21-Jun-2019 03:33:31 [INFO] Tests run: 9, Failures: 0, Errors: 0, Skipped: 0, Time elapsed: 0.002 s - in org.springframework.data.mongodb.core.aggregation.CondExpressionUnitTests
21-Jun-2019 03:33:31 [INFO] Running org.springframework.data.mongodb.core.aggregation.AggregationUnitTests
21-Jun-2019 03:33:31 [INFO] Tests run: 37, Failures: 0, Errors: 0, Skipped: 0, Time elapsed: 0.016 s - in org.springframework.data.mongodb.core.aggregation.AggregationUnitTests
21-Jun-2019 03:33:31 [INFO] Running org.springframework.data.mongodb.core.aggregation.ObjectOperatorsUnitTests
21-Jun-2019 03:33:31 [INFO] Tests run: 9, Failures: 0, Errors: 0, Skipped: 0, Time elapsed: 0.005 s - in org.springframework.data.mongodb.core.aggregation.ObjectOperatorsUnitTests
21-Jun-2019 03:33:31 [INFO] Running org.springframework.data.mongodb.core.aggregation.BucketOperationUnitTests
21-Jun-2019 03:33:31 [INFO] Tests run: 18, Failures: 0, Errors: 0, Skipped: 0, Time elapsed: 0.007 s - in org.springframework.data.mongodb.core.aggregation.BucketOperationUnitTests
21-Jun-2019 03:33:31 [INFO] Running org.springframework.data.mongodb.core.aggregation.ProjectionOperationUnitTests
21-Jun-2019 03:33:31 [INFO] Tests run: 190, Failures: 0, Errors: 0, Skipped: 0, Time elapsed: 0.111 s - in org.springframework.data.mongodb.core.aggregation.ProjectionOperationUnitTests
21-Jun-2019 03:33:31 [INFO] Running org.springframework.data.mongodb.core.aggregation.SampleOperationUnitTests
21-Jun-2019 03:33:31 [INFO] Tests run: 3, Failures: 0, Errors: 0, Skipped: 0, Time elapsed: 0 s - in org.springframework.data.mongodb.core.aggregation.SampleOperationUnitTests
21-Jun-2019 03:33:31 [INFO] Running org.springframework.data.mongodb.core.aggregation.SpelExpressionTransformerIntegrationTests
21-Jun-2019 03:33:31 [INFO] Tests run: 2, Failures: 0, Errors: 0, Skipped: 0, Time elapsed: 0.009 s - in org.springframework.data.mongodb.core.aggregation.SpelExpressionTransformerIntegrationTests
21-Jun-2019 03:33:31 [INFO] Running org.springframework.data.mongodb.core.aggregation.StringOperatorsUnitTests
21-Jun-2019 03:33:31 [INFO] Tests run: 16, Failures: 0, Errors: 0, Skipped: 0, Time elapsed: 0.006 s - in org.springframework.data.mongodb.core.aggregation.StringOperatorsUnitTests
21-Jun-2019 03:33:31 [INFO] Running org.springframework.data.mongodb.core.aggregation.AggregationTests
21-Jun-2019 03:33:39 [INFO] Tests run: 62, Failures: 0, Errors: 0, Skipped: 0, Time elapsed: 8.16 s - in org.springframework.data.mongodb.core.aggregation.AggregationTests
21-Jun-2019 03:33:39 [INFO] Running org.springframework.data.mongodb.core.aggregation.FilterExpressionUnitTests
21-Jun-2019 03:33:39 [INFO] Tests run: 3, Failures: 0, Errors: 0, Skipped: 0, Time elapsed: 0.004 s - in org.springframework.data.mongodb.core.aggregation.FilterExpressionUnitTests
21-Jun-2019 03:33:39 [INFO] Running org.springframework.data.mongodb.core.aggregation.GeoNearOperationUnitTests
21-Jun-2019 03:33:39 [INFO] Tests run: 12, Failures: 0, Errors: 0, Skipped: 0, Time elapsed: 0.006 s - in org.springframework.data.mongodb.core.aggregation.GeoNearOperationUnitTests
21-Jun-2019 03:33:39 [INFO] Running org.springframework.data.mongodb.core.aggregation.FieldsUnitTests
21-Jun-2019 03:33:39 [INFO] Tests run: 14, Failures: 0, Errors: 0, Skipped: 0, Time elapsed: 0.005 s - in org.springframework.data.mongodb.core.aggregation.FieldsUnitTests
21-Jun-2019 03:33:39 [INFO] Running org.springframework.data.mongodb.core.aggregation.ReplaceRootOperationUnitTests
21-Jun-2019 03:33:39 [INFO] Tests run: 7, Failures: 0, Errors: 0, Skipped: 0, Time elapsed: 0.001 s - in org.springframework.data.mongodb.core.aggregation.ReplaceRootOperationUnitTests
21-Jun-2019 03:33:39 [INFO] Running org.springframework.data.mongodb.core.aggregation.ExposedFieldsUnitTests
21-Jun-2019 03:33:39 [INFO] Tests run: 4, Failures: 0, Errors: 0, Skipped: 0, Time elapsed: 0 s - in org.springframework.data.mongodb.core.aggregation.ExposedFieldsUnitTests
21-Jun-2019 03:33:39 [INFO] Running org.springframework.data.mongodb.core.aggregation.SortByCountOperationUnitTests
21-Jun-2019 03:33:39 [INFO] Tests run: 2, Failures: 0, Errors: 0, Skipped: 0, Time elapsed: 0.001 s - in org.springframework.data.mongodb.core.aggregation.SortByCountOperationUnitTests
21-Jun-2019 03:33:39 [INFO] Running org.springframework.data.mongodb.core.aggregation.ArrayOperatorsUnitTests
21-Jun-2019 03:33:39 [INFO] Tests run: 3, Failures: 0, Errors: 0, Skipped: 0, Time elapsed: 0.001 s - in org.springframework.data.mongodb.core.aggregation.ArrayOperatorsUnitTests
21-Jun-2019 03:33:39 [INFO] Running org.springframework.data.mongodb.core.aggregation.SkipOperationUnitTests
21-Jun-2019 03:33:39 [INFO] Tests run: 2, Failures: 0, Errors: 0, Skipped: 0, Time elapsed: 0.001 s - in org.springframework.data.mongodb.core.aggregation.SkipOperationUnitTests
21-Jun-2019 03:33:39 [INFO] Running org.springframework.data.mongodb.core.aggregation.ConvertOperatorsUnitTests
21-Jun-2019 03:33:39 [INFO] Tests run: 26, Failures: 0, Errors: 0, Skipped: 0, Time elapsed: 0 s - in org.springframework.data.mongodb.core.aggregation.ConvertOperatorsUnitTests
21-Jun-2019 03:33:39 [INFO] Running org.springframework.data.mongodb.core.aggregation.SortOperationUnitTests
21-Jun-2019 03:33:39 [INFO] Tests run: 2, Failures: 0, Errors: 0, Skipped: 0, Time elapsed: 0 s - in org.springframework.data.mongodb.core.aggregation.SortOperationUnitTests
21-Jun-2019 03:33:39 [INFO] Running org.springframework.data.mongodb.core.aggregation.BucketAutoOperationUnitTests
21-Jun-2019 03:33:39 [INFO] Tests run: 9, Failures: 0, Errors: 0, Skipped: 0, Time elapsed: 0 s - in org.springframework.data.mongodb.core.aggregation.BucketAutoOperationUnitTests
21-Jun-2019 03:33:39 [INFO] Running org.springframework.data.mongodb.core.aggregation.ReactiveAggregationTests
21-Jun-2019 03:33:40 [INFO] Tests run: 5, Failures: 0, Errors: 0, Skipped: 0, Time elapsed: 0.281 s - in org.springframework.data.mongodb.core.aggregation.ReactiveAggregationTests
21-Jun-2019 03:33:40 [INFO] Running org.springframework.data.mongodb.core.ExecutableFindOperationSupportTests
21-Jun-2019 03:33:45 [INFO] Tests run: 52, Failures: 0, Errors: 0, Skipped: 0, Time elapsed: 5.797 s - in org.springframework.data.mongodb.core.ExecutableFindOperationSupportTests
21-Jun-2019 03:33:45 [INFO] Running org.springframework.data.mongodb.core.ReactiveMongoTemplateUnitTests
21-Jun-2019 03:33:46 [INFO] Tests run: 59, Failures: 0, Errors: 0, Skipped: 0, Time elapsed: 0.361 s - in org.springframework.data.mongodb.core.ReactiveMongoTemplateUnitTests
21-Jun-2019 03:33:46 [INFO] Running org.springframework.data.mongodb.core.schema.MongoJsonSchemaUnitTests
21-Jun-2019 03:33:46 [INFO] Tests run: 5, Failures: 0, Errors: 0, Skipped: 0, Time elapsed: 0.003 s - in org.springframework.data.mongodb.core.schema.MongoJsonSchemaUnitTests
21-Jun-2019 03:33:46 [INFO] Running org.springframework.data.mongodb.core.schema.ReactiveMongoJsonSchemaTests
21-Jun-2019 03:33:46 [INFO] Tests run: 1, Failures: 0, Errors: 0, Skipped: 0, Time elapsed: 0.081 s - in org.springframework.data.mongodb.core.schema.ReactiveMongoJsonSchemaTests
21-Jun-2019 03:33:46 [INFO] Running org.springframework.data.mongodb.core.schema.JsonSchemaPropertyUnitTests
21-Jun-2019 03:33:46 [INFO] Tests run: 8, Failures: 0, Errors: 0, Skipped: 0, Time elapsed: 0.006 s - in org.springframework.data.mongodb.core.schema.JsonSchemaPropertyUnitTests
21-Jun-2019 03:33:46 [INFO] Running org.springframework.data.mongodb.core.schema.JsonSchemaObjectUnitTests
21-Jun-2019 03:33:46 [INFO] Tests run: 34, Failures: 0, Errors: 0, Skipped: 0, Time elapsed: 0.019 s - in org.springframework.data.mongodb.core.schema.JsonSchemaObjectUnitTests
21-Jun-2019 03:33:46 [INFO] Running org.springframework.data.mongodb.core.schema.MongoJsonSchemaTests
21-Jun-2019 03:33:46 [INFO] Tests run: 4, Failures: 0, Errors: 0, Skipped: 0, Time elapsed: 0.193 s - in org.springframework.data.mongodb.core.schema.MongoJsonSchemaTests
21-Jun-2019 03:33:46 [INFO] Running org.springframework.data.mongodb.core.ReactiveUpdateOperationExtensionsTests
21-Jun-2019 03:33:47 [INFO] Tests run: 14, Failures: 0, Errors: 0, Skipped: 0, Time elapsed: 1.091 s - in org.springframework.data.mongodb.core.ReactiveUpdateOperationExtensionsTests
21-Jun-2019 03:33:47 [INFO] Running org.springframework.data.mongodb.core.DefaultScriptOperationsTests
21-Jun-2019 03:33:47 [INFO] Tests run: 11, Failures: 0, Errors: 0, Skipped: 0, Time elapsed: 0.226 s - in org.springframework.data.mongodb.core.DefaultScriptOperationsTests
21-Jun-2019 03:33:47 [INFO] Running org.springframework.data.mongodb.core.DefaultScriptOperationsUnitTests
21-Jun-2019 03:33:47 [INFO] Tests run: 9, Failures: 0, Errors: 0, Skipped: 0, Time elapsed: 0.046 s - in org.springframework.data.mongodb.core.DefaultScriptOperationsUnitTests
21-Jun-2019 03:33:47 [INFO] Running org.springframework.data.mongodb.core.ReactiveRemoveOperationSupportTests
21-Jun-2019 03:33:48 [INFO] Tests run: 4, Failures: 0, Errors: 0, Skipped: 0, Time elapsed: 0.215 s - in org.springframework.data.mongodb.core.ReactiveRemoveOperationSupportTests
21-Jun-2019 03:33:48 [INFO] Running org.springframework.data.mongodb.core.ExecutableRemoveOperationSupportTests
21-Jun-2019 03:33:48 [INFO] Tests run: 4, Failures: 0, Errors: 0, Skipped: 0, Time elapsed: 0.187 s - in org.springframework.data.mongodb.core.ExecutableRemoveOperationSupportTests
21-Jun-2019 03:33:48 [INFO] Running org.springframework.data.mongodb.core.ReactiveMapReduceOperationSupportUnitTests
21-Jun-2019 03:33:48 [INFO] Tests run: 7, Failures: 0, Errors: 0, Skipped: 0, Time elapsed: 0.007 s - in org.springframework.data.mongodb.core.ReactiveMapReduceOperationSupportUnitTests
21-Jun-2019 03:33:48 [INFO] Running org.springframework.data.mongodb.core.ExecutableMapReduceOperationSupportUnitTests
21-Jun-2019 03:33:48 [INFO] Tests run: 7, Failures: 0, Errors: 0, Skipped: 0, Time elapsed: 0.007 s - in org.springframework.data.mongodb.core.ExecutableMapReduceOperationSupportUnitTests
21-Jun-2019 03:33:48 [INFO] Running org.springframework.data.mongodb.core.ExecutableFindOperationExtensionsTests
21-Jun-2019 03:33:49 [INFO] Tests run: 6, Failures: 0, Errors: 0, Skipped: 0, Time elapsed: 0.988 s - in org.springframework.data.mongodb.core.ExecutableFindOperationExtensionsTests
21-Jun-2019 03:33:49 [INFO] Running org.springframework.data.mongodb.core.ReactiveFindOperationExtensionsTests
21-Jun-2019 03:33:50 [INFO] Tests run: 20, Failures: 0, Errors: 0, Skipped: 0, Time elapsed: 1.155 s - in org.springframework.data.mongodb.core.ReactiveFindOperationExtensionsTests
21-Jun-2019 03:33:50 [INFO] Running org.springframework.data.mongodb.core.MappingMongoJsonSchemaCreatorUnitTests
21-Jun-2019 03:33:50 [INFO] Tests run: 4, Failures: 0, Errors: 0, Skipped: 0, Time elapsed: 0.023 s - in org.springframework.data.mongodb.core.MappingMongoJsonSchemaCreatorUnitTests
21-Jun-2019 03:33:50 [INFO] Running org.springframework.data.mongodb.core.ReactiveInsertOperationSupportUnitTests
21-Jun-2019 03:33:50 [INFO] Tests run: 4, Failures: 0, Errors: 0, Skipped: 0, Time elapsed: 0.008 s - in org.springframework.data.mongodb.core.ReactiveInsertOperationSupportUnitTests
21-Jun-2019 03:33:50 [INFO] Running org.springframework.data.mongodb.core.geo.GeoSpatial2DTests
21-Jun-2019 03:33:51 [INFO] Tests run: 9, Failures: 0, Errors: 0, Skipped: 0, Time elapsed: 0.909 s - in org.springframework.data.mongodb.core.geo.GeoSpatial2DTests
21-Jun-2019 03:33:51 [INFO] Running org.springframework.data.mongodb.core.geo.GeoJsonModuleUnitTests
21-Jun-2019 03:33:52 [INFO] Tests run: 6, Failures: 0, Errors: 0, Skipped: 0, Time elapsed: 0.589 s - in org.springframework.data.mongodb.core.geo.GeoJsonModuleUnitTests
21-Jun-2019 03:33:52 [INFO] Running org.springframework.data.mongodb.core.geo.GeoJsonTests
21-Jun-2019 03:33:54 [INFO] Tests run: 22, Failures: 0, Errors: 0, Skipped: 0, Time elapsed: 2.12 s - in org.springframework.data.mongodb.core.geo.GeoJsonTests
21-Jun-2019 03:33:54 [INFO] Running org.springframework.data.mongodb.core.geo.GeoSpatialIndexTests
21-Jun-2019 03:33:54 [INFO] Tests run: 4, Failures: 0, Errors: 0, Skipped: 0, Time elapsed: 0.452 s - in org.springframework.data.mongodb.core.geo.GeoSpatialIndexTests
21-Jun-2019 03:33:54 [INFO] Running org.springframework.data.mongodb.core.geo.GeoSpatial2DSphereTests
21-Jun-2019 03:33:55 [INFO] Tests run: 10, Failures: 0, Errors: 0, Skipped: 0, Time elapsed: 0.688 s - in org.springframework.data.mongodb.core.geo.GeoSpatial2DSphereTests
21-Jun-2019 03:33:55 [INFO] Running org.springframework.data.mongodb.core.ExecutableMapReduceOperationExtensionsTests
21-Jun-2019 03:33:55 [INFO] Tests run: 4, Failures: 0, Errors: 0, Skipped: 0, Time elapsed: 0.463 s - in org.springframework.data.mongodb.core.ExecutableMapReduceOperationExtensionsTests
21-Jun-2019 03:33:55 [INFO] Running org.springframework.data.mongodb.core.script.ExecutableMongoScriptUnitTests
21-Jun-2019 03:33:55 [INFO] Tests run: 3, Failures: 0, Errors: 0, Skipped: 0, Time elapsed: 0.002 s - in org.springframework.data.mongodb.core.script.ExecutableMongoScriptUnitTests
21-Jun-2019 03:33:55 [INFO] Running org.springframework.data.mongodb.core.script.NamedMongoScriptUnitTests
21-Jun-2019 03:33:55 [INFO] Tests run: 4, Failures: 0, Errors: 0, Skipped: 0, Time elapsed: 0.001 s - in org.springframework.data.mongodb.core.script.NamedMongoScriptUnitTests
21-Jun-2019 03:33:55 [INFO] Running org.springframework.data.mongodb.core.query.CriteriaExtensionsTests
21-Jun-2019 03:33:55 [INFO] Tests run: 10, Failures: 0, Errors: 0, Skipped: 0, Time elapsed: 0.019 s - in org.springframework.data.mongodb.core.query.CriteriaExtensionsTests
21-Jun-2019 03:33:55 [INFO] Running org.springframework.data.mongodb.core.query.QueryTests
21-Jun-2019 03:33:55 [INFO] Tests run: 29, Failures: 0, Errors: 0, Skipped: 0, Time elapsed: 0.017 s - in org.springframework.data.mongodb.core.query.QueryTests
21-Jun-2019 03:33:55 [INFO] Running org.springframework.data.mongodb.core.query.KPropertyPathTests
21-Jun-2019 03:33:55 [INFO] Tests run: 4, Failures: 0, Errors: 0, Skipped: 0, Time elapsed: 0.003 s - in org.springframework.data.mongodb.core.query.KPropertyPathTests
21-Jun-2019 03:33:55 [INFO] Running org.springframework.data.mongodb.core.query.FieldUnitTests
21-Jun-2019 03:33:55 [INFO] Tests run: 2, Failures: 0, Errors: 0, Skipped: 0, Time elapsed: 0 s - in org.springframework.data.mongodb.core.query.FieldUnitTests
21-Jun-2019 03:33:55 [INFO] Running org.springframework.data.mongodb.core.query.TypedCriteriaExtensionsTests
21-Jun-2019 03:33:55 [INFO] Tests run: 38, Failures: 0, Errors: 0, Skipped: 0, Time elapsed: 0.031 s - in org.springframework.data.mongodb.core.query.TypedCriteriaExtensionsTests
21-Jun-2019 03:33:55 [INFO] Running org.springframework.data.mongodb.core.query.IndexUnitTests
21-Jun-2019 03:33:55 [INFO] Tests run: 8, Failures: 0, Errors: 0, Skipped: 0, Time elapsed: 0 s - in org.springframework.data.mongodb.core.query.IndexUnitTests
21-Jun-2019 03:33:55 [INFO] Running org.springframework.data.mongodb.core.query.TextCriteriaUnitTests
21-Jun-2019 03:33:55 [INFO] Tests run: 10, Failures: 0, Errors: 0, Skipped: 0, Time elapsed: 0.004 s - in org.springframework.data.mongodb.core.query.TextCriteriaUnitTests
21-Jun-2019 03:33:55 [INFO] Running org.springframework.data.mongodb.core.query.NearQueryUnitTests
21-Jun-2019 03:33:55 [INFO] Tests run: 19, Failures: 0, Errors: 0, Skipped: 0, Time elapsed: 0.004 s - in org.springframework.data.mongodb.core.query.NearQueryUnitTests
21-Jun-2019 03:33:55 [INFO] Running org.springframework.data.mongodb.core.query.UntypedExampleMatcherUnitTests
21-Jun-2019 03:33:55 [INFO] Tests run: 17, Failures: 0, Errors: 0, Skipped: 0, Time elapsed: 0.004 s - in org.springframework.data.mongodb.core.query.UntypedExampleMatcherUnitTests
21-Jun-2019 03:33:55 [INFO] Running org.springframework.data.mongodb.core.query.MetricConversionUnitTests
21-Jun-2019 03:33:55 [INFO] Tests run: 4, Failures: 0, Errors: 0, Skipped: 0, Time elapsed: 0.001 s - in org.springframework.data.mongodb.core.query.MetricConversionUnitTests
21-Jun-2019 03:33:55 [INFO] Running org.springframework.data.mongodb.core.query.SortTests
21-Jun-2019 03:33:55 [INFO] Tests run: 3, Failures: 0, Errors: 0, Skipped: 0, Time elapsed: 0 s - in org.springframework.data.mongodb.core.query.SortTests
21-Jun-2019 03:33:55 [INFO] Running org.springframework.data.mongodb.core.query.CriteriaTests
21-Jun-2019 03:33:56 [INFO] Tests run: 12, Failures: 0, Errors: 0, Skipped: 0, Time elapsed: 0.571 s - in org.springframework.data.mongodb.core.query.CriteriaTests
21-Jun-2019 03:33:56 [INFO] Running org.springframework.data.mongodb.core.query.CriteriaUnitTests
21-Jun-2019 03:33:56 [INFO] Tests run: 34, Failures: 0, Errors: 0, Skipped: 0, Time elapsed: 0.012 s - in org.springframework.data.mongodb.core.query.CriteriaUnitTests
21-Jun-2019 03:33:56 [INFO] Running org.springframework.data.mongodb.core.query.BasicQueryUnitTests
21-Jun-2019 03:33:56 [INFO] Tests run: 10, Failures: 0, Errors: 0, Skipped: 0, Time elapsed: 0.285 s - in org.springframework.data.mongodb.core.query.BasicQueryUnitTests
21-Jun-2019 03:33:56 [INFO] Running org.springframework.data.mongodb.core.query.UpdateTests
21-Jun-2019 03:33:56 [INFO] Tests run: 56, Failures: 0, Errors: 0, Skipped: 0, Time elapsed: 0.019 s - in org.springframework.data.mongodb.core.query.UpdateTests
21-Jun-2019 03:33:56 [INFO] Running org.springframework.data.mongodb.core.query.MongoRegexCreatorUnitTests
21-Jun-2019 03:33:56 [INFO] Tests run: 15, Failures: 0, Errors: 0, Skipped: 0, Time elapsed: 0.004 s - in org.springframework.data.mongodb.core.query.MongoRegexCreatorUnitTests
21-Jun-2019 03:33:56 [INFO] Running org.springframework.data.mongodb.core.query.TextQueryTests
21-Jun-2019 03:33:57 [INFO] Tests run: 10, Failures: 0, Errors: 0, Skipped: 0, Time elapsed: 0.679 s - in org.springframework.data.mongodb.core.query.TextQueryTests
21-Jun-2019 03:33:57 [INFO] Running org.springframework.data.mongodb.core.query.TextQueryUnitTests
21-Jun-2019 03:33:57 [INFO] Tests run: 7, Failures: 0, Errors: 0, Skipped: 0, Time elapsed: 0.003 s - in org.springframework.data.mongodb.core.query.TextQueryUnitTests
21-Jun-2019 03:33:57 [INFO] Running org.springframework.data.mongodb.ReactiveMongoDatabaseUtilsUnitTests
21-Jun-2019 03:33:57 [INFO] Tests run: 5, Failures: 0, Errors: 0, Skipped: 0, Time elapsed: 0.059 s - in org.springframework.data.mongodb.ReactiveMongoDatabaseUtilsUnitTests
21-Jun-2019 03:33:57 [INFO] Running org.springframework.data.mongodb.monitor.MongoMonitorIntegrationTests
21-Jun-2019 03:33:57 [INFO] Tests run: 3, Failures: 0, Errors: 0, Skipped: 0, Time elapsed: 0.006 s - in org.springframework.data.mongodb.monitor.MongoMonitorIntegrationTests
21-Jun-2019 03:33:57 [INFO] Running org.springframework.data.mongodb.test.util.CleanMongoDBTests
21-Jun-2019 03:33:57 [INFO] Tests run: 9, Failures: 0, Errors: 0, Skipped: 0, Time elapsed: 0.051 s - in org.springframework.data.mongodb.test.util.CleanMongoDBTests
21-Jun-2019 03:33:57 [INFO] Running org.springframework.data.mongodb.MongoDatabaseUtilsUnitTests
21-Jun-2019 03:33:57 [INFO] Tests run: 9, Failures: 0, Errors: 0, Skipped: 0, Time elapsed: 0.028 s - in org.springframework.data.mongodb.MongoDatabaseUtilsUnitTests
21-Jun-2019 03:33:57 [INFO] Running org.springframework.data.mongodb.DependencyTests
21-Jun-2019 03:34:18 [INFO] Tests run: 3, Failures: 0, Errors: 0, Skipped: 0, Time elapsed: 20.96 s - in org.springframework.data.mongodb.DependencyTests
21-Jun-2019 03:34:18 [INFO] Running org.springframework.data.mongodb.repository.config.MongoRepositoriesRegistrarIntegrationTests
21-Jun-2019 03:34:18 [INFO] Tests run: 1, Failures: 0, Errors: 0, Skipped: 0, Time elapsed: 0.298 s - in org.springframework.data.mongodb.repository.config.MongoRepositoriesRegistrarIntegrationTests
21-Jun-2019 03:34:18 [INFO] Running org.springframework.data.mongodb.repository.config.lazy.NestedMongoRepositoriesJavaConfigTests
21-Jun-2019 03:34:18 [INFO] Tests run: 1, Failures: 0, Errors: 0, Skipped: 0, Time elapsed: 0.034 s - in org.springframework.data.mongodb.repository.config.lazy.NestedMongoRepositoriesJavaConfigTests
21-Jun-2019 03:34:18 [INFO] Running org.springframework.data.mongodb.repository.config.lazy.AllowNestedMongoRepositoriesRepositoryConfigTests
21-Jun-2019 03:34:18 [INFO] Tests run: 1, Failures: 0, Errors: 0, Skipped: 0, Time elapsed: 0.039 s - in org.springframework.data.mongodb.repository.config.lazy.AllowNestedMongoRepositoriesRepositoryConfigTests
21-Jun-2019 03:34:18 [INFO] Running org.springframework.data.mongodb.repository.config.MongoNamespaceIntegrationTests
21-Jun-2019 03:34:21 [INFO] Tests run: 123, Failures: 0, Errors: 0, Skipped: 0, Time elapsed: 2.418 s - in org.springframework.data.mongodb.repository.config.MongoNamespaceIntegrationTests
21-Jun-2019 03:34:21 [INFO] Running org.springframework.data.mongodb.repository.config.ReactiveMongoRepositoryConfigurationExtensionUnitTests
21-Jun-2019 03:34:21 [INFO] Tests run: 3, Failures: 0, Errors: 0, Skipped: 0, Time elapsed: 0.033 s - in org.springframework.data.mongodb.repository.config.ReactiveMongoRepositoryConfigurationExtensionUnitTests
21-Jun-2019 03:34:21 [INFO] Running org.springframework.data.mongodb.repository.config.ReactiveMongoRepositoriesRegistrarIntegrationTests
21-Jun-2019 03:34:21 [INFO] Tests run: 1, Failures: 0, Errors: 0, Skipped: 0, Time elapsed: 0.102 s - in org.springframework.data.mongodb.repository.config.ReactiveMongoRepositoriesRegistrarIntegrationTests
21-Jun-2019 03:34:21 [INFO] Running org.springframework.data.mongodb.repository.config.MongoRepositoryConfigurationExtensionUnitTests
21-Jun-2019 03:34:21 [INFO] Tests run: 3, Failures: 0, Errors: 0, Skipped: 0, Time elapsed: 0.02 s - in org.springframework.data.mongodb.repository.config.MongoRepositoryConfigurationExtensionUnitTests
21-Jun-2019 03:34:21 [INFO] Running org.springframework.data.mongodb.repository.ConvertingReactiveMongoRepositoryTests
21-Jun-2019 03:34:21 [INFO] Tests run: 17, Failures: 0, Errors: 0, Skipped: 0, Time elapsed: 0.259 s - in org.springframework.data.mongodb.repository.ConvertingReactiveMongoRepositoryTests
21-Jun-2019 03:34:21 [INFO] Running org.springframework.data.mongodb.repository.support.ReactiveQuerydslMongoPredicateExecutorTests
21-Jun-2019 03:34:22 2019-06-21 03:34:22,036 ERROR .data.mongodb.core.ReactiveMongoTemplate: 309 - Unexpected exception during asynchronous execution
21-Jun-2019 03:34:22 org.springframework.dao.PermissionDeniedDataAccessException: Authentication Failed; nested exception is com.mongodb.MongoException: Authentication Failed
21-Jun-2019 03:34:22         at org.springframework.data.mongodb.core.MongoExceptionTranslator.translateExceptionIfPossible(MongoExceptionTranslator.java:132)
21-Jun-2019 03:34:22         at org.springframework.data.mongodb.core.ReactiveMongoTemplate.potentiallyConvertRuntimeException(ReactiveMongoTemplate.java:2736)
21-Jun-2019 03:34:22         at org.springframework.data.mongodb.core.ReactiveMongoTemplate.lambda$translateException$86(ReactiveMongoTemplate.java:2719)
21-Jun-2019 03:34:22         at reactor.core.publisher.Flux.lambda$onErrorMap$24(Flux.java:6193)
21-Jun-2019 03:34:22         at reactor.core.publisher.FluxOnErrorResume$ResumeSubscriber.onError(FluxOnErrorResume.java:88)
21-Jun-2019 03:34:22         at reactor.core.publisher.MonoFlatMapMany$FlatMapManyMain.onError(MonoFlatMapMany.java:193)
21-Jun-2019 03:34:22         at reactor.core.publisher.FluxMap$MapSubscriber.onError(FluxMap.java:126)
21-Jun-2019 03:34:22         at reactor.core.publisher.Operators.error(Operators.java:182)
21-Jun-2019 03:34:22         at reactor.core.publisher.MonoError.subscribe(MonoError.java:52)
21-Jun-2019 03:34:22         at reactor.core.publisher.MonoMap.subscribe(MonoMap.java:55)
21-Jun-2019 03:34:22         at reactor.core.publisher.MonoFlatMapMany.subscribe(MonoFlatMapMany.java:49)
21-Jun-2019 03:34:22         at reactor.core.publisher.FluxOnErrorResume.subscribe(FluxOnErrorResume.java:47)
21-Jun-2019 03:34:22         at reactor.core.publisher.MonoNext.subscribe(MonoNext.java:40)
21-Jun-2019 03:34:22         at reactor.core.publisher.MonoOnErrorResume.subscribe(MonoOnErrorResume.java:44)
21-Jun-2019 03:34:22         at reactor.core.publisher.Mono.subscribe(Mono.java:3711)
21-Jun-2019 03:34:22         at reactor.core.publisher.FluxFlatMap$FlatMapMain.onNext(FluxFlatMap.java:389)
21-Jun-2019 03:34:22         at reactor.core.publisher.FluxIterable$IterableSubscription.slowPath(FluxIterable.java:243)
21-Jun-2019 03:34:22         at reactor.core.publisher.FluxIterable$IterableSubscription.request(FluxIterable.java:201)
21-Jun-2019 03:34:22         at reactor.core.publisher.FluxFlatMap$FlatMapMain.onSubscribe(FluxFlatMap.java:335)
21-Jun-2019 03:34:22         at reactor.core.publisher.FluxIterable.subscribe(FluxIterable.java:139)
21-Jun-2019 03:34:22         at reactor.core.publisher.FluxIterable.subscribe(FluxIterable.java:63)
21-Jun-2019 03:34:22         at reactor.core.publisher.FluxFlatMap.subscribe(FluxFlatMap.java:97)
21-Jun-2019 03:34:22         at reactor.core.publisher.MonoIgnoreElements.subscribe(MonoIgnoreElements.java:37)
21-Jun-2019 03:34:22         at reactor.core.publisher.Mono.subscribe(Mono.java:3711)
21-Jun-2019 03:34:22         at reactor.core.publisher.Mono.subscribeWith(Mono.java:3817)
21-Jun-2019 03:34:22         at reactor.core.publisher.Mono.subscribe(Mono.java:3705)
21-Jun-2019 03:34:22         at reactor.core.publisher.Mono.subscribe(Mono.java:3672)
21-Jun-2019 03:34:22         at reactor.core.publisher.Mono.subscribe(Mono.java:3644)
21-Jun-2019 03:34:22         at org.springframework.data.mongodb.core.ReactiveMongoTemplate.onCheckForIndexes(ReactiveMongoTemplate.java:304)
21-Jun-2019 03:34:22         at org.springframework.data.mongodb.core.ReactiveMongoTemplate.access$1100(ReactiveMongoTemplate.java:168)
21-Jun-2019 03:34:22         at org.springframework.data.mongodb.core.ReactiveMongoTemplate$IndexCreatorEventListener.onApplicationEvent(ReactiveMongoTemplate.java:3332)
21-Jun-2019 03:34:22         at org.springframework.data.mongodb.core.ReactiveMongoTemplate$IndexCreatorEventListener.onApplicationEvent(ReactiveMongoTemplate.java:3315)
21-Jun-2019 03:34:22         at org.springframework.data.mongodb.core.index.MongoMappingEventPublisher.publishEvent(MongoMappingEventPublisher.java:76)
21-Jun-2019 03:34:22         at org.springframework.data.mapping.context.AbstractMappingContext.addPersistentEntity(AbstractMappingContext.java:396)
21-Jun-2019 03:34:22         at org.springframework.data.mapping.context.AbstractMappingContext.getPersistentEntity(AbstractMappingContext.java:248)
21-Jun-2019 03:34:22         at org.springframework.data.mapping.context.AbstractMappingContext.getPersistentEntity(AbstractMappingContext.java:191)
21-Jun-2019 03:34:22         at org.springframework.data.mapping.context.AbstractMappingContext.getPersistentEntity(AbstractMappingContext.java:85)
21-Jun-2019 03:34:22         at org.springframework.data.mapping.context.MappingContext.getRequiredPersistentEntity(MappingContext.java:73)
21-Jun-2019 03:34:22         at org.springframework.data.mongodb.repository.support.ReactiveMongoRepositoryFactory.getEntityInformation(ReactiveMongoRepositoryFactory.java:148)
21-Jun-2019 03:34:22         at org.springframework.data.mongodb.repository.support.ReactiveMongoRepositoryFactory.getEntityInformation(ReactiveMongoRepositoryFactory.java:141)
21-Jun-2019 03:34:22         at org.springframework.data.mongodb.repository.support.ReactiveQuerydslMongoPredicateExecutorTests.translatesExceptionsCorrectly(ReactiveQuerydslMongoPredicateExecutorTests.java:320)
21-Jun-2019 03:34:22         at sun.reflect.NativeMethodAccessorImpl.invoke0(Native Method)
21-Jun-2019 03:34:22         at sun.reflect.NativeMethodAccessorImpl.invoke(NativeMethodAccessorImpl.java:62)
21-Jun-2019 03:34:22         at sun.reflect.DelegatingMethodAccessorImpl.invoke(DelegatingMethodAccessorImpl.java:43)
21-Jun-2019 03:34:22         at java.lang.reflect.Method.invoke(Method.java:498)
21-Jun-2019 03:34:22         at org.junit.runners.model.FrameworkMethod$1.runReflectiveCall(FrameworkMethod.java:50)
21-Jun-2019 03:34:22         at org.junit.internal.runners.model.ReflectiveCallable.run(ReflectiveCallable.java:12)
21-Jun-2019 03:34:22         at org.junit.runners.model.FrameworkMethod.invokeExplosively(FrameworkMethod.java:47)
21-Jun-2019 03:34:22         at org.junit.internal.runners.statements.InvokeMethod.evaluate(InvokeMethod.java:17)
21-Jun-2019 03:34:22         at org.springframework.test.context.junit4.statements.RunBeforeTestExecutionCallbacks.evaluate(RunBeforeTestExecutionCallbacks.java:74)
21-Jun-2019 03:34:22         at org.springframework.test.context.junit4.statements.RunAfterTestExecutionCallbacks.evaluate(RunAfterTestExecutionCallbacks.java:84)
21-Jun-2019 03:34:22         at org.junit.internal.runners.statements.RunBefores.evaluate(RunBefores.java:26)
21-Jun-2019 03:34:22         at org.springframework.test.context.junit4.statements.RunBeforeTestMethodCallbacks.evaluate(RunBeforeTestMethodCallbacks.java:75)
21-Jun-2019 03:34:22         at org.junit.internal.runners.statements.RunAfters.evaluate(RunAfters.java:27)
21-Jun-2019 03:34:22         at org.springframework.test.context.junit4.statements.RunAfterTestMethodCallbacks.evaluate(RunAfterTestMethodCallbacks.java:86)
21-Jun-2019 03:34:22         at org.springframework.test.context.junit4.statements.SpringRepeat.evaluate(SpringRepeat.java:84)
21-Jun-2019 03:34:22         at org.junit.runners.ParentRunner.runLeaf(ParentRunner.java:325)
21-Jun-2019 03:34:22         at org.springframework.test.context.junit4.SpringJUnit4ClassRunner.runChild(SpringJUnit4ClassRunner.java:251)
21-Jun-2019 03:34:22         at org.springframework.test.context.junit4.SpringJUnit4ClassRunner.runChild(SpringJUnit4ClassRunner.java:97)
21-Jun-2019 03:34:22         at org.junit.runners.ParentRunner$3.run(ParentRunner.java:290)
21-Jun-2019 03:34:22         at org.junit.runners.ParentRunner$1.schedule(ParentRunner.java:71)
21-Jun-2019 03:34:22         at org.junit.runners.ParentRunner.runChildren(ParentRunner.java:288)
21-Jun-2019 03:34:22         at org.junit.runners.ParentRunner.access$000(ParentRunner.java:58)
21-Jun-2019 03:34:22         at org.junit.runners.ParentRunner$2.evaluate(ParentRunner.java:268)
21-Jun-2019 03:34:22         at org.junit.internal.runners.statements.RunBefores.evaluate(RunBefores.java:26)
21-Jun-2019 03:34:22         at org.springframework.test.context.junit4.statements.RunBeforeTestClassCallbacks.evaluate(RunBeforeTestClassCallbacks.java:61)
21-Jun-2019 03:34:22         at org.springframework.test.context.junit4.statements.RunAfterTestClassCallbacks.evaluate(RunAfterTestClassCallbacks.java:70)
21-Jun-2019 03:34:22         at org.junit.runners.ParentRunner.run(ParentRunner.java:363)
21-Jun-2019 03:34:22         at org.springframework.test.context.junit4.SpringJUnit4ClassRunner.run(SpringJUnit4ClassRunner.java:190)
21-Jun-2019 03:34:22         at org.apache.maven.surefire.junit4.JUnit4Provider.execute(JUnit4Provider.java:365)
21-Jun-2019 03:34:22         at org.apache.maven.surefire.junit4.JUnit4Provider.executeWithRerun(JUnit4Provider.java:273)
21-Jun-2019 03:34:22         at org.apache.maven.surefire.junit4.JUnit4Provider.executeTestSet(JUnit4Provider.java:238)
21-Jun-2019 03:34:22         at org.apache.maven.surefire.junit4.JUnit4Provider.invoke(JUnit4Provider.java:159)
21-Jun-2019 03:34:22         at org.apache.maven.surefire.booter.ForkedBooter.invokeProviderInSameClassLoader(ForkedBooter.java:384)
21-Jun-2019 03:34:22         at org.apache.maven.surefire.booter.ForkedBooter.runSuitesInProcess(ForkedBooter.java:345)
21-Jun-2019 03:34:22         at org.apache.maven.surefire.booter.ForkedBooter.execute(ForkedBooter.java:126)
21-Jun-2019 03:34:22         at org.apache.maven.surefire.booter.ForkedBooter.main(ForkedBooter.java:418)
21-Jun-2019 03:34:22 Caused by: com.mongodb.MongoException: Authentication Failed
21-Jun-2019 03:34:22         at org.springframework.data.mongodb.repository.support.ReactiveQuerydslMongoPredicateExecutorTests$1.doGetDatabase(ReactiveQuerydslMongoPredicateExecutorTests.java:315)
21-Jun-2019 03:34:22         at org.springframework.data.mongodb.core.ReactiveMongoTemplate.createFlux(ReactiveMongoTemplate.java:651)
21-Jun-2019 03:34:22         at org.springframework.data.mongodb.core.ReactiveMongoTemplate.execute(ReactiveMongoTemplate.java:504)
21-Jun-2019 03:34:22         at org.springframework.data.mongodb.core.DefaultReactiveIndexOperations.ensureIndex(DefaultReactiveIndexOperations.java:95)
21-Jun-2019 03:34:22         at org.springframework.data.mongodb.core.index.ReactiveMongoPersistentEntityIndexCreator.createIndex(ReactiveMongoPersistentEntityIndexCreator.java:147)
21-Jun-2019 03:34:22         at org.springframework.data.mongodb.core.index.ReactiveMongoPersistentEntityIndexCreator.checkForAndCreateIndexes(ReactiveMongoPersistentEntityIndexCreator.java:136)
21-Jun-2019 03:34:22         at org.springframework.data.mongodb.core.index.ReactiveMongoPersistentEntityIndexCreator.checkForIndexes(ReactiveMongoPersistentEntityIndexCreator.java:116)
21-Jun-2019 03:34:22         ... 49 common frames omitted
21-Jun-2019 03:34:22 [INFO] Tests run: 11, Failures: 0, Errors: 0, Skipped: 0, Time elapsed: 0.347 s - in org.springframework.data.mongodb.repository.support.ReactiveQuerydslMongoPredicateExecutorTests
21-Jun-2019 03:34:22 [INFO] Running org.springframework.data.mongodb.repository.support.MongoRepositoryFactoryUnitTests
21-Jun-2019 03:34:22 [INFO] Tests run: 2, Failures: 0, Errors: 0, Skipped: 0, Time elapsed: 0.011 s - in org.springframework.data.mongodb.repository.support.MongoRepositoryFactoryUnitTests
21-Jun-2019 03:34:22 [INFO] Running org.springframework.data.mongodb.repository.support.SimpleMongoRepositoryUnitTests
21-Jun-2019 03:34:22 [INFO] Tests run: 6, Failures: 0, Errors: 0, Skipped: 0, Time elapsed: 0.012 s - in org.springframework.data.mongodb.repository.support.SimpleMongoRepositoryUnitTests
21-Jun-2019 03:34:22 [INFO] Running org.springframework.data.mongodb.repository.support.SimpleReactiveMongoRepositoryVersionedEntityTests
21-Jun-2019 03:34:22 [INFO] Tests run: 3, Failures: 0, Errors: 0, Skipped: 0, Time elapsed: 0.071 s - in org.springframework.data.mongodb.repository.support.SimpleReactiveMongoRepositoryVersionedEntityTests
21-Jun-2019 03:34:22 [INFO] Running org.springframework.data.mongodb.repository.support.IndexEnsuringQueryCreationListenerUnitTests
21-Jun-2019 03:34:22 [INFO] Tests run: 5, Failures: 0, Errors: 0, Skipped: 0, Time elapsed: 0.078 s - in org.springframework.data.mongodb.repository.support.IndexEnsuringQueryCreationListenerUnitTests
21-Jun-2019 03:34:22 [INFO] Running org.springframework.data.mongodb.repository.support.SimpleMongoRepositoryTests
21-Jun-2019 03:34:24 [WARNING] Tests run: 25, Failures: 0, Errors: 0, Skipped: 2, Time elapsed: 2.348 s - in org.springframework.data.mongodb.repository.support.SimpleMongoRepositoryTests
21-Jun-2019 03:34:24 [INFO] Running org.springframework.data.mongodb.repository.support.SimpleMongoRepositoryVersionedEntityTests
21-Jun-2019 03:34:24 [WARNING] Tests run: 6, Failures: 0, Errors: 0, Skipped: 3, Time elapsed: 0.043 s - in org.springframework.data.mongodb.repository.support.SimpleMongoRepositoryVersionedEntityTests
21-Jun-2019 03:34:24 [INFO] Running org.springframework.data.mongodb.repository.support.MongoRepositoryFactoryBeanUnitTests
21-Jun-2019 03:34:24 [INFO] Tests run: 2, Failures: 0, Errors: 0, Skipped: 0, Time elapsed: 0.002 s - in org.springframework.data.mongodb.repository.support.MongoRepositoryFactoryBeanUnitTests
21-Jun-2019 03:34:24 [INFO] Running org.springframework.data.mongodb.repository.support.SimpleReactiveMongoRepositoryUnitTests
21-Jun-2019 03:34:24 [INFO] Tests run: 5, Failures: 0, Errors: 0, Skipped: 0, Time elapsed: 0.066 s - in org.springframework.data.mongodb.repository.support.SimpleReactiveMongoRepositoryUnitTests
21-Jun-2019 03:34:24 [INFO] Running org.springframework.data.mongodb.repository.support.QuerydslRepositorySupportTests
21-Jun-2019 03:34:24 [INFO] Tests run: 10, Failures: 0, Errors: 0, Skipped: 0, Time elapsed: 0.25 s - in org.springframework.data.mongodb.repository.support.QuerydslRepositorySupportTests
21-Jun-2019 03:34:24 [INFO] Running org.springframework.data.mongodb.repository.support.QuerydslMongoPredicateExecutorIntegrationTests
21-Jun-2019 03:34:25 [INFO] Tests run: 10, Failures: 0, Errors: 0, Skipped: 0, Time elapsed: 0.534 s - in org.springframework.data.mongodb.repository.support.QuerydslMongoPredicateExecutorIntegrationTests
21-Jun-2019 03:34:25 [INFO] Running org.springframework.data.mongodb.repository.support.SpringDataMongodbSerializerUnitTests
21-Jun-2019 03:34:25 [INFO] Tests run: 9, Failures: 0, Errors: 0, Skipped: 0, Time elapsed: 0.02 s - in org.springframework.data.mongodb.repository.support.SpringDataMongodbSerializerUnitTests
21-Jun-2019 03:34:25 [INFO] Running org.springframework.data.mongodb.repository.SimpleReactiveMongoRepositoryTests
21-Jun-2019 03:34:25 [INFO] Tests run: 40, Failures: 0, Errors: 0, Skipped: 0, Time elapsed: 0.265 s - in org.springframework.data.mongodb.repository.SimpleReactiveMongoRepositoryTests
21-Jun-2019 03:34:25 [INFO] Running org.springframework.data.mongodb.repository.custom.CustomRepositoryImplementationTests
21-Jun-2019 03:34:25 [INFO] Tests run: 1, Failures: 0, Errors: 0, Skipped: 0, Time elapsed: 0.028 s - in org.springframework.data.mongodb.repository.custom.CustomRepositoryImplementationTests
21-Jun-2019 03:34:25 [INFO] Running org.springframework.data.mongodb.repository.custom.CustomReactiveRepositoryImplementationTests
21-Jun-2019 03:34:25 [INFO] Tests run: 1, Failures: 0, Errors: 0, Skipped: 0, Time elapsed: 0.034 s - in org.springframework.data.mongodb.repository.custom.CustomReactiveRepositoryImplementationTests
21-Jun-2019 03:34:25 [INFO] Running org.springframework.data.mongodb.repository.custom.ComposedRepositoryImplementationTests
21-Jun-2019 03:34:25 [INFO] Tests run: 1, Failures: 0, Errors: 0, Skipped: 0, Time elapsed: 0.034 s - in org.springframework.data.mongodb.repository.custom.ComposedRepositoryImplementationTests
21-Jun-2019 03:34:25 [INFO] Running org.springframework.data.mongodb.repository.PersonRepositoryIntegrationTests
21-Jun-2019 03:34:27 [INFO] Tests run: 121, Failures: 0, Errors: 0, Skipped: 0, Time elapsed: 1.978 s - in org.springframework.data.mongodb.repository.PersonRepositoryIntegrationTests
21-Jun-2019 03:34:27 [INFO] Running org.springframework.data.mongodb.repository.cdi.CdiExtensionIntegrationTests
21-Jun-2019 03:34:28 [INFO] Tests run: 2, Failures: 0, Errors: 0, Skipped: 0, Time elapsed: 0.321 s - in org.springframework.data.mongodb.repository.cdi.CdiExtensionIntegrationTests
21-Jun-2019 03:34:28 [INFO] Running org.springframework.data.mongodb.repository.RepositoryIndexCreationIntegrationTests
21-Jun-2019 03:34:28 [INFO] Tests run: 1, Failures: 0, Errors: 0, Skipped: 0, Time elapsed: 0.678 s - in org.springframework.data.mongodb.repository.RepositoryIndexCreationIntegrationTests
21-Jun-2019 03:34:28 [INFO] Running org.springframework.data.mongodb.repository.ContactRepositoryIntegrationTests
21-Jun-2019 03:34:29 [INFO] Tests run: 2, Failures: 0, Errors: 0, Skipped: 0, Time elapsed: 0.113 s - in org.springframework.data.mongodb.repository.ContactRepositoryIntegrationTests
21-Jun-2019 03:34:29 [INFO] Running org.springframework.data.mongodb.repository.RedeclaringRepositoryMethodsTests
21-Jun-2019 03:34:30 [INFO] Tests run: 123, Failures: 0, Errors: 0, Skipped: 0, Time elapsed: 1.801 s - in org.springframework.data.mongodb.repository.RedeclaringRepositoryMethodsTests
21-Jun-2019 03:34:30 [INFO] Running org.springframework.data.mongodb.repository.PersonRepositoryLazyLoadingIntegrationTests
21-Jun-2019 03:34:30 [INFO] Tests run: 3, Failures: 0, Errors: 0, Skipped: 0, Time elapsed: 0.018 s - in org.springframework.data.mongodb.repository.PersonRepositoryLazyLoadingIntegrationTests
21-Jun-2019 03:34:30 [INFO] Running org.springframework.data.mongodb.repository.ComplexIdRepositoryIntegrationTests
21-Jun-2019 03:34:31 [INFO] Tests run: 6, Failures: 0, Errors: 0, Skipped: 0, Time elapsed: 0.239 s - in org.springframework.data.mongodb.repository.ComplexIdRepositoryIntegrationTests
21-Jun-2019 03:34:31 [INFO] Running org.springframework.data.mongodb.repository.PersonRepositoryTransactionalTests
21-Jun-2019 03:34:31 [WARNING] Tests run: 1, Failures: 0, Errors: 0, Skipped: 1, Time elapsed: 0.006 s - in org.springframework.data.mongodb.repository.PersonRepositoryTransactionalTests
21-Jun-2019 03:34:31 [INFO] Running org.springframework.data.mongodb.repository.ReactiveMongoRepositoryTests
21-Jun-2019 03:34:32 [INFO] Tests run: 29, Failures: 0, Errors: 0, Skipped: 0, Time elapsed: 1.87 s - in org.springframework.data.mongodb.repository.ReactiveMongoRepositoryTests
21-Jun-2019 03:34:32 [INFO] Running org.springframework.data.mongodb.repository.MongoRepositoryTextSearchIntegrationTests
21-Jun-2019 03:34:33 [INFO] Tests run: 8, Failures: 0, Errors: 0, Skipped: 0, Time elapsed: 0.726 s - in org.springframework.data.mongodb.repository.MongoRepositoryTextSearchIntegrationTests
21-Jun-2019 03:34:33 [INFO] Running org.springframework.data.mongodb.repository.query.ConvertingParameterAccessorUnitTests
21-Jun-2019 03:34:33 [INFO] Tests run: 5, Failures: 0, Errors: 0, Skipped: 0, Time elapsed: 0.019 s - in org.springframework.data.mongodb.repository.query.ConvertingParameterAccessorUnitTests
21-Jun-2019 03:34:33 [INFO] Running org.springframework.data.mongodb.repository.query.MappingMongoEntityInformationUnitTests
21-Jun-2019 03:34:33 [INFO] Tests run: 3, Failures: 0, Errors: 0, Skipped: 0, Time elapsed: 0.001 s - in org.springframework.data.mongodb.repository.query.MappingMongoEntityInformationUnitTests
21-Jun-2019 03:34:33 [INFO] Running org.springframework.data.mongodb.repository.query.ReactiveStringBasedAggregationUnitTests
21-Jun-2019 03:34:33 [INFO] Tests run: 7, Failures: 0, Errors: 0, Skipped: 0, Time elapsed: 0.035 s - in org.springframework.data.mongodb.repository.query.ReactiveStringBasedAggregationUnitTests
21-Jun-2019 03:34:33 [INFO] Running org.springframework.data.mongodb.repository.query.MongoQueryExecutionUnitTests
21-Jun-2019 03:34:33 [INFO] Tests run: 5, Failures: 0, Errors: 0, Skipped: 0, Time elapsed: 0.048 s - in org.springframework.data.mongodb.repository.query.MongoQueryExecutionUnitTests
21-Jun-2019 03:34:33 [INFO] Running org.springframework.data.mongodb.repository.query.MongoParametersParameterAccessorUnitTests
21-Jun-2019 03:34:33 [INFO] Tests run: 6, Failures: 0, Errors: 0, Skipped: 0, Time elapsed: 0.009 s - in org.springframework.data.mongodb.repository.query.MongoParametersParameterAccessorUnitTests
21-Jun-2019 03:34:33 [INFO] Running org.springframework.data.mongodb.repository.query.StringBasedMongoQueryUnitTests
21-Jun-2019 03:34:33 [INFO] Tests run: 45, Failures: 0, Errors: 0, Skipped: 0, Time elapsed: 0.17 s - in org.springframework.data.mongodb.repository.query.StringBasedMongoQueryUnitTests
21-Jun-2019 03:34:33 [INFO] Running org.springframework.data.mongodb.repository.query.ReactiveMongoQueryExecutionUnitTests
21-Jun-2019 03:34:33 [INFO] Tests run: 2, Failures: 0, Errors: 0, Skipped: 0, Time elapsed: 0.003 s - in org.springframework.data.mongodb.repository.query.ReactiveMongoQueryExecutionUnitTests
21-Jun-2019 03:34:33 [INFO] Running org.springframework.data.mongodb.repository.query.AbstractReactiveMongoQueryUnitTests
21-Jun-2019 03:34:34 [INFO] Tests run: 11, Failures: 0, Errors: 0, Skipped: 0, Time elapsed: 0.086 s - in org.springframework.data.mongodb.repository.query.AbstractReactiveMongoQueryUnitTests
21-Jun-2019 03:34:34 [INFO] Running org.springframework.data.mongodb.repository.query.MongoQueryCreatorUnitTests
21-Jun-2019 03:34:34 [INFO] Tests run: 52, Failures: 0, Errors: 0, Skipped: 0, Time elapsed: 0.08 s - in org.springframework.data.mongodb.repository.query.MongoQueryCreatorUnitTests
21-Jun-2019 03:34:34 [INFO] Running org.springframework.data.mongodb.repository.query.MongoQueryMethodUnitTests
21-Jun-2019 03:34:34 [INFO] Tests run: 20, Failures: 0, Errors: 0, Skipped: 0, Time elapsed: 0.017 s - in org.springframework.data.mongodb.repository.query.MongoQueryMethodUnitTests
21-Jun-2019 03:34:34 [INFO] Running org.springframework.data.mongodb.repository.query.ReactiveStringBasedMongoQueryUnitTests
21-Jun-2019 03:34:34 [INFO] Tests run: 12, Failures: 0, Errors: 0, Skipped: 0, Time elapsed: 0.036 s - in org.springframework.data.mongodb.repository.query.ReactiveStringBasedMongoQueryUnitTests
21-Jun-2019 03:34:34 [INFO] Running org.springframework.data.mongodb.repository.query.PartTreeMongoQueryUnitTests
21-Jun-2019 03:34:34 [INFO] Tests run: 14, Failures: 0, Errors: 0, Skipped: 0, Time elapsed: 0.061 s - in org.springframework.data.mongodb.repository.query.PartTreeMongoQueryUnitTests
21-Jun-2019 03:34:34 [INFO] Running org.springframework.data.mongodb.repository.query.AbstractMongoQueryUnitTests
21-Jun-2019 03:34:34 [INFO] Tests run: 26, Failures: 0, Errors: 0, Skipped: 0, Time elapsed: 0.109 s - in org.springframework.data.mongodb.repository.query.AbstractMongoQueryUnitTests
21-Jun-2019 03:34:34 [INFO] Running org.springframework.data.mongodb.repository.query.MongoParametersUnitTests
21-Jun-2019 03:34:34 [INFO] Tests run: 13, Failures: 0, Errors: 0, Skipped: 0, Time elapsed: 0 s - in org.springframework.data.mongodb.repository.query.MongoParametersUnitTests
21-Jun-2019 03:34:34 [INFO] Running org.springframework.data.mongodb.repository.query.ReactiveMongoQueryMethodUnitTests
21-Jun-2019 03:34:34 [INFO] Tests run: 13, Failures: 0, Errors: 0, Skipped: 0, Time elapsed: 0.013 s - in org.springframework.data.mongodb.repository.query.ReactiveMongoQueryMethodUnitTests
21-Jun-2019 03:34:34 [INFO] Running org.springframework.data.mongodb.repository.query.StringBasedAggregationUnitTests
21-Jun-2019 03:34:34 [INFO] Tests run: 11, Failures: 0, Errors: 0, Skipped: 0, Time elapsed: 0.051 s - in org.springframework.data.mongodb.repository.query.StringBasedAggregationUnitTests
21-Jun-2019 03:34:34 [INFO] Running org.springframework.data.mongodb.SessionAwareMethodInterceptorUnitTests
21-Jun-2019 03:34:34 [INFO] Tests run: 9, Failures: 0, Errors: 0, Skipped: 0, Time elapsed: 0.006 s - in org.springframework.data.mongodb.SessionAwareMethodInterceptorUnitTests
21-Jun-2019 03:34:34 [INFO] Running org.springframework.data.mongodb.ReactiveTransactionIntegrationTests
21-Jun-2019 03:34:34 [WARNING] Tests run: 1, Failures: 0, Errors: 0, Skipped: 1, Time elapsed: 0.015 s - in org.springframework.data.mongodb.ReactiveTransactionIntegrationTests
21-Jun-2019 03:34:34 [INFO] Running org.springframework.data.mongodb.ReactiveMongoTransactionManagerUnitTests
21-Jun-2019 03:34:34 [INFO] Tests run: 6, Failures: 0, Errors: 0, Skipped: 0, Time elapsed: 0.06 s - in org.springframework.data.mongodb.ReactiveMongoTransactionManagerUnitTests
21-Jun-2019 03:34:34 [INFO] Running org.springframework.data.mongodb.util.json.ParameterBindingJsonReaderUnitTests
21-Jun-2019 03:34:34 [INFO] Tests run: 16, Failures: 0, Errors: 0, Skipped: 0, Time elapsed: 0.007 s - in org.springframework.data.mongodb.util.json.ParameterBindingJsonReaderUnitTests
21-Jun-2019 03:34:34 [INFO] Running ConfigClassInDefaultPackageUnitTests
21-Jun-2019 03:34:34 [INFO] Tests run: 1, Failures: 0, Errors: 0, Skipped: 0, Time elapsed: 0.008 s - in ConfigClassInDefaultPackageUnitTests
21-Jun-2019 03:34:36 [INFO]
21-Jun-2019 03:34:36 [INFO] Results:
21-Jun-2019 03:34:36 [INFO]
21-Jun-2019 03:34:36 [WARNING] Tests run: 4067, Failures: 0, Errors: 0, Skipped: 40
21-Jun-2019 03:34:36 [INFO]
21-Jun-2019 03:34:36 [INFO]
21-Jun-2019 03:34:36 [INFO] --- build-helper-maven-plugin:3.0.0:add-source (add-kotlin-source) @ spring-data-mongodb ---
21-Jun-2019 03:34:36 [INFO] Source directory: /opt/bamboo-home/xml-data/build-dir/SPRINGDATAMONGODB-MONGOSONAR-JOB1/spring-data-mongodb/src/main/kotlin added.
21-Jun-2019 03:34:36 [INFO]
21-Jun-2019 03:34:36 [INFO] --- maven-jar-plugin:3.1.0:jar (default-jar) @ spring-data-mongodb ---
21-Jun-2019 03:34:36 [INFO] Building jar: /opt/bamboo-home/xml-data/build-dir/SPRINGDATAMONGODB-MONGOSONAR-JOB1/spring-data-mongodb/target/spring-data-mongodb-2.2.0.BUILD-SNAPSHOT.jar
21-Jun-2019 03:34:36 [INFO]
21-Jun-2019 03:34:36 [INFO] >>> maven-source-plugin:3.1.0:jar (attach-sources) > generate-sources @ spring-data-mongodb >>>
21-Jun-2019 03:34:36 [INFO]
21-Jun-2019 03:34:36 [INFO] --- maven-enforcer-plugin:1.4.1:enforce (enforce-maven-version) @ spring-data-mongodb ---
21-Jun-2019 03:34:36 [INFO]
21-Jun-2019 03:34:36 [INFO] <<< maven-source-plugin:3.1.0:jar (attach-sources) < generate-sources @ spring-data-mongodb <<<
21-Jun-2019 03:34:36 [INFO]
21-Jun-2019 03:34:36 [INFO]
21-Jun-2019 03:34:36 [INFO] --- maven-source-plugin:3.1.0:jar (attach-sources) @ spring-data-mongodb ---
21-Jun-2019 03:34:36 [INFO] Building jar: /opt/bamboo-home/xml-data/build-dir/SPRINGDATAMONGODB-MONGOSONAR-JOB1/spring-data-mongodb/target/spring-data-mongodb-2.2.0.BUILD-SNAPSHOT-sources.jar
21-Jun-2019 03:34:36 [INFO]
21-Jun-2019 03:34:36 [INFO] -----< org.springframework.data:spring-data-mongodb-distribution >------
21-Jun-2019 03:34:36 [INFO] Building Spring Data MongoDB - Distribution 2.2.0.BUILD-SNAPSHOT   [3/3]
21-Jun-2019 03:34:36 [INFO] --------------------------------[ pom ]---------------------------------
21-Jun-2019 03:34:36 [INFO]
21-Jun-2019 03:34:36 [INFO] --- maven-clean-plugin:2.5:clean (default-clean) @ spring-data-mongodb-distribution ---
21-Jun-2019 03:34:36 [INFO]
21-Jun-2019 03:34:36 [INFO] --- maven-enforcer-plugin:1.4.1:enforce (enforce-maven-version) @ spring-data-mongodb-distribution ---
21-Jun-2019 03:34:36 [INFO]
21-Jun-2019 03:34:36 [INFO] --- kotlin-maven-plugin:1.3.31:compile (compile) @ spring-data-mongodb-distribution ---
21-Jun-2019 03:34:36 [WARNING] No sources found skipping Kotlin compile
21-Jun-2019 03:34:36 [INFO]
21-Jun-2019 03:34:36 [INFO] --- maven-compiler-plugin:3.8.1:compile (java-compile) @ spring-data-mongodb-distribution ---
21-Jun-2019 03:34:36 [INFO] No sources to compile
21-Jun-2019 03:34:36 [INFO]
21-Jun-2019 03:34:36 [INFO] --- kotlin-maven-plugin:1.3.31:test-compile (test-compile) @ spring-data-mongodb-distribution ---
21-Jun-2019 03:34:36 [WARNING] No sources found skipping Kotlin compile
21-Jun-2019 03:34:36 [INFO]
21-Jun-2019 03:34:36 [INFO] --- maven-compiler-plugin:3.8.1:testCompile (java-test-compile) @ spring-data-mongodb-distribution ---
21-Jun-2019 03:34:36 [INFO] No sources to compile
21-Jun-2019 03:34:36 [INFO]
21-Jun-2019 03:34:36 [INFO] --- build-helper-maven-plugin:3.0.0:add-source (add-kotlin-source) @ spring-data-mongodb-distribution ---
21-Jun-2019 03:34:36 [INFO] Source directory: /opt/bamboo-home/xml-data/build-dir/SPRINGDATAMONGODB-MONGOSONAR-JOB1/spring-data-mongodb-distribution/src/main/kotlin added.
21-Jun-2019 03:34:36 [INFO]
21-Jun-2019 03:34:36 [INFO] >>> maven-source-plugin:3.1.0:jar (attach-sources) > generate-sources @ spring-data-mongodb-distribution >>>
21-Jun-2019 03:34:36 [INFO]
21-Jun-2019 03:34:36 [INFO] --- maven-enforcer-plugin:1.4.1:enforce (enforce-maven-version) @ spring-data-mongodb-distribution ---
21-Jun-2019 03:34:36 [INFO]
21-Jun-2019 03:34:36 [INFO] <<< maven-source-plugin:3.1.0:jar (attach-sources) < generate-sources @ spring-data-mongodb-distribution <<<
21-Jun-2019 03:34:36 [INFO]
21-Jun-2019 03:34:36 [INFO]
21-Jun-2019 03:34:36 [INFO] --- maven-source-plugin:3.1.0:jar (attach-sources) @ spring-data-mongodb-distribution ---
21-Jun-2019 03:34:36 [INFO] ------------------------------------------------------------------------
21-Jun-2019 03:34:36 [INFO] Reactor Summary:
21-Jun-2019 03:34:36 [INFO]
21-Jun-2019 03:34:36 [INFO] Spring Data MongoDB 2.2.0.BUILD-SNAPSHOT ........... SUCCESS [  0.725 s]
21-Jun-2019 03:34:36 [INFO] Spring Data MongoDB - Core ......................... SUCCESS [03:05 min]
21-Jun-2019 03:34:36 [INFO] Spring Data MongoDB - Distribution 2.2.0.BUILD-SNAPSHOT SUCCESS [  0.014 s]
21-Jun-2019 03:34:36 [INFO] ------------------------------------------------------------------------
21-Jun-2019 03:34:36 [INFO] BUILD SUCCESS
21-Jun-2019 03:34:36 [INFO] ------------------------------------------------------------------------
21-Jun-2019 03:34:36 [INFO] Total time: 03:06 min
21-Jun-2019 03:34:36 [INFO] Finished at: 2019-06-21T03:34:36Z
21-Jun-2019 03:34:36 [INFO] ------------------------------------------------------------------------
21-Jun-2019 03:34:37 Parsing test results under /opt/bamboo-home/xml-data/build-dir/SPRINGDATAMONGODB-MONGOSONAR-JOB1...
21-Jun-2019 03:34:37 Finished task 'Build for Sonar' with result: Success
21-Jun-2019 03:34:37 Starting task 'Sonar' of type 'ch.mibex.bamboo.sonar4bamboo:sonar4bamboo.maven3task'
21-Jun-2019 03:34:37
Substituting password variable: ${bamboo.sonar.token.password}
21-Jun-2019 03:34:37 SONAR4BAMBOO: Using capability system.builder.mvn3.Maven 3.5 with value: /opt/maven-3.5
21-Jun-2019 03:34:37 SONAR4BAMBOO: Using capability system.builder.mvn3.Maven 3.5 with value: /opt/maven-3.5
21-Jun-2019 03:34:37 SONAR4BAMBOO: Will use  as sonar.branch.
21-Jun-2019 03:34:37
Beginning to execute external process for build 'Spring Data MongoDB - Spring Data MongoDB - Sonar - Default Job #2593 (SPRINGDATAMONGODB-MONGOSONAR-JOB1-2593)'
... running command line:
/opt/maven-3.5/bin/mvn sonar:sonar -Dsonar.host.url=http://sonar.af.pivotal.io:8080 -Dsonar.login=****** ... in: /opt/bamboo-home/xml-data/build-dir/SPRINGDATAMONGODB-MONGOSONAR-JOB1
... using extra environment variables:
bamboo_planRepository_1_branch=master
bamboo_********_username_password=********
bamboo_signing_store_password=********
bamboo_capability_system_builder_ant_Ant_1_9=/opt/ant-1.9
bamboo_repository_108331052_revision_number=31f8a63a171c59b64361c4d77d6eebfa1637b5b5
bamboo_capability_system_builder_ant_Ant_1_8=/opt/ant-1.8
bamboo_planRepository_1_branchDisplayName=master
bamboo_artifactory_override_resolve_repo=libs-milestone
bamboo_capability_system_builder_node_Node_js_10_16=/opt/node-10.16/bin/node
bamboo_repository_revision_number=31f8a63a171c59b64361c4d77d6eebfa1637b5b5
MAVEN2_HOME=/opt/maven-3.5
bamboo_RIAK_BIN=/usr/sbin/riak
bamboo_buildKey=SPRINGDATAMONGODB-MONGOSONAR-JOB1
bamboo_bintray_password=********
bamboo_sonar_token_password=********
bamboo_shortJobName=Default Job
bamboo_artifactory_override_resolver_password=********
bamboo_sonatype_token=RSJChaox
bamboo_capability_system_builder_gradle___gradlew=./gradlew
bamboo_buildResultsUrl=https://build.spring.io/browse/SPRINGDATAMONGODB-MONGOSONAR-JOB1-2593
bamboo_capability_system_builder_mvn3_Maven_3_3=/opt/maven-3.3
bamboo_capability_system_builder_mvn3_Maven_3_2=/opt/maven-3.2
bamboo_capability_system_builder_mvn3_Maven_3_1=/opt/maven-3.1
bamboo_planRepository_repositoryUrl=git://github.com/SpringSource/spring-data-mongodb.git
bamboo_capability_system_builder_mvn3_Maven_3_6=/opt/maven-3.6
bamboo_agentId=286195717
bamboo_capability_system_builder_mvn3_Maven_3_5=/opt/maven-3.5
bamboo_capability_system_builder_mvn3_Maven_3_0=/opt/maven-3.0
bamboo_repository_108331052_branch_name=master
bamboo_planRepository_revision=31f8a63a171c59b64361c4d77d6eebfa1637b5b5
bamboo_planRepository_previousRevision=31f8a63a171c59b64361c4d77d6eebfa1637b5b5
bamboo_capability_remote_build=true
bamboo_repository_branch_name=master
bamboo_sonatype_token_password=********
bamboo_sonatype_user=springsource
bamboo_scdf_acceptance_tests_password=********
JAVA_HOME=/opt/jdk-8
bamboo_repository_108331052_previous_revision_number=31f8a63a171c59b64361c4d77d6eebfa1637b5b5
bamboo_planRepository_branch=master
bamboo_planRepository_1_type=gitv2
bamboo_planRepository_branchName=master
bamboo_capability_system_jdk_JDK_12=/opt/jdk-12
bamboo_capability_system_builder_ant_Ant_1_10=/opt/ant-1.10
bamboo_sonar_password=********
bamboo_hg_cache_directory=/opt/bamboo-home/xml-data/build-dir/_hg-repositories-cache
bamboo_planRepository_1_username=
bamboo_planRepository_type=gitv2
bamboo_git_cache_directory=/opt/bamboo-home/xml-data/build-dir/_git-repositories-cache
bamboo_build_commandline_com_atlassian_bamboo_plugins_maven_task_builder_mvn3_3=/opt/maven-3.5/bin/mvn -Djava.io.tmpdir=/tmp/SPRINGDATAMONGODB-MONGOSONAR-JOB1 clean verify -B -Dmaven.test.failure.ignore=true
bamboo_artifactory_username=buildmaster
bamboo_tmp_directory=/opt/bamboo-home/temp
bamboo_planKey=SPRINGDATAMONGODB-MONGOSONAR
bamboo_planRepository_username=
bamboo_JDK8_HOME=/opt/jdk-8
bamboo_planRepository_1_branchName=master
bamboo_sonar_version=5.6.3
bamboo_sonar_jdbc_password=********
bamboo_bintray_api_key_password=********
bamboo_repository_108331052_git_branch=master
bamboo_capability_system_jdk_JDK_1_11=/opt/jdk-11
bamboo_resultsUrl=https://build.spring.io/browse/SPRINGDATAMONGODB-MONGOSONAR-JOB1-2593
bamboo_capability_system_jdk_JDK_1_10=/opt/jdk-10
bamboo_build_working_directory=/opt/bamboo-home/xml-data/build-dir/SPRINGDATAMONGODB-MONGOSONAR-JOB1
bamboo_planRepository_1_name=Plan Repository
bamboo_capability_system_os=ubuntu1804
bamboo_repository_108331052_git_repositoryUrl=git://github.com/SpringSource/spring-data-mongodb.git
bamboo_nexusPush_stagingProfile=buildmaster
bamboo_shortPlanName=Spring Data MongoDB - Sonar
bamboo_repository_108331052_git_username=
bamboo_planRepository_name=Plan Repository
bamboo_buildNumber=2593
bamboo_repository_108331052_name=Plan Repository
bamboo_planName=Spring Data MongoDB - Spring Data MongoDB - Sonar
bamboo_JDK7_HOME=/opt/jdk-7
bamboo_shortPlanKey=MONGOSONAR
bamboo_shortJobKey=JOB1
bamboo_artifactory_password=********
bamboo_buildTimeStamp=2019-06-21T03:30:01.477Z
bamboo_repository_previous_revision_number=31f8a63a171c59b64361c4d77d6eebfa1637b5b5
bamboo_sonar_username=buildmaster
bamboo_********_password=********
M2_HOME=/opt/maven-3.5
bamboo_repository_git_branch=master
bamboo_buildResultKey=SPRINGDATAMONGODB-MONGOSONAR-JOB1-2593
bamboo_nexusPush_close=true
bamboo_artifactory_override_resolver_username=buildmaster
bamboo_buildPlanName=Spring Data MongoDB - Spring Data MongoDB - Sonar - Default Job
bamboo_planRepository_1_revision=31f8a63a171c59b64361c4d77d6eebfa1637b5b5
bamboo_repository_name=Plan Repository
bamboo_signing_key_password=********
bamboo_capability_system_builder_groovy_Groovy_2_5=/opt/groovy-2.5
bamboo_buildFailed=false
bamboo_capability_system_docker_executable=/usr/bin/docker
bamboo_capability_system_jdk_OpenJDK_7=/opt/jdk-7
bamboo_capability_system_builder_groovy_Groovy_2_4=/opt/groovy-2.4
bamboo_artifactory_override_deployer_username=buildmaster
bamboo_capability_system_builder_command_Bash=/bin/bash
bamboo_agentWorkingDirectory=/opt/bamboo-home/xml-data/build-dir
bamboo_capability_system_git_executable=/usr/bin/git
bamboo_repository_git_username=
bamboo_planRepository_1_previousRevision=31f8a63a171c59b64361c4d77d6eebfa1637b5b5
bamboo_capability_os_family=unix
bamboo_planRepository_branchDisplayName=master
bamboo_capability_system_builder_maven_Artifactory_Maven_3_6=/opt/maven-3.6
bamboo_capability_system_builder_maven_Artifactory_Maven_3_5=/opt/maven-3.5
bamboo_capability_system_builder_maven_Artifactory_Maven_3_3=/opt/maven-3.3
bamboo_capability_system_builder_maven_Artifactory_Maven_3_2=/opt/maven-3.2
bamboo_s3_properties=/home/bamboo/tools/s3.properties
bamboo_capability_system_builder_maven_Artifactory_Maven_3_1=/opt/maven-3.1
bamboo_artifactory_override_deploy_repo=libs-snapshot-local
bamboo_capability_system_builder_maven_Artifactory_Maven_3_0=/opt/maven-3.0
bamboo_plan_storageTag=SPRINGDATAMONGODB-MONGOSONAR
bamboo_bintray_username_password=********
bamboo_repository_git_repositoryUrl=git://github.com/SpringSource/spring-data-mongodb.git
bamboo_working_directory=/opt/bamboo-home/xml-data/build-dir/SPRINGDATAMONGODB-MONGOSONAR-JOB1
bamboo_planRepository_1_repositoryUrl=git://github.com/SpringSource/spring-data-mongodb.git
bamboo_capability_system_jdk_JDK_1_8=/opt/jdk-8
bamboo_artifactory_override_deployer_password=********
bamboo_capability_system_jdk_JDK_1_9=/opt/jdk-9
bamboo_capability_system_jdk_JDK_1_6=/opt/jdk-6
bamboo_sonatype_password=********
bamboo_capability_system_jdk_JDK_1_7=/opt/jdk-7
bamboo_sonar_ip=10.194.6.9
PATH=/opt/jdk-8/bin:/bin:/home/bamboo/bin:/usr/local/sbin:/usr/local/bin:/usr/sbin:/usr/bin:/sbin:/bin:/usr/games:/usr/local/games:/snap/bin:/home/bamboo/bin:/usr/local/bin
21-Jun-2019 03:34:38 [INFO] Scanning for projects...
21-Jun-2019 03:34:38 [INFO] ------------------------------------------------------------------------
21-Jun-2019 03:34:38 [INFO] Reactor Build Order:
21-Jun-2019 03:34:38 [INFO]
21-Jun-2019 03:34:38 [INFO] Spring Data MongoDB                                                [pom]
21-Jun-2019 03:34:38 [INFO] Spring Data MongoDB - Core                                         [jar]
21-Jun-2019 03:34:38 [INFO] Spring Data MongoDB - Distribution                                 [pom]
21-Jun-2019 03:34:38 Downloading from spring-libs-milestone: https://repo.spring.io/libs-milestone/org/codehaus/mojo/maven-metadata.xml
21-Jun-2019 03:34:38 Downloading from spring-libs-milestone: https://repo.spring.io/libs-milestone/org/apache/maven/plugins/maven-metadata.xml
21-Jun-2019 03:34:38 Downloading from spring-plugins-release: https://repo.spring.io/plugins-release/org/codehaus/mojo/maven-metadata.xml
21-Jun-2019 03:34:38 Downloading from spring-plugins-release: https://repo.spring.io/plugins-release/org/apache/maven/plugins/maven-metadata.xml
21-Jun-2019 03:34:39 Progress (1): 0.6/19 kB
21-Jun-2019 03:34:39 Progress (2): 0.6/19 kB | 0.6/27 kB
21-Jun-2019 03:34:39 Progress (2): 0.6/19 kB | 2.0/27 kB
21-Jun-2019 03:34:39 Progress (2): 0.6/19 kB | 3.3/27 kB
21-Jun-2019 03:34:39 Progress (3): 0.6/19 kB | 3.3/27 kB | 0.6/27 kB
21-Jun-2019 03:34:39 Progress (3): 2.0/19 kB | 3.3/27 kB | 0.6/27 kB
21-Jun-2019 03:34:39 Progress (3): 2.0/19 kB | 3.3/27 kB | 2.0/27 kB
21-Jun-2019 03:34:39 Progress (3): 3.3/19 kB | 3.3/27 kB | 2.0/27 kB
21-Jun-2019 03:34:39 Progress (3): 3.3/19 kB | 3.3/27 kB | 3.3/27 kB
21-Jun-2019 03:34:39 Progress (3): 4.7/19 kB | 3.3/27 kB | 3.3/27 kB
21-Jun-2019 03:34:39 Progress (3): 4.7/19 kB | 3.3/27 kB | 4.7/27 kB
21-Jun-2019 03:34:39 Progress (3): 6.1/19 kB | 3.3/27 kB | 4.7/27 kB
21-Jun-2019 03:34:39 Progress (3): 7.4/19 kB | 3.3/27 kB | 4.7/27 kB
21-Jun-2019 03:34:39 Progress (3): 8.8/19 kB | 3.3/27 kB | 4.7/27 kB
21-Jun-2019 03:34:39 Progress (3): 8.8/19 kB | 3.3/27 kB | 6.1/27 kB
21-Jun-2019 03:34:39 Progress (3): 8.8/19 kB | 3.3/27 kB | 7.4/27 kB
21-Jun-2019 03:34:39 Progress (3): 8.8/19 kB | 3.3/27 kB | 8.8/27 kB
21-Jun-2019 03:34:39 Progress (3): 8.8/19 kB | 3.3/27 kB | 10/27 kB
21-Jun-2019 03:34:39 Progress (3): 8.8/19 kB | 3.3/27 kB | 12/27 kB
21-Jun-2019 03:34:39 Progress (3): 8.8/19 kB | 3.3/27 kB | 13/27 kB
21-Jun-2019 03:34:39 Progress (3): 8.8/19 kB | 3.3/27 kB | 13/27 kB
21-Jun-2019 03:34:39 Progress (3): 8.8/19 kB | 3.3/27 kB | 15/27 kB
21-Jun-2019 03:34:39 Progress (3): 8.8/19 kB | 3.3/27 kB | 15/27 kB
21-Jun-2019 03:34:39 Progress (3): 8.8/19 kB | 3.3/27 kB | 16/27 kB
21-Jun-2019 03:34:39 Progress (3): 8.8/19 kB | 3.3/27 kB | 18/27 kB
21-Jun-2019 03:34:39 Progress (3): 8.8/19 kB | 3.3/27 kB | 19/27 kB
21-Jun-2019 03:34:39 Progress (3): 8.8/19 kB | 3.3/27 kB | 20/27 kB
21-Jun-2019 03:34:39 Progress (3): 8.8/19 kB | 3.3/27 kB | 20/27 kB
21-Jun-2019 03:34:39 Progress (3): 8.8/19 kB | 3.3/27 kB | 22/27 kB
21-Jun-2019 03:34:39 Progress (3): 8.8/19 kB | 3.3/27 kB | 23/27 kB
21-Jun-2019 03:34:39 Progress (3): 8.8/19 kB | 3.3/27 kB | 24/27 kB
21-Jun-2019 03:34:39 Progress (3): 8.8/19 kB | 4.7/27 kB | 24/27 kB
21-Jun-2019 03:34:39 Progress (4): 8.8/19 kB | 4.7/27 kB | 24/27 kB | 0.6/19 kB
21-Jun-2019 03:34:39 Progress (4): 10/19 kB | 4.7/27 kB | 24/27 kB | 0.6/19 kB
21-Jun-2019 03:34:39 Progress (4): 10/19 kB | 6.1/27 kB | 24/27 kB | 0.6/19 kB
21-Jun-2019 03:34:39 Progress (4): 10/19 kB | 7.4/27 kB | 24/27 kB | 0.6/19 kB
21-Jun-2019 03:34:39 Progress (4): 10/19 kB | 8.8/27 kB | 24/27 kB | 0.6/19 kB
21-Jun-2019 03:34:39 Progress (4): 10/19 kB | 10/27 kB | 24/27 kB | 0.6/19 kB
21-Jun-2019 03:34:39 Progress (4): 10/19 kB | 12/27 kB | 24/27 kB | 0.6/19 kB
21-Jun-2019 03:34:39 Progress (4): 10/19 kB | 13/27 kB | 24/27 kB | 0.6/19 kB
21-Jun-2019 03:34:39 Progress (4): 10/19 kB | 14/27 kB | 24/27 kB | 0.6/19 kB
21-Jun-2019 03:34:39 Progress (4): 10/19 kB | 16/27 kB | 24/27 kB | 0.6/19 kB
21-Jun-2019 03:34:39 Progress (4): 10/19 kB | 16/27 kB | 24/27 kB | 2.0/19 kB
21-Jun-2019 03:34:39 Progress (4): 12/19 kB | 16/27 kB | 24/27 kB | 2.0/19 kB
21-Jun-2019 03:34:39 Progress (4): 12/19 kB | 16/27 kB | 26/27 kB | 2.0/19 kB
21-Jun-2019 03:34:39 Progress (4): 12/19 kB | 16/27 kB | 27 kB | 2.0/19 kB   
21-Jun-2019 03:34:39 Progress (4): 12/19 kB | 17/27 kB | 27 kB | 2.0/19 kB
21-Jun-2019 03:34:39 Progress (4): 12/19 kB | 17/27 kB | 27 kB | 2.1/19 kB
21-Jun-2019 03:34:39 Progress (4): 13/19 kB | 17/27 kB | 27 kB | 2.1/19 kB
21-Jun-2019 03:34:39 Progress (4): 13/19 kB | 17/27 kB | 27 kB | 3.4/19 kB
21-Jun-2019 03:34:39 Progress (4): 14/19 kB | 17/27 kB | 27 kB | 3.4/19 kB
21-Jun-2019 03:34:39 Progress (4): 16/19 kB | 17/27 kB | 27 kB | 3.4/19 kB
21-Jun-2019 03:34:39 Progress (4): 17/19 kB | 17/27 kB | 27 kB | 3.4/19 kB
21-Jun-2019 03:34:39 Progress (4): 17/19 kB | 18/27 kB | 27 kB | 3.4/19 kB
21-Jun-2019 03:34:39 Progress (4): 17/19 kB | 18/27 kB | 27 kB | 4.8/19 kB
21-Jun-2019 03:34:39 Progress (4): 18/19 kB | 18/27 kB | 27 kB | 4.8/19 kB
21-Jun-2019 03:34:39 Progress (4): 18/19 kB | 18/27 kB | 27 kB | 6.2/19 kB
21-Jun-2019 03:34:39 Progress (4): 19 kB | 18/27 kB | 27 kB | 6.2/19 kB   
21-Jun-2019 03:34:39 Progress (4): 19 kB | 18/27 kB | 27 kB | 7.5/19 kB
21-Jun-2019 03:34:39 Progress (4): 19 kB | 18/27 kB | 27 kB | 8.9/19 kB
21-Jun-2019 03:34:39 Progress (4): 19 kB | 18/27 kB | 27 kB | 10/19 kB
21-Jun-2019 03:34:39 Progress (4): 19 kB | 18/27 kB | 27 kB | 12/19 kB
21-Jun-2019 03:34:39 Progress (4): 19 kB | 18/27 kB | 27 kB | 13/19 kB
21-Jun-2019 03:34:39 Progress (4): 19 kB | 18/27 kB | 27 kB | 13/19 kB
21-Jun-2019 03:34:39 Progress (4): 19 kB | 18/27 kB | 27 kB | 15/19 kB
21-Jun-2019 03:34:39 Progress (4): 19 kB | 18/27 kB | 27 kB | 16/19 kB
21-Jun-2019 03:34:39 Progress (4): 19 kB | 18/27 kB | 27 kB | 17/19 kB
21-Jun-2019 03:34:39 Progress (4): 19 kB | 20/27 kB | 27 kB | 17/19 kB
21-Jun-2019 03:34:39 Progress (4): 19 kB | 21/27 kB | 27 kB | 17/19 kB
21-Jun-2019 03:34:39 Progress (4): 19 kB | 22/27 kB | 27 kB | 17/19 kB
21-Jun-2019 03:34:39 Progress (4): 19 kB | 24/27 kB | 27 kB | 17/19 kB
21-Jun-2019 03:34:39 Progress (4): 19 kB | 24/27 kB | 27 kB | 19 kB   
21-Jun-2019 03:34:39 Progress (4): 19 kB | 25/27 kB | 27 kB | 19 kB
21-Jun-2019 03:34:39 Progress (4): 19 kB | 27/27 kB | 27 kB | 19 kB
21-Jun-2019 03:34:39 Progress (4): 19 kB | 27 kB | 27 kB | 19 kB   
21-Jun-2019 03:34:39                                            
21-Jun-2019 03:34:39 Downloaded from spring-libs-milestone: https://repo.spring.io/libs-milestone/org/apache/maven/plugins/maven-metadata.xml (19 kB at 31 kB/s)
21-Jun-2019 03:34:39 Downloaded from spring-plugins-release: https://repo.spring.io/plugins-release/org/apache/maven/plugins/maven-metadata.xml (19 kB at 29 kB/s)
21-Jun-2019 03:34:39 Downloaded from spring-plugins-release: https://repo.spring.io/plugins-release/org/codehaus/mojo/maven-metadata.xml (27 kB at 42 kB/s)
21-Jun-2019 03:34:39 Downloaded from spring-libs-milestone: https://repo.spring.io/libs-milestone/org/codehaus/mojo/maven-metadata.xml (27 kB at 42 kB/s)
21-Jun-2019 03:34:39 Downloading from spring-plugins-release: https://repo.spring.io/plugins-release/org/codehaus/mojo/sonar-maven-plugin/maven-metadata.xml
21-Jun-2019 03:34:39 Downloading from spring-libs-milestone: https://repo.spring.io/libs-milestone/org/codehaus/mojo/sonar-maven-plugin/maven-metadata.xml
21-Jun-2019 03:34:39 Progress (1): 0.6/1.1 kB
21-Jun-2019 03:34:39 Progress (1): 1.1 kB   
21-Jun-2019 03:34:39                    
21-Jun-2019 03:34:39 Downloaded from spring-libs-milestone: https://repo.spring.io/libs-milestone/org/codehaus/mojo/sonar-maven-plugin/maven-metadata.xml (1.1 kB at 3.6 kB/s)
21-Jun-2019 03:34:39 Progress (1): 0.6/1.1 kB
21-Jun-2019 03:34:39 Progress (1): 1.1 kB   
21-Jun-2019 03:34:39                    
21-Jun-2019 03:34:39 Downloaded from spring-plugins-release: https://repo.spring.io/plugins-release/org/codehaus/mojo/sonar-maven-plugin/maven-metadata.xml (1.1 kB at 2.3 kB/s)
21-Jun-2019 03:34:40 [INFO]
21-Jun-2019 03:34:40 [INFO] --------< org.springframework.data:spring-data-mongodb-parent >---------
21-Jun-2019 03:34:40 [INFO] Building Spring Data MongoDB 2.2.0.BUILD-SNAPSHOT                  [1/3]
21-Jun-2019 03:34:40 [INFO] --------------------------------[ pom ]---------------------------------
21-Jun-2019 03:34:40 [INFO]
21-Jun-2019 03:34:40 [INFO] --- sonar-maven-plugin:3.6.0.1398:sonar (default-cli) @ spring-data-mongodb-parent ---
21-Jun-2019 03:34:40 [INFO] User cache: /home/bamboo/.sonar/cache
21-Jun-2019 03:34:40 [INFO] SonarQube version: 6.7.7
21-Jun-2019 03:34:40 [INFO] Default locale: "en_US", source code encoding: "UTF-8"
21-Jun-2019 03:34:40 [INFO] Publish mode
21-Jun-2019 03:34:40 [INFO] Load global settings
21-Jun-2019 03:34:40 [INFO] Load global settings (done) | time=183ms
21-Jun-2019 03:34:40 [INFO] Server id: A7EE8CF2-11acedf5b092511
21-Jun-2019 03:34:40 [INFO] User cache: /home/bamboo/.sonar/cache
21-Jun-2019 03:34:41 [INFO] Load plugins index
21-Jun-2019 03:34:41 [INFO] Load plugins index (done) | time=48ms
21-Jun-2019 03:34:41 [INFO] Process project properties
21-Jun-2019 03:34:41 [INFO] Load project repositories
21-Jun-2019 03:34:42 [INFO] Load project repositories (done) | time=1117ms
21-Jun-2019 03:34:42 [INFO] Execute project builders
21-Jun-2019 03:34:42 [INFO] Execute project builders (done) | time=0ms
21-Jun-2019 03:34:42 [INFO] Load quality profiles
21-Jun-2019 03:34:42 [INFO] Load quality profiles (done) | time=199ms
21-Jun-2019 03:34:42 [INFO] Load active rules
21-Jun-2019 03:34:43 [INFO] Load active rules (done) | time=457ms
21-Jun-2019 03:34:43 [INFO] Load metrics repository
21-Jun-2019 03:34:43 [INFO] Load metrics repository (done) | time=90ms
21-Jun-2019 03:34:43 [INFO] Project key: org.springframework.data:spring-data-mongodb-parent
21-Jun-2019 03:34:43 [INFO] -------------  Scan Spring Data MongoDB - Distribution
21-Jun-2019 03:34:43 [INFO] Base dir: /opt/bamboo-home/xml-data/build-dir/SPRINGDATAMONGODB-MONGOSONAR-JOB1/spring-data-mongodb-distribution
21-Jun-2019 03:34:43 [INFO] Working dir: /opt/bamboo-home/xml-data/build-dir/SPRINGDATAMONGODB-MONGOSONAR-JOB1/spring-data-mongodb-distribution/target/sonar
21-Jun-2019 03:34:43 [INFO] Source paths: pom.xml
21-Jun-2019 03:34:43 [INFO] Source encoding: UTF-8, default locale: en_US
21-Jun-2019 03:34:43 [INFO] Load server rules
21-Jun-2019 03:34:43 [INFO] Load server rules (done) | time=112ms
21-Jun-2019 03:34:43 [INFO] Index files
21-Jun-2019 03:34:43 [INFO] 1 file indexed
21-Jun-2019 03:34:43 [INFO] Structure101 sensor require following mandatory properties:
21-Jun-2019 03:34:43         structure101.java.classpath
21-Jun-2019 03:34:43         structure101.java.repository
21-Jun-2019 03:34:43         structure101.java.project
21-Jun-2019 03:34:43         
21-Jun-2019 03:34:43 [INFO] Sensor Sonar-Sonargraph-Plugin [3.5] [Sonargraph]
21-Jun-2019 03:34:43 [INFO] ----------------------------------------------------------------
21-Jun-2019 03:34:43 [INFO] Sonargraph: Skipping project Spring Data MongoDB - Distribution [org.springframework.data:spring-data-mongodb-distribution], since no Sonargraph rules are activated in current SonarQube quality profile.
21-Jun-2019 03:34:43 [INFO] ----------------------------------------------------------------
21-Jun-2019 03:34:43 [INFO] Sensor Sonar-Sonargraph-Plugin [3.5] [Sonargraph] (done) | time=2ms
21-Jun-2019 03:34:43 [INFO] -------------  Scan Spring Data MongoDB - Core
21-Jun-2019 03:34:43 [INFO] Base dir: /opt/bamboo-home/xml-data/build-dir/SPRINGDATAMONGODB-MONGOSONAR-JOB1/spring-data-mongodb
21-Jun-2019 03:34:43 [INFO] Working dir: /opt/bamboo-home/xml-data/build-dir/SPRINGDATAMONGODB-MONGOSONAR-JOB1/spring-data-mongodb/target/sonar
21-Jun-2019 03:34:43 [INFO] Source paths: pom.xml, src/main/java
21-Jun-2019 03:34:43 [INFO] Test paths: src/test/java
21-Jun-2019 03:34:43 [INFO] Source encoding: UTF-8, default locale: en_US
21-Jun-2019 03:34:43 [INFO] Index files
21-Jun-2019 03:34:44 [INFO] 875 files indexed
21-Jun-2019 03:34:44 [INFO] Quality profile for java: Spring Data
21-Jun-2019 03:34:44 [INFO] Structure101 sensor require following mandatory properties:
21-Jun-2019 03:34:44         structure101.java.classpath
21-Jun-2019 03:34:44         structure101.java.repository
21-Jun-2019 03:34:44         structure101.java.project
21-Jun-2019 03:34:44         
21-Jun-2019 03:34:44 [INFO] Sensor JavaSquidSensor [java]
21-Jun-2019 03:34:44 [INFO] Configured Java source version (sonar.java.source): 8
21-Jun-2019 03:34:44 [INFO] JavaClasspath initialization
21-Jun-2019 03:34:44 [INFO] JavaClasspath initialization (done) | time=14ms
21-Jun-2019 03:34:44 [INFO] JavaTestClasspath initialization
21-Jun-2019 03:34:44 [INFO] JavaTestClasspath initialization (done) | time=4ms
21-Jun-2019 03:34:44 [INFO] Java Main Files AST scan
21-Jun-2019 03:34:44 [INFO] 466 source files to be analyzed
21-Jun-2019 03:34:54 [INFO] 466/466 source files have been analyzed
21-Jun-2019 03:34:54 [INFO] Java Main Files AST scan (done) | time=9850ms
21-Jun-2019 03:34:54 [INFO] Java Test Files AST scan
21-Jun-2019 03:34:54 [INFO] 408 source files to be analyzed
21-Jun-2019 03:35:04 [INFO] 290/408 files analyzed, current file: spring-data-mongodb/src/test/java/org/springframework/data/mongodb/core/schema/MongoJsonSchemaTests.java
21-Jun-2019 03:35:07 [INFO] 408/408 source files have been analyzed
21-Jun-2019 03:35:07 [WARNING] Classes not found during the analysis : [scala.Predef$$less, scala.Predef$$less$colon]
21-Jun-2019 03:35:07 [INFO] Java Test Files AST scan (done) | time=13109ms
21-Jun-2019 03:35:07 [INFO] Sensor JavaSquidSensor [java] (done) | time=23367ms
21-Jun-2019 03:35:07 [INFO] Sensor Sonar-Sonargraph-Plugin [3.5] [Sonargraph]
21-Jun-2019 03:35:07 [INFO] ----------------------------------------------------------------
21-Jun-2019 03:35:07 [INFO] Sonargraph: Skipping project Spring Data MongoDB - Core [org.springframework.data:spring-data-mongodb], since no Sonargraph rules are activated in current SonarQube quality profile.
21-Jun-2019 03:35:07 [INFO] ----------------------------------------------------------------
21-Jun-2019 03:35:07 [INFO] Sensor Sonar-Sonargraph-Plugin [3.5] [Sonargraph] (done) | time=0ms
21-Jun-2019 03:35:07 [INFO] Sensor CoberturaSensor [cobertura]
21-Jun-2019 03:35:07 [WARNING] Cobertura report not found at /opt/bamboo-home/xml-data/build-dir/SPRINGDATAMONGODB-MONGOSONAR-JOB1/spring-data-mongodb/target/site/cobertura/coverage.xml
21-Jun-2019 03:35:07 [INFO] Sensor CoberturaSensor [cobertura] (done) | time=1ms
21-Jun-2019 03:35:07 [INFO] Sensor PmdSensor [pmd]
21-Jun-2019 03:35:07 [INFO] Execute PMD 6.10.0
21-Jun-2019 03:35:07 [INFO] Java version: 1.8
21-Jun-2019 03:35:07 [INFO] PMD configuration: /opt/bamboo-home/xml-data/build-dir/SPRINGDATAMONGODB-MONGOSONAR-JOB1/spring-data-mongodb/target/sonar/pmd.xml
21-Jun-2019 03:35:16 [INFO] PMD configuration: /opt/bamboo-home/xml-data/build-dir/SPRINGDATAMONGODB-MONGOSONAR-JOB1/spring-data-mongodb/target/sonar/pmd-unit-tests.xml
21-Jun-2019 03:35:16 [INFO] Execute PMD 6.10.0 (done) | time=8964ms
21-Jun-2019 03:35:16 [INFO] Sensor PmdSensor [pmd] (done) | time=9004ms
21-Jun-2019 03:35:16 [INFO] Sensor FindBugs Sensor [findbugs]
21-Jun-2019 03:35:17 [INFO] Loading findbugs plugin: /opt/bamboo-home/xml-data/build-dir/SPRINGDATAMONGODB-MONGOSONAR-JOB1/spring-data-mongodb/target/sonar/findbugs/findsecbugs-plugin.jar
21-Jun-2019 03:35:17 [INFO] Findbugs output report: /opt/bamboo-home/xml-data/build-dir/SPRINGDATAMONGODB-MONGOSONAR-JOB1/spring-data-mongodb/target/sonar/findbugs-result.xml
21-Jun-2019 03:35:43 The following classes needed for analysis were missing:
21-Jun-2019 03:35:43   get
21-Jun-2019 03:35:43   test
21-Jun-2019 03:35:43   accept
21-Jun-2019 03:35:43   apply
21-Jun-2019 03:35:43   doInCollection
21-Jun-2019 03:35:43   getCollectionName
21-Jun-2019 03:35:43   convert
21-Jun-2019 03:35:43   doWithPersistentProperty
21-Jun-2019 03:35:43   run
21-Jun-2019 03:35:43   asDocument
21-Jun-2019 03:35:43   dispose
21-Jun-2019 03:35:43   getBindableValue
21-Jun-2019 03:35:43   invoke
21-Jun-2019 03:35:43   doWithAssociation
21-Jun-2019 03:35:43   all
21-Jun-2019 03:35:43   doInDB
21-Jun-2019 03:35:43   indexOps
21-Jun-2019 03:35:43   getAsLong
21-Jun-2019 03:35:43   execute
21-Jun-2019 03:35:43   startingWith
21-Jun-2019 03:35:43   toDocument
21-Jun-2019 03:35:43   year
21-Jun-2019 03:35:43   isoWeekYear
21-Jun-2019 03:35:43   handleError
21-Jun-2019 03:35:43 [WARNING] The class 'org.springframework.data.mongodb.core.ReactiveFindOperationExtensionsKt$awaitCount$1' could not be matched to its original source file. It might be a dynamically generated class.
21-Jun-2019 03:35:43 [WARNING] The class 'org.springframework.data.mongodb.core.ReactiveFindOperationExtensionsKt$awaitExists$1' could not be matched to its original source file. It might be a dynamically generated class.
21-Jun-2019 03:35:43 [WARNING] The class 'org.springframework.data.mongodb.core.ReactiveRemoveOperationExtensionsKt$allAndAwait$1' could not be matched to its original source file. It might be a dynamically generated class.
21-Jun-2019 03:35:43 [WARNING] The class 'org.springframework.data.mongodb.core.ReactiveUpdateOperationExtensionsKt$allAndAwait$1' could not be matched to its original source file. It might be a dynamically generated class.
21-Jun-2019 03:35:43 [WARNING] The class 'org.springframework.data.mongodb.core.ReactiveUpdateOperationExtensionsKt$findModifyAndAwait$1' could not be matched to its original source file. It might be a dynamically generated class.
21-Jun-2019 03:35:43 [WARNING] The class 'org.springframework.data.mongodb.core.ReactiveUpdateOperationExtensionsKt$findReplaceAndAwait$1' could not be matched to its original source file. It might be a dynamically generated class.
21-Jun-2019 03:35:43 [WARNING] The class 'org.springframework.data.mongodb.core.ReactiveUpdateOperationExtensionsKt$firstAndAwait$1' could not be matched to its original source file. It might be a dynamically generated class.
21-Jun-2019 03:35:43 [WARNING] The class 'org.springframework.data.mongodb.core.ReactiveUpdateOperationExtensionsKt$upsertAndAwait$1' could not be matched to its original source file. It might be a dynamically generated class.
21-Jun-2019 03:35:43 [INFO] Sensor FindBugs Sensor [findbugs] (done) | time=27088ms
21-Jun-2019 03:35:43 [INFO] Sensor SurefireSensor [java]
21-Jun-2019 03:35:43 [INFO] parsing [/opt/bamboo-home/xml-data/build-dir/SPRINGDATAMONGODB-MONGOSONAR-JOB1/spring-data-mongodb/target/surefire-reports]
21-Jun-2019 03:35:43 [INFO] Sensor SurefireSensor [java] (done) | time=265ms
21-Jun-2019 03:35:43 [INFO] Sensor JaCoCoSensor [java]
21-Jun-2019 03:35:43 [INFO] Sensor JaCoCoSensor [java] (done) | time=1ms
21-Jun-2019 03:35:43 [INFO] Sensor CheckstyleSensor [checkstyle]
21-Jun-2019 03:35:43 [INFO] Checkstyle output report: /opt/bamboo-home/xml-data/build-dir/SPRINGDATAMONGODB-MONGOSONAR-JOB1/spring-data-mongodb/target/sonar/checkstyle-result.xml
21-Jun-2019 03:35:43 [INFO] Checkstyle configuration: /opt/bamboo-home/xml-data/build-dir/SPRINGDATAMONGODB-MONGOSONAR-JOB1/spring-data-mongodb/target/sonar/checkstyle.xml
21-Jun-2019 03:35:43 [INFO] Checkstyle charset: UTF-8
21-Jun-2019 03:35:45 [INFO] Sensor CheckstyleSensor [checkstyle] (done) | time=2156ms
21-Jun-2019 03:35:45 [INFO] -------------  Scan Spring Data MongoDB
21-Jun-2019 03:35:45 [INFO] Base dir: /opt/bamboo-home/xml-data/build-dir/SPRINGDATAMONGODB-MONGOSONAR-JOB1
21-Jun-2019 03:35:45 [INFO] Working dir: /opt/bamboo-home/xml-data/build-dir/SPRINGDATAMONGODB-MONGOSONAR-JOB1/target/sonar
21-Jun-2019 03:35:45 [INFO] Source paths: pom.xml
21-Jun-2019 03:35:45 [INFO] Source encoding: UTF-8, default locale: en_US
21-Jun-2019 03:35:46 [INFO] Index files
21-Jun-2019 03:35:46 [INFO] 1 file indexed
21-Jun-2019 03:35:46 [INFO] Structure101 sensor require following mandatory properties:
21-Jun-2019 03:35:46         structure101.java.classpath
21-Jun-2019 03:35:46         structure101.java.repository
21-Jun-2019 03:35:46         structure101.java.project
21-Jun-2019 03:35:46         
21-Jun-2019 03:35:46 [INFO] Structure101 sensor require following mandatory properties:
21-Jun-2019 03:35:46         structure101.java.classpath
21-Jun-2019 03:35:46         structure101.java.repository
21-Jun-2019 03:35:46         structure101.java.project
21-Jun-2019 03:35:46         
21-Jun-2019 03:35:46 [INFO] Sensor Sonar-Sonargraph-Plugin [3.5] [Sonargraph]
21-Jun-2019 03:35:46 [INFO] ----------------------------------------------------------------
21-Jun-2019 03:35:46 [INFO] Sonargraph: Skipping project Spring Data MongoDB [org.springframework.data:spring-data-mongodb-parent], since no Sonargraph rules are activated in current SonarQube quality profile.
21-Jun-2019 03:35:46 [INFO] ----------------------------------------------------------------
21-Jun-2019 03:35:46 [INFO] Sensor Sonar-Sonargraph-Plugin [3.5] [Sonargraph] (done) | time=0ms
21-Jun-2019 03:35:46 [INFO] Sensor Zero Coverage Sensor
21-Jun-2019 03:35:46 [INFO] Sensor Zero Coverage Sensor (done) | time=126ms
21-Jun-2019 03:35:46 [INFO] Sensor CPD Block Indexer
21-Jun-2019 03:35:46 [INFO] Sensor CPD Block Indexer (done) | time=452ms
21-Jun-2019 03:35:46 [INFO] 137 files had no CPD blocks
21-Jun-2019 03:35:46 [INFO] Calculating CPD for 329 files
21-Jun-2019 03:35:46 [INFO] CPD calculation finished
21-Jun-2019 03:35:47 [INFO] Analysis report generated in 815ms, dir size=9 MB
21-Jun-2019 03:35:49 [INFO] Analysis reports compressed in 1399ms, zip size=4 MB
21-Jun-2019 03:35:49 [INFO] Analysis report uploaded in 465ms
21-Jun-2019 03:35:49 [INFO] ANALYSIS SUCCESSFUL, you can browse https://sonar.spring.io/dashboard/index/org.springframework.data:spring-data-mongodb-parent
21-Jun-2019 03:35:49 [INFO] Note that you will be able to access the updated dashboard once the server has processed the submitted analysis report
21-Jun-2019 03:35:49 [INFO] More about the report processing at https://sonar.spring.io/api/ce/task?id=AWt4GtQCXFvlBU1gpYaD
21-Jun-2019 03:35:49 [INFO] Executing post-job org.sonar.plugins.buildbreaker.QualityGateBreaker
21-Jun-2019 03:35:49 [INFO] Waiting for report processing to complete...
21-Jun-2019 03:35:59 [INFO] Waiting for report processing to complete...
21-Jun-2019 03:36:09 [INFO] Waiting for report processing to complete...
21-Jun-2019 03:36:19 [INFO] Quality gate status: OK
21-Jun-2019 03:36:20 [INFO] Task total time: 1:38.837 s
21-Jun-2019 03:36:20 [INFO] ------------------------------------------------------------------------
21-Jun-2019 03:36:20 [INFO] Reactor Summary:
21-Jun-2019 03:36:20 [INFO]
21-Jun-2019 03:36:20 [INFO] Spring Data MongoDB 2.2.0.BUILD-SNAPSHOT ........... SUCCESS [01:40 min]
21-Jun-2019 03:36:20 [INFO] Spring Data MongoDB - Core ......................... SKIPPED
21-Jun-2019 03:36:20 [INFO] Spring Data MongoDB - Distribution 2.2.0.BUILD-SNAPSHOT SKIPPED
21-Jun-2019 03:36:20 [INFO] ------------------------------------------------------------------------
21-Jun-2019 03:36:20 [INFO] BUILD SUCCESS
21-Jun-2019 03:36:20 [INFO] ------------------------------------------------------------------------
21-Jun-2019 03:36:20 [INFO] Total time: 01:41 min
21-Jun-2019 03:36:20 [INFO] Finished at: 2019-06-21T03:36:20Z
21-Jun-2019 03:36:20 [INFO] ------------------------------------------------------------------------
21-Jun-2019 03:36:20 Finished task 'Sonar' with result: Success
21-Jun-2019 03:36:20 Running post build plugin 'Docker Container Cleanup'
21-Jun-2019 03:36:20 Running post build plugin 'NCover Results Collector'
21-Jun-2019 03:36:20 Running post build plugin 'Artifactory Release Management Staging'
21-Jun-2019 03:36:20 Running post build plugin 'Artifactory Build Info Copier'
21-Jun-2019 03:36:20 Running post build plugin 'Artifactory Gradle Properties Info Copier'
21-Jun-2019 03:36:20 Running post build plugin 'Clover Results Collector'
21-Jun-2019 03:36:20 Running post build plugin 'npm Cache Cleanup'
21-Jun-2019 03:36:20 Running post build plugin 'Artifact Copier'
21-Jun-2019 03:36:20 Successfully removed working directory at '/opt/bamboo-home/xml-data/build-dir/SPRINGDATAMONGODB-MONGOSONAR-JOB1'
21-Jun-2019 03:36:20 Finalising the build...
21-Jun-2019 03:36:20 Stopping timer.
21-Jun-2019 03:36:20 Build SPRINGDATAMONGODB-MONGOSONAR-JOB1-2593 completed.
21-Jun-2019 03:36:23 Running on server: post build plugin 'NCover Results Collector'
21-Jun-2019 03:36:23 Running on server: post build plugin 'Build Hanging Detection Configuration'
21-Jun-2019 03:36:23 Running on server: post build plugin 'Clover Delta Calculator'
21-Jun-2019 03:36:23 Running on server: post build plugin 'Maven Dependencies Postprocessor'
21-Jun-2019 03:36:23 All post build plugins have finished
21-Jun-2019 03:36:23 Generating build results summary...
21-Jun-2019 03:36:24 Saving build results to disk...
21-Jun-2019 03:36:24 Logging substituted variables...
21-Jun-2019 03:36:24 Indexing build results...
21-Jun-2019 03:36:24 Finished building SPRINGDATAMONGODB-MONGOSONAR-JOB1-2593.