Build: #2602 was successful

Job: Default Job was successful

Stages & jobs

  1. Default Stage

Build log

The build generated 1,421 lines of output.The output is too long and has been truncated to the last 1,000 lines. Download or view full build log

30-Jun-2019 03:37:30         at sun.nio.ch.AsynchronousSocketChannelImpl.read(AsynchronousSocketChannelImpl.java:297)
30-Jun-2019 03:37:30         at com.mongodb.internal.connection.AsynchronousSocketChannelStream$AsynchronousSocketChannelAdapter.read(AsynchronousSocketChannelStream.java:137)
30-Jun-2019 03:37:30         at com.mongodb.internal.connection.AsynchronousChannelStream.readAsync(AsynchronousChannelStream.java:105)
30-Jun-2019 03:37:30         at com.mongodb.internal.connection.InternalStreamConnection.readAsync(InternalStreamConnection.java:511)
30-Jun-2019 03:37:30         at com.mongodb.internal.connection.InternalStreamConnection.access$1000(InternalStreamConnection.java:76)
30-Jun-2019 03:37:30         at com.mongodb.internal.connection.InternalStreamConnection$MessageHeaderCallback.onResult(InternalStreamConnection.java:634)
30-Jun-2019 03:37:30         at com.mongodb.internal.connection.InternalStreamConnection$MessageHeaderCallback.onResult(InternalStreamConnection.java:619)
30-Jun-2019 03:37:30         at com.mongodb.internal.connection.InternalStreamConnection$5.completed(InternalStreamConnection.java:514)
30-Jun-2019 03:37:30         at com.mongodb.internal.connection.InternalStreamConnection$5.completed(InternalStreamConnection.java:511)
30-Jun-2019 03:37:30         at com.mongodb.internal.connection.AsynchronousChannelStream$BasicCompletionHandler.completed(AsynchronousChannelStream.java:220)
30-Jun-2019 03:37:30         at com.mongodb.internal.connection.AsynchronousChannelStream$BasicCompletionHandler.completed(AsynchronousChannelStream.java:203)
30-Jun-2019 03:37:30         at sun.nio.ch.Invoker.invokeUnchecked(Invoker.java:126)
30-Jun-2019 03:37:30         at sun.nio.ch.Invoker$2.run(Invoker.java:218)
30-Jun-2019 03:37:30         at sun.nio.ch.AsynchronousChannelGroupImpl$1.run(AsynchronousChannelGroupImpl.java:112)
30-Jun-2019 03:37:30         at java.util.concurrent.ThreadPoolExecutor.runWorker(ThreadPoolExecutor.java:1149)
30-Jun-2019 03:37:30         at java.util.concurrent.ThreadPoolExecutor$Worker.run(ThreadPoolExecutor.java:624)
30-Jun-2019 03:37:30         at java.lang.Thread.run(Thread.java:748)
30-Jun-2019 03:37:30 Caused by: com.mongodb.MongoCommandException: Command failed with error 86 (IndexKeySpecsConflict): 'Index must have unique name.The existing index: { v: 2, key: { last_name: 1, age: -1 }, name: "age_idx", ns: "collation-tests.person" } has the same name as the requested index: { v: 2, key: { lastName: 1, age: -1 }, name: "age_idx", ns: "collation-tests.person" }' on server localhost:27017. The full response is {"ok": 0.0, "errmsg": "Index must have unique name.The existing index: { v: 2, key: { last_name: 1, age: -1 }, name: \"age_idx\", ns: \"collation-tests.person\" } has the same name as the requested index: { v: 2, key: { lastName: 1, age: -1 }, name: \"age_idx\", ns: \"collation-tests.person\" }", "code": 86, "codeName": "IndexKeySpecsConflict"}
30-Jun-2019 03:37:30         at com.mongodb.internal.connection.ProtocolHelper.getCommandFailureException(ProtocolHelper.java:187)
30-Jun-2019 03:37:30         at com.mongodb.internal.connection.InternalStreamConnection$2$1.onResult(InternalStreamConnection.java:390)
30-Jun-2019 03:37:30         ... 28 common frames omitted
30-Jun-2019 03:37:30 [INFO] Tests run: 1, Failures: 0, Errors: 0, Skipped: 0, Time elapsed: 0.306 s - in org.springframework.data.mongodb.core.ReactiveMongoTemplateCollationTests
30-Jun-2019 03:37:30 [INFO] Running org.springframework.data.mongodb.core.CollationUnitTests
30-Jun-2019 03:37:30 [INFO] Tests run: 24, Failures: 0, Errors: 0, Skipped: 0, Time elapsed: 0.002 s - in org.springframework.data.mongodb.core.CollationUnitTests
30-Jun-2019 03:37:30 [INFO] Running org.springframework.data.mongodb.core.SerializationUtilsUnitTests
30-Jun-2019 03:37:30 [INFO] Tests run: 8, Failures: 0, Errors: 0, Skipped: 0, Time elapsed: 0.001 s - in org.springframework.data.mongodb.core.SerializationUtilsUnitTests
30-Jun-2019 03:37:30 [INFO] Running org.springframework.data.mongodb.core.DefaultIndexOperationsUnitTests
30-Jun-2019 03:37:30 [INFO] Tests run: 5, Failures: 0, Errors: 0, Skipped: 0, Time elapsed: 0.016 s - in org.springframework.data.mongodb.core.DefaultIndexOperationsUnitTests
30-Jun-2019 03:37:30 [INFO] Running org.springframework.data.mongodb.core.MongoTemplateUnitTests
30-Jun-2019 03:37:31 [WARNING] Tests run: 140, Failures: 0, Errors: 0, Skipped: 1, Time elapsed: 1.272 s - in org.springframework.data.mongodb.core.MongoTemplateUnitTests
30-Jun-2019 03:37:31 [INFO] Running org.springframework.data.mongodb.core.messaging.DefaultMessageListenerContainerTests
30-Jun-2019 03:37:33 Exception in thread "SimpleAsyncTaskExecutor-1" org.springframework.data.mongodb.UncategorizedMongoDbException: Query failed with error code 96 and error message 'collection dropped between getMore calls' on server 127.0.0.1:27017; nested exception is com.mongodb.MongoQueryException: Query failed with error code 96 and error message 'collection dropped between getMore calls' on server 127.0.0.1:27017
30-Jun-2019 03:37:33         at org.springframework.data.mongodb.core.MongoExceptionTranslator.translateExceptionIfPossible(MongoExceptionTranslator.java:138)
30-Jun-2019 03:37:33         at org.springframework.data.mongodb.core.messaging.CursorReadingTask.execute(CursorReadingTask.java:267)
30-Jun-2019 03:37:33         at org.springframework.data.mongodb.core.messaging.CursorReadingTask.run(CursorReadingTask.java:82)
30-Jun-2019 03:37:33         at java.lang.Thread.run(Thread.java:748)
30-Jun-2019 03:37:33 Caused by: com.mongodb.MongoQueryException: Query failed with error code 96 and error message 'collection dropped between getMore calls' on server 127.0.0.1:27017
30-Jun-2019 03:37:33         at com.mongodb.operation.QueryHelper.translateCommandException(QueryHelper.java:29)
30-Jun-2019 03:37:33         at com.mongodb.operation.QueryBatchCursor.getMore(QueryBatchCursor.java:229)
30-Jun-2019 03:37:33         at com.mongodb.operation.QueryBatchCursor.tryHasNext(QueryBatchCursor.java:193)
30-Jun-2019 03:37:33         at com.mongodb.operation.QueryBatchCursor.tryNext(QueryBatchCursor.java:177)
30-Jun-2019 03:37:33         at com.mongodb.client.internal.MongoBatchCursorAdapter.tryNext(MongoBatchCursorAdapter.java:74)
30-Jun-2019 03:37:33         at org.springframework.data.mongodb.core.messaging.CursorReadingTask.getNext(CursorReadingTask.java:230)
30-Jun-2019 03:37:33         at org.springframework.data.mongodb.core.messaging.CursorReadingTask.execute(CursorReadingTask.java:264)
30-Jun-2019 03:37:33         ... 2 more
30-Jun-2019 03:37:34 2019-06-30 03:37:34,425 ERROR rContainer$DecoratingLoggingErrorHandler: 306 - Unexpected error occurred while listening to MongoDB.
30-Jun-2019 03:37:34 org.springframework.data.mongodb.UncategorizedMongoDbException: Query failed with error code 96 and error message 'collection dropped between getMore calls' on server 127.0.0.1:27017; nested exception is com.mongodb.MongoQueryException: Query failed with error code 96 and error message 'collection dropped between getMore calls' on server 127.0.0.1:27017
30-Jun-2019 03:37:34         at org.springframework.data.mongodb.core.MongoExceptionTranslator.translateExceptionIfPossible(MongoExceptionTranslator.java:138)
30-Jun-2019 03:37:34         at org.springframework.data.mongodb.core.messaging.CursorReadingTask.execute(CursorReadingTask.java:267)
30-Jun-2019 03:37:34         at org.springframework.data.mongodb.core.messaging.CursorReadingTask.run(CursorReadingTask.java:82)
30-Jun-2019 03:37:34         at java.lang.Thread.run(Thread.java:748)
30-Jun-2019 03:37:34 Caused by: com.mongodb.MongoQueryException: Query failed with error code 96 and error message 'collection dropped between getMore calls' on server 127.0.0.1:27017
30-Jun-2019 03:37:34         at com.mongodb.operation.QueryHelper.translateCommandException(QueryHelper.java:29)
30-Jun-2019 03:37:34         at com.mongodb.operation.QueryBatchCursor.getMore(QueryBatchCursor.java:229)
30-Jun-2019 03:37:34         at com.mongodb.operation.QueryBatchCursor.tryHasNext(QueryBatchCursor.java:193)
30-Jun-2019 03:37:34         at com.mongodb.operation.QueryBatchCursor.tryNext(QueryBatchCursor.java:177)
30-Jun-2019 03:37:34         at com.mongodb.client.internal.MongoBatchCursorAdapter.tryNext(MongoBatchCursorAdapter.java:74)
30-Jun-2019 03:37:34         at org.springframework.data.mongodb.core.messaging.CursorReadingTask.getNext(CursorReadingTask.java:230)
30-Jun-2019 03:37:34         at org.springframework.data.mongodb.core.messaging.CursorReadingTask.execute(CursorReadingTask.java:264)
30-Jun-2019 03:37:34         ... 2 common frames omitted
30-Jun-2019 03:37:34 Exception in thread "SimpleAsyncTaskExecutor-1" org.springframework.data.mongodb.UncategorizedMongoDbException: Query failed with error code 96 and error message 'collection dropped between getMore calls' on server 127.0.0.1:27017; nested exception is com.mongodb.MongoQueryException: Query failed with error code 96 and error message 'collection dropped between getMore calls' on server 127.0.0.1:27017
30-Jun-2019 03:37:34         at org.springframework.data.mongodb.core.MongoExceptionTranslator.translateExceptionIfPossible(MongoExceptionTranslator.java:138)
30-Jun-2019 03:37:34         at org.springframework.data.mongodb.core.messaging.CursorReadingTask.execute(CursorReadingTask.java:267)
30-Jun-2019 03:37:34         at org.springframework.data.mongodb.core.messaging.CursorReadingTask.run(CursorReadingTask.java:82)
30-Jun-2019 03:37:34         at java.lang.Thread.run(Thread.java:748)
30-Jun-2019 03:37:34 Caused by: com.mongodb.MongoQueryException: Query failed with error code 96 and error message 'collection dropped between getMore calls' on server 127.0.0.1:27017
30-Jun-2019 03:37:34         at com.mongodb.operation.QueryHelper.translateCommandException(QueryHelper.java:29)
30-Jun-2019 03:37:34         at com.mongodb.operation.QueryBatchCursor.getMore(QueryBatchCursor.java:229)
30-Jun-2019 03:37:34         at com.mongodb.operation.QueryBatchCursor.tryHasNext(QueryBatchCursor.java:193)
30-Jun-2019 03:37:34         at com.mongodb.operation.QueryBatchCursor.tryNext(QueryBatchCursor.java:177)
30-Jun-2019 03:37:34         at com.mongodb.client.internal.MongoBatchCursorAdapter.tryNext(MongoBatchCursorAdapter.java:74)
30-Jun-2019 03:37:34         at org.springframework.data.mongodb.core.messaging.CursorReadingTask.getNext(CursorReadingTask.java:230)
30-Jun-2019 03:37:34         at org.springframework.data.mongodb.core.messaging.CursorReadingTask.execute(CursorReadingTask.java:264)
30-Jun-2019 03:37:34         ... 2 more
30-Jun-2019 03:37:35 [WARNING] Tests run: 10, Failures: 0, Errors: 0, Skipped: 6, Time elapsed: 4.25 s - in org.springframework.data.mongodb.core.messaging.DefaultMessageListenerContainerTests
30-Jun-2019 03:37:35 [INFO] Running org.springframework.data.mongodb.core.messaging.CursorReadingTaskUnitTests
30-Jun-2019 03:37:36 [INFO] Tests run: 4, Failures: 0, Errors: 0, Skipped: 0, Time elapsed: 0.237 s - in org.springframework.data.mongodb.core.messaging.CursorReadingTaskUnitTests
30-Jun-2019 03:37:36 [INFO] Running org.springframework.data.mongodb.core.messaging.ChangeStreamTests
30-Jun-2019 03:37:36 [WARNING] Tests run: 1, Failures: 0, Errors: 0, Skipped: 1, Time elapsed: 0.006 s - in org.springframework.data.mongodb.core.messaging.ChangeStreamTests
30-Jun-2019 03:37:36 [INFO] Running org.springframework.data.mongodb.core.messaging.ChangeStreamTaskUnitTests
30-Jun-2019 03:37:36 [INFO] Tests run: 3, Failures: 0, Errors: 0, Skipped: 0, Time elapsed: 0.021 s - in org.springframework.data.mongodb.core.messaging.ChangeStreamTaskUnitTests
30-Jun-2019 03:37:36 [INFO] Running org.springframework.data.mongodb.core.messaging.TaskFactoryUnitTests
30-Jun-2019 03:37:36 [INFO] Tests run: 3, Failures: 0, Errors: 0, Skipped: 0, Time elapsed: 0.059 s - in org.springframework.data.mongodb.core.messaging.TaskFactoryUnitTests
30-Jun-2019 03:37:36 [INFO] Running org.springframework.data.mongodb.core.messaging.TailableCursorTests
30-Jun-2019 03:37:50 [INFO] Tests run: 5, Failures: 0, Errors: 0, Skipped: 0, Time elapsed: 14.276 s - in org.springframework.data.mongodb.core.messaging.TailableCursorTests
30-Jun-2019 03:37:50 [INFO] Running org.springframework.data.mongodb.core.messaging.DefaultMessageListenerContainerUnitTests
30-Jun-2019 03:37:50 [INFO] Tests run: 6, Failures: 0, Errors: 0, Skipped: 0, Time elapsed: 0.321 s - in org.springframework.data.mongodb.core.messaging.DefaultMessageListenerContainerUnitTests
30-Jun-2019 03:37:50 [INFO] Running org.springframework.data.mongodb.core.messaging.TailableCursorRequestUnitTests
30-Jun-2019 03:37:50 [INFO] Tests run: 1, Failures: 0, Errors: 0, Skipped: 0, Time elapsed: 0 s - in org.springframework.data.mongodb.core.messaging.TailableCursorRequestUnitTests
30-Jun-2019 03:37:50 [INFO] Running org.springframework.data.mongodb.core.ReactiveMongoTemplateTransactionTests
30-Jun-2019 03:37:50 [WARNING] Tests run: 1, Failures: 0, Errors: 0, Skipped: 1, Time elapsed: 0.004 s - in org.springframework.data.mongodb.core.ReactiveMongoTemplateTransactionTests
30-Jun-2019 03:37:50 [INFO] Running org.springframework.data.mongodb.core.ReactiveRemoveOperationExtensionsTests
30-Jun-2019 03:37:51 [INFO] Tests run: 4, Failures: 0, Errors: 0, Skipped: 0, Time elapsed: 0.467 s - in org.springframework.data.mongodb.core.ReactiveRemoveOperationExtensionsTests
30-Jun-2019 03:37:51 [INFO] Running org.springframework.data.mongodb.core.MongoAdminIntegrationTests
30-Jun-2019 03:37:51 [INFO] Tests run: 2, Failures: 0, Errors: 0, Skipped: 0, Time elapsed: 0.02 s - in org.springframework.data.mongodb.core.MongoAdminIntegrationTests
30-Jun-2019 03:37:51 [INFO] Running org.springframework.data.mongodb.core.CloseableIterableCursorAdapterUnitTests
30-Jun-2019 03:37:51 [INFO] Tests run: 3, Failures: 0, Errors: 0, Skipped: 0, Time elapsed: 0.018 s - in org.springframework.data.mongodb.core.CloseableIterableCursorAdapterUnitTests
30-Jun-2019 03:37:51 [INFO] Running org.springframework.data.mongodb.core.mapreduce.MapReduceCountsUnitTests
30-Jun-2019 03:37:51 [INFO] Tests run: 2, Failures: 0, Errors: 0, Skipped: 0, Time elapsed: 0 s - in org.springframework.data.mongodb.core.mapreduce.MapReduceCountsUnitTests
30-Jun-2019 03:37:51 [INFO] Running org.springframework.data.mongodb.core.mapreduce.ReactiveMapReduceTests
30-Jun-2019 03:37:52 [INFO] Tests run: 8, Failures: 0, Errors: 0, Skipped: 0, Time elapsed: 0.827 s - in org.springframework.data.mongodb.core.mapreduce.ReactiveMapReduceTests
30-Jun-2019 03:37:52 [INFO] Running org.springframework.data.mongodb.core.mapreduce.MapReduceTests
30-Jun-2019 03:37:53 [WARNING] Tests run: 10, Failures: 0, Errors: 0, Skipped: 1, Time elapsed: 1.035 s - in org.springframework.data.mongodb.core.mapreduce.MapReduceTests
30-Jun-2019 03:37:53 [INFO] Running org.springframework.data.mongodb.core.mapreduce.MapReduceOptionsTests
30-Jun-2019 03:37:53 [INFO] Tests run: 3, Failures: 0, Errors: 0, Skipped: 0, Time elapsed: 0.002 s - in org.springframework.data.mongodb.core.mapreduce.MapReduceOptionsTests
30-Jun-2019 03:37:53 [INFO] Running org.springframework.data.mongodb.core.mapreduce.GroupByTests
30-Jun-2019 03:37:53 [INFO] Tests run: 7, Failures: 0, Errors: 0, Skipped: 0, Time elapsed: 0.197 s - in org.springframework.data.mongodb.core.mapreduce.GroupByTests
30-Jun-2019 03:37:53 [INFO] Running org.springframework.data.mongodb.core.mapreduce.MapReduceResultsUnitTests
30-Jun-2019 03:37:53 [INFO] Tests run: 4, Failures: 0, Errors: 0, Skipped: 0, Time elapsed: 0 s - in org.springframework.data.mongodb.core.mapreduce.MapReduceResultsUnitTests
30-Jun-2019 03:37:53 [INFO] Running org.springframework.data.mongodb.core.ReactiveMongoOperationsExtensionsTests
30-Jun-2019 03:37:54 [INFO] Tests run: 60, Failures: 0, Errors: 0, Skipped: 0, Time elapsed: 0.86 s - in org.springframework.data.mongodb.core.ReactiveMongoOperationsExtensionsTests
30-Jun-2019 03:37:54 [INFO] Running org.springframework.data.mongodb.core.ChangeStreamOptionsUnitTests
30-Jun-2019 03:37:54 [INFO] Tests run: 3, Failures: 0, Errors: 0, Skipped: 0, Time elapsed: 0 s - in org.springframework.data.mongodb.core.ChangeStreamOptionsUnitTests
30-Jun-2019 03:37:54 [INFO] Running org.springframework.data.mongodb.core.EntityOperationUnitTests
30-Jun-2019 03:37:54 [INFO] Tests run: 1, Failures: 0, Errors: 0, Skipped: 0, Time elapsed: 0.009 s - in org.springframework.data.mongodb.core.EntityOperationUnitTests
30-Jun-2019 03:37:54 [INFO] Running org.springframework.data.mongodb.core.ExecutableRemoveOperationExtensionsTests
30-Jun-2019 03:37:54 [INFO] Tests run: 2, Failures: 0, Errors: 0, Skipped: 0, Time elapsed: 0.319 s - in org.springframework.data.mongodb.core.ExecutableRemoveOperationExtensionsTests
30-Jun-2019 03:37:54 [INFO] Running org.springframework.data.mongodb.core.validation.CriteriaValidatorUnitTests
30-Jun-2019 03:37:54 [INFO] Tests run: 2, Failures: 0, Errors: 0, Skipped: 0, Time elapsed: 0 s - in org.springframework.data.mongodb.core.validation.CriteriaValidatorUnitTests
30-Jun-2019 03:37:54 [INFO] Running org.springframework.data.mongodb.core.SimpleMongoDbFactoryUnitTests
30-Jun-2019 03:37:54 [INFO] Tests run: 5, Failures: 0, Errors: 0, Skipped: 0, Time elapsed: 0.012 s - in org.springframework.data.mongodb.core.SimpleMongoDbFactoryUnitTests
30-Jun-2019 03:37:54 [INFO] Running org.springframework.data.mongodb.core.DefaultBulkOperationsIntegrationTests
30-Jun-2019 03:37:54 [INFO] Tests run: 22, Failures: 0, Errors: 0, Skipped: 0, Time elapsed: 0.049 s - in org.springframework.data.mongodb.core.DefaultBulkOperationsIntegrationTests
30-Jun-2019 03:37:54 [INFO] Running org.springframework.data.mongodb.core.ExecutableAggregationOperationExtensionsTests
30-Jun-2019 03:37:54 [INFO] Tests run: 2, Failures: 0, Errors: 0, Skipped: 0, Time elapsed: 0.258 s - in org.springframework.data.mongodb.core.ExecutableAggregationOperationExtensionsTests
30-Jun-2019 03:37:54 [INFO] Running org.springframework.data.mongodb.core.MongoTemplateDbRefTests
30-Jun-2019 03:37:55 [INFO] Tests run: 7, Failures: 0, Errors: 0, Skipped: 0, Time elapsed: 0.648 s - in org.springframework.data.mongodb.core.MongoTemplateDbRefTests
30-Jun-2019 03:37:55 [INFO] Running org.springframework.data.mongodb.core.ReactiveMongoTemplateTests
30-Jun-2019 03:37:59 [WARNING] Tests run: 80, Failures: 0, Errors: 0, Skipped: 8, Time elapsed: 3.997 s - in org.springframework.data.mongodb.core.ReactiveMongoTemplateTests
30-Jun-2019 03:37:59 [INFO] Running org.springframework.data.mongodb.core.MongoTemplateValidationTests
30-Jun-2019 03:38:01 [INFO] Tests run: 9, Failures: 0, Errors: 0, Skipped: 0, Time elapsed: 2.325 s - in org.springframework.data.mongodb.core.MongoTemplateValidationTests
30-Jun-2019 03:38:01 [INFO] Running org.springframework.data.mongodb.core.ReactiveMongoTemplateIndexTests
30-Jun-2019 03:38:02 [INFO] Tests run: 5, Failures: 0, Errors: 0, Skipped: 0, Time elapsed: 0.339 s - in org.springframework.data.mongodb.core.ReactiveMongoTemplateIndexTests
30-Jun-2019 03:38:02 [INFO] Running org.springframework.data.mongodb.core.UnwrapAndReadDocumentCallbackUnitTests
30-Jun-2019 03:38:02 [INFO] Tests run: 4, Failures: 0, Errors: 0, Skipped: 0, Time elapsed: 0.02 s - in org.springframework.data.mongodb.core.UnwrapAndReadDocumentCallbackUnitTests
30-Jun-2019 03:38:02 [INFO] Running org.springframework.data.mongodb.core.QueryCursorPreparerUnitTests
30-Jun-2019 03:38:02 [INFO] Tests run: 9, Failures: 0, Errors: 0, Skipped: 0, Time elapsed: 0.02 s - in org.springframework.data.mongodb.core.QueryCursorPreparerUnitTests
30-Jun-2019 03:38:02 [INFO] Running org.springframework.data.mongodb.core.mapping.MappingTests
30-Jun-2019 03:38:04 [INFO] Tests run: 24, Failures: 0, Errors: 0, Skipped: 0, Time elapsed: 1.89 s - in org.springframework.data.mongodb.core.mapping.MappingTests
30-Jun-2019 03:38:04 [INFO] Running org.springframework.data.mongodb.core.mapping.MongoMappingContextUnitTests
30-Jun-2019 03:38:04 [INFO] Tests run: 12, Failures: 0, Errors: 0, Skipped: 0, Time elapsed: 0.036 s - in org.springframework.data.mongodb.core.mapping.MongoMappingContextUnitTests
30-Jun-2019 03:38:04 [INFO] Running org.springframework.data.mongodb.core.mapping.event.AbstractMongoEventListenerUnitTests
30-Jun-2019 03:38:04 [INFO] Tests run: 11, Failures: 0, Errors: 0, Skipped: 0, Time elapsed: 0.007 s - in org.springframework.data.mongodb.core.mapping.event.AbstractMongoEventListenerUnitTests
30-Jun-2019 03:38:04 [INFO] Running org.springframework.data.mongodb.core.mapping.event.ApplicationContextEventTests
30-Jun-2019 03:38:05 [INFO] Tests run: 12, Failures: 0, Errors: 0, Skipped: 0, Time elapsed: 1.176 s - in org.springframework.data.mongodb.core.mapping.event.ApplicationContextEventTests
30-Jun-2019 03:38:05 [INFO] Running org.springframework.data.mongodb.core.mapping.event.AuditingEventListenerUnitTests
30-Jun-2019 03:38:05 [INFO] Tests run: 5, Failures: 0, Errors: 0, Skipped: 0, Time elapsed: 0.026 s - in org.springframework.data.mongodb.core.mapping.event.AuditingEventListenerUnitTests
30-Jun-2019 03:38:05 [INFO] Running org.springframework.data.mongodb.core.mapping.event.LoggingEventListenerTests
30-Jun-2019 03:38:05 [INFO] Tests run: 5, Failures: 0, Errors: 0, Skipped: 0, Time elapsed: 0.005 s - in org.springframework.data.mongodb.core.mapping.event.LoggingEventListenerTests
30-Jun-2019 03:38:05 [INFO] Running org.springframework.data.mongodb.core.mapping.event.ValidatingMongoEventListenerTests
30-Jun-2019 03:38:07 [INFO] Tests run: 2, Failures: 0, Errors: 0, Skipped: 0, Time elapsed: 2.121 s - in org.springframework.data.mongodb.core.mapping.event.ValidatingMongoEventListenerTests
30-Jun-2019 03:38:07 [INFO] Running org.springframework.data.mongodb.core.mapping.event.AuditingEntityCallbackUnitTests
30-Jun-2019 03:38:07 [INFO] Tests run: 5, Failures: 0, Errors: 0, Skipped: 0, Time elapsed: 0.01 s - in org.springframework.data.mongodb.core.mapping.event.AuditingEntityCallbackUnitTests
30-Jun-2019 03:38:07 [INFO] Running org.springframework.data.mongodb.core.mapping.GeoIndexedTests
30-Jun-2019 03:38:07 [INFO] Tests run: 1, Failures: 0, Errors: 0, Skipped: 0, Time elapsed: 0.138 s - in org.springframework.data.mongodb.core.mapping.GeoIndexedTests
30-Jun-2019 03:38:07 [INFO] Running org.springframework.data.mongodb.core.mapping.MongoPersistentPropertyComparatorUnitTests
30-Jun-2019 03:38:07 [INFO] Tests run: 1, Failures: 0, Errors: 0, Skipped: 0, Time elapsed: 0 s - in org.springframework.data.mongodb.core.mapping.MongoPersistentPropertyComparatorUnitTests
30-Jun-2019 03:38:07 [INFO] Running org.springframework.data.mongodb.core.mapping.BasicMongoPersistentPropertyUnitTests
30-Jun-2019 03:38:07 [INFO] Tests run: 20, Failures: 0, Errors: 0, Skipped: 0, Time elapsed: 0.019 s - in org.springframework.data.mongodb.core.mapping.BasicMongoPersistentPropertyUnitTests
30-Jun-2019 03:38:07 [INFO] Running org.springframework.data.mongodb.core.mapping.BasicMongoPersistentEntityUnitTests
30-Jun-2019 03:38:07 [INFO] Tests run: 16, Failures: 0, Errors: 0, Skipped: 0, Time elapsed: 0.029 s - in org.springframework.data.mongodb.core.mapping.BasicMongoPersistentEntityUnitTests
30-Jun-2019 03:38:07 [INFO] Running org.springframework.data.mongodb.core.mapping.GenericMappingTests
30-Jun-2019 03:38:07 [INFO] Tests run: 2, Failures: 0, Errors: 0, Skipped: 0, Time elapsed: 0.001 s - in org.springframework.data.mongodb.core.mapping.GenericMappingTests
30-Jun-2019 03:38:07 [INFO] Running org.springframework.data.mongodb.core.ExecutableInsertOperationSupportUnitTests
30-Jun-2019 03:38:07 [INFO] Tests run: 7, Failures: 0, Errors: 0, Skipped: 0, Time elapsed: 0 s - in org.springframework.data.mongodb.core.ExecutableInsertOperationSupportUnitTests
30-Jun-2019 03:38:07 [INFO] Running org.springframework.data.mongodb.core.ExecutableUpdateOperationExtensionsTests
30-Jun-2019 03:38:08 [INFO] Tests run: 2, Failures: 0, Errors: 0, Skipped: 0, Time elapsed: 0.297 s - in org.springframework.data.mongodb.core.ExecutableUpdateOperationExtensionsTests
30-Jun-2019 03:38:08 [INFO] Running org.springframework.data.mongodb.core.ReactiveAggregationOperationSupportUnitTests
30-Jun-2019 03:38:08 [INFO] Tests run: 7, Failures: 0, Errors: 0, Skipped: 0, Time elapsed: 0.157 s - in org.springframework.data.mongodb.core.ReactiveAggregationOperationSupportUnitTests
30-Jun-2019 03:38:08 [INFO] Running org.springframework.data.mongodb.core.GeoCommandStatisticsUnitTests
30-Jun-2019 03:38:08 [INFO] Tests run: 3, Failures: 0, Errors: 0, Skipped: 0, Time elapsed: 0 s - in org.springframework.data.mongodb.core.GeoCommandStatisticsUnitTests
30-Jun-2019 03:38:08 [INFO] Running org.springframework.data.mongodb.core.MongoTemplateTransactionTests
30-Jun-2019 03:38:08 [WARNING] Tests run: 1, Failures: 0, Errors: 0, Skipped: 1, Time elapsed: 0.013 s - in org.springframework.data.mongodb.core.MongoTemplateTransactionTests
30-Jun-2019 03:38:08 [INFO] Running org.springframework.data.mongodb.core.SessionBoundMongoTemplateTests
30-Jun-2019 03:38:08 [WARNING] Tests run: 1, Failures: 0, Errors: 0, Skipped: 1, Time elapsed: 0.002 s - in org.springframework.data.mongodb.core.SessionBoundMongoTemplateTests
30-Jun-2019 03:38:08 [INFO] Running org.springframework.data.mongodb.core.MongoExceptionTranslatorUnitTests
30-Jun-2019 03:38:08 [INFO] Tests run: 11, Failures: 0, Errors: 0, Skipped: 0, Time elapsed: 0.005 s - in org.springframework.data.mongodb.core.MongoExceptionTranslatorUnitTests
30-Jun-2019 03:38:08 [INFO] Running org.springframework.data.mongodb.core.DefaultBulkOperationsUnitTests
30-Jun-2019 03:38:08 [INFO] Tests run: 11, Failures: 0, Errors: 0, Skipped: 0, Time elapsed: 0.058 s - in org.springframework.data.mongodb.core.DefaultBulkOperationsUnitTests
30-Jun-2019 03:38:08 [INFO] Running org.springframework.data.mongodb.core.QueryByExampleTests
30-Jun-2019 03:38:08 [INFO] Tests run: 10, Failures: 0, Errors: 0, Skipped: 0, Time elapsed: 0.097 s - in org.springframework.data.mongodb.core.QueryByExampleTests
30-Jun-2019 03:38:08 [INFO] Running org.springframework.data.mongodb.core.SimpleReactiveMongoDatabaseFactoryUnitTests
30-Jun-2019 03:38:08 [INFO] Tests run: 2, Failures: 0, Errors: 0, Skipped: 0, Time elapsed: 0.003 s - in org.springframework.data.mongodb.core.SimpleReactiveMongoDatabaseFactoryUnitTests
30-Jun-2019 03:38:08 [INFO] Running org.springframework.data.mongodb.core.spel.ExpressionNodeUnitTests
30-Jun-2019 03:38:08 [INFO] Tests run: 1, Failures: 0, Errors: 0, Skipped: 0, Time elapsed: 0.092 s - in org.springframework.data.mongodb.core.spel.ExpressionNodeUnitTests
30-Jun-2019 03:38:08 [INFO] Running org.springframework.data.mongodb.core.ExecutableAggregationOperationSupportUnitTests
30-Jun-2019 03:38:08 [INFO] Tests run: 10, Failures: 0, Errors: 0, Skipped: 0, Time elapsed: 0.009 s - in org.springframework.data.mongodb.core.ExecutableAggregationOperationSupportUnitTests
30-Jun-2019 03:38:08 [INFO] Running org.springframework.data.mongodb.core.ReactiveFindOperationSupportTests
30-Jun-2019 03:38:11 [INFO] Tests run: 43, Failures: 0, Errors: 0, Skipped: 0, Time elapsed: 2.537 s - in org.springframework.data.mongodb.core.ReactiveFindOperationSupportTests
30-Jun-2019 03:38:11 [INFO] Running org.springframework.data.mongodb.core.convert.GeoConvertersUnitTests
30-Jun-2019 03:38:11 [INFO] Tests run: 11, Failures: 0, Errors: 0, Skipped: 0, Time elapsed: 0.002 s - in org.springframework.data.mongodb.core.convert.GeoConvertersUnitTests
30-Jun-2019 03:38:11 [INFO] Running org.springframework.data.mongodb.core.convert.CustomConvertersUnitTests
30-Jun-2019 03:38:11 [INFO] Tests run: 5, Failures: 0, Errors: 0, Skipped: 0, Time elapsed: 0.02 s - in org.springframework.data.mongodb.core.convert.CustomConvertersUnitTests
30-Jun-2019 03:38:11 [INFO] Running org.springframework.data.mongodb.core.convert.GeoJsonConverterUnitTests
30-Jun-2019 03:38:11 [INFO] Tests run: 27, Failures: 0, Errors: 0, Skipped: 0, Time elapsed: 0.009 s - in org.springframework.data.mongodb.core.convert.GeoJsonConverterUnitTests
30-Jun-2019 03:38:11 [INFO] Running org.springframework.data.mongodb.core.convert.GeoJsonConverterUnitTests$DocumentToGeoJsonMultiPointConverterUnitTests
30-Jun-2019 03:38:11 [INFO] Tests run: 3, Failures: 0, Errors: 0, Skipped: 0, Time elapsed: 0 s - in org.springframework.data.mongodb.core.convert.GeoJsonConverterUnitTests$DocumentToGeoJsonMultiPointConverterUnitTests
30-Jun-2019 03:38:11 [INFO] Running org.springframework.data.mongodb.core.convert.GeoJsonConverterUnitTests$DocumentToGeoJsonMultiLineStringConverterUnitTests
30-Jun-2019 03:38:11 [INFO] Tests run: 3, Failures: 0, Errors: 0, Skipped: 0, Time elapsed: 0 s - in org.springframework.data.mongodb.core.convert.GeoJsonConverterUnitTests$DocumentToGeoJsonMultiLineStringConverterUnitTests
30-Jun-2019 03:38:11 [INFO] Running org.springframework.data.mongodb.core.convert.LazyLoadingInterceptorUnitTests
30-Jun-2019 03:38:11 [INFO] Tests run: 1, Failures: 0, Errors: 0, Skipped: 0, Time elapsed: 0.006 s - in org.springframework.data.mongodb.core.convert.LazyLoadingInterceptorUnitTests
30-Jun-2019 03:38:11 [INFO] Running org.springframework.data.mongodb.core.convert.GeoJsonConverterUnitTests$DocumentToGeoJsonPointConverterUnitTests
30-Jun-2019 03:38:11 [INFO] Tests run: 3, Failures: 0, Errors: 0, Skipped: 0, Time elapsed: 0 s - in org.springframework.data.mongodb.core.convert.GeoJsonConverterUnitTests$DocumentToGeoJsonPointConverterUnitTests
30-Jun-2019 03:38:11 [INFO] Running org.springframework.data.mongodb.core.convert.DbRefMappingMongoConverterUnitTests
30-Jun-2019 03:38:11 [INFO] Tests run: 25, Failures: 0, Errors: 0, Skipped: 0, Time elapsed: 0.225 s - in org.springframework.data.mongodb.core.convert.DbRefMappingMongoConverterUnitTests
30-Jun-2019 03:38:11 [INFO] Running org.springframework.data.mongodb.core.convert.NamedMongoScriptConvertsUnitTests$NamedMongoScriptToDocumentConverterUnitTests
30-Jun-2019 03:38:11 [INFO] Tests run: 3, Failures: 0, Errors: 0, Skipped: 0, Time elapsed: 0.002 s - in org.springframework.data.mongodb.core.convert.NamedMongoScriptConvertsUnitTests$NamedMongoScriptToDocumentConverterUnitTests
30-Jun-2019 03:38:11 [INFO] Running org.springframework.data.mongodb.core.convert.QueryMapperUnitTests
30-Jun-2019 03:38:11 [INFO] Tests run: 64, Failures: 0, Errors: 0, Skipped: 0, Time elapsed: 0.118 s - in org.springframework.data.mongodb.core.convert.QueryMapperUnitTests
30-Jun-2019 03:38:11 [INFO] Running org.springframework.data.mongodb.core.convert.GeoJsonConverterUnitTests$DocumentToGeoJsonLineStringConverterUnitTests
30-Jun-2019 03:38:11 [INFO] Tests run: 3, Failures: 0, Errors: 0, Skipped: 0, Time elapsed: 0.001 s - in org.springframework.data.mongodb.core.convert.GeoJsonConverterUnitTests$DocumentToGeoJsonLineStringConverterUnitTests
30-Jun-2019 03:38:11 [INFO] Running org.springframework.data.mongodb.core.convert.MappingMongoConverterUnitTests
30-Jun-2019 03:38:12 [WARNING] Tests run: 131, Failures: 0, Errors: 0, Skipped: 3, Time elapsed: 0.498 s - in org.springframework.data.mongodb.core.convert.MappingMongoConverterUnitTests
30-Jun-2019 03:38:12 [INFO] Running org.springframework.data.mongodb.core.convert.NamedMongoScriptConvertsUnitTests$DocumentToNamedMongoScriptConverterUnitTests
30-Jun-2019 03:38:12 [INFO] Tests run: 3, Failures: 0, Errors: 0, Skipped: 0, Time elapsed: 0 s - in org.springframework.data.mongodb.core.convert.NamedMongoScriptConvertsUnitTests$DocumentToNamedMongoScriptConverterUnitTests
30-Jun-2019 03:38:12 [INFO] Running org.springframework.data.mongodb.core.convert.ObjectPathUnitTests
30-Jun-2019 03:38:12 [INFO] Tests run: 6, Failures: 0, Errors: 0, Skipped: 0, Time elapsed: 0.04 s - in org.springframework.data.mongodb.core.convert.ObjectPathUnitTests
30-Jun-2019 03:38:12 [INFO] Running org.springframework.data.mongodb.core.convert.AbstractMongoConverterUnitTests
30-Jun-2019 03:38:12 [INFO] Tests run: 1, Failures: 0, Errors: 0, Skipped: 0, Time elapsed: 0.032 s - in org.springframework.data.mongodb.core.convert.AbstractMongoConverterUnitTests
30-Jun-2019 03:38:12 [INFO] Running org.springframework.data.mongodb.core.convert.MongoExampleMapperUnitTests
30-Jun-2019 03:38:12 [INFO] Tests run: 27, Failures: 0, Errors: 0, Skipped: 0, Time elapsed: 0.098 s - in org.springframework.data.mongodb.core.convert.MongoExampleMapperUnitTests
30-Jun-2019 03:38:12 [INFO] Running org.springframework.data.mongodb.core.convert.DefaultMongoTypeMapperUnitTests
30-Jun-2019 03:38:12 [INFO] Tests run: 17, Failures: 0, Errors: 0, Skipped: 0, Time elapsed: 0.006 s - in org.springframework.data.mongodb.core.convert.DefaultMongoTypeMapperUnitTests
30-Jun-2019 03:38:12 [INFO] Running org.springframework.data.mongodb.core.convert.UpdateMapperUnitTests
30-Jun-2019 03:38:12 [INFO] Tests run: 72, Failures: 0, Errors: 0, Skipped: 0, Time elapsed: 0.218 s - in org.springframework.data.mongodb.core.convert.UpdateMapperUnitTests
30-Jun-2019 03:38:12 [INFO] Running org.springframework.data.mongodb.core.convert.GeoJsonConverterUnitTests$DocumentToGeoJsonMultiPolygonConverterUnitTests
30-Jun-2019 03:38:12 [INFO] Tests run: 3, Failures: 0, Errors: 0, Skipped: 0, Time elapsed: 0 s - in org.springframework.data.mongodb.core.convert.GeoJsonConverterUnitTests$DocumentToGeoJsonMultiPolygonConverterUnitTests
30-Jun-2019 03:38:12 [INFO] Running org.springframework.data.mongodb.core.convert.MappingMongoConverterTests
30-Jun-2019 03:38:12 [INFO] Tests run: 2, Failures: 0, Errors: 0, Skipped: 0, Time elapsed: 0.11 s - in org.springframework.data.mongodb.core.convert.MappingMongoConverterTests
30-Jun-2019 03:38:12 [INFO] Running org.springframework.data.mongodb.core.convert.GeoJsonConverterUnitTests$DocumentToGeoJsonPolygonConverterUnitTests
30-Jun-2019 03:38:12 [INFO] Tests run: 4, Failures: 0, Errors: 0, Skipped: 0, Time elapsed: 0.002 s - in org.springframework.data.mongodb.core.convert.GeoJsonConverterUnitTests$DocumentToGeoJsonPolygonConverterUnitTests
30-Jun-2019 03:38:12 [INFO] Running org.springframework.data.mongodb.core.convert.MongoConvertersIntegrationTests
30-Jun-2019 03:38:12 [INFO] Tests run: 4, Failures: 0, Errors: 0, Skipped: 0, Time elapsed: 0.183 s - in org.springframework.data.mongodb.core.convert.MongoConvertersIntegrationTests
30-Jun-2019 03:38:12 [INFO] Running org.springframework.data.mongodb.core.convert.NamedMongoScriptConvertsUnitTests
30-Jun-2019 03:38:12 [INFO] Tests run: 6, Failures: 0, Errors: 0, Skipped: 0, Time elapsed: 0.001 s - in org.springframework.data.mongodb.core.convert.NamedMongoScriptConvertsUnitTests
30-Jun-2019 03:38:12 [INFO] Running org.springframework.data.mongodb.core.convert.DefaultDbRefResolverUnitTests
30-Jun-2019 03:38:12 [INFO] Tests run: 5, Failures: 0, Errors: 0, Skipped: 0, Time elapsed: 0.006 s - in org.springframework.data.mongodb.core.convert.DefaultDbRefResolverUnitTests
30-Jun-2019 03:38:12 [INFO] Running org.springframework.data.mongodb.core.convert.GeoJsonConverterUnitTests$GeoJsonToDocumentConverterUnitTests
30-Jun-2019 03:38:12 [INFO] Tests run: 8, Failures: 0, Errors: 0, Skipped: 0, Time elapsed: 0.002 s - in org.springframework.data.mongodb.core.convert.GeoJsonConverterUnitTests$GeoJsonToDocumentConverterUnitTests
30-Jun-2019 03:38:12 [INFO] Running org.springframework.data.mongodb.core.convert.DocumentAccessorUnitTests
30-Jun-2019 03:38:12 [INFO] Tests run: 7, Failures: 0, Errors: 0, Skipped: 0, Time elapsed: 0.004 s - in org.springframework.data.mongodb.core.convert.DocumentAccessorUnitTests
30-Jun-2019 03:38:12 [INFO] Running org.springframework.data.mongodb.core.convert.DataMongo273Tests
30-Jun-2019 03:38:12 [WARNING] Tests run: 3, Failures: 0, Errors: 0, Skipped: 1, Time elapsed: 0.015 s - in org.springframework.data.mongodb.core.convert.DataMongo273Tests
30-Jun-2019 03:38:12 [INFO] Running org.springframework.data.mongodb.core.convert.NumberToNumberConverterFactoryUnitTests
30-Jun-2019 03:38:12 [INFO] Tests run: 5, Failures: 0, Errors: 0, Skipped: 0, Time elapsed: 0.009 s - in org.springframework.data.mongodb.core.convert.NumberToNumberConverterFactoryUnitTests
30-Jun-2019 03:38:12 [INFO] Running org.springframework.data.mongodb.core.convert.MongoJsonSchemaMapperUnitTests
30-Jun-2019 03:38:12 [INFO] Tests run: 9, Failures: 0, Errors: 0, Skipped: 0, Time elapsed: 0.011 s - in org.springframework.data.mongodb.core.convert.MongoJsonSchemaMapperUnitTests
30-Jun-2019 03:38:12 [INFO] Running org.springframework.data.mongodb.core.convert.TermToStringConverterUnitTests
30-Jun-2019 03:38:12 [INFO] Tests run: 2, Failures: 0, Errors: 0, Skipped: 0, Time elapsed: 0.006 s - in org.springframework.data.mongodb.core.convert.TermToStringConverterUnitTests
30-Jun-2019 03:38:12 [INFO] Running org.springframework.data.mongodb.core.convert.MongoConvertersUnitTests
30-Jun-2019 03:38:12 [INFO] Tests run: 14, Failures: 0, Errors: 0, Skipped: 0, Time elapsed: 0.008 s - in org.springframework.data.mongodb.core.convert.MongoConvertersUnitTests
30-Jun-2019 03:38:12 [INFO] Running org.springframework.data.mongodb.core.NoExplicitIdTests
30-Jun-2019 03:38:15 [INFO] Tests run: 3, Failures: 0, Errors: 0, Skipped: 0, Time elapsed: 2.252 s - in org.springframework.data.mongodb.core.NoExplicitIdTests
30-Jun-2019 03:38:15 [INFO] Running org.springframework.data.mongodb.core.ReactiveAggregationOperationExtensionsTests
30-Jun-2019 03:38:15 [INFO] Tests run: 3, Failures: 0, Errors: 0, Skipped: 0, Time elapsed: 0.482 s - in org.springframework.data.mongodb.core.ReactiveAggregationOperationExtensionsTests
30-Jun-2019 03:38:15 [INFO] Running org.springframework.data.mongodb.core.aggregation.GraphLookupOperationUnitTests
30-Jun-2019 03:38:15 [INFO] Tests run: 10, Failures: 0, Errors: 0, Skipped: 0, Time elapsed: 0.006 s - in org.springframework.data.mongodb.core.aggregation.GraphLookupOperationUnitTests
30-Jun-2019 03:38:15 [INFO] Running org.springframework.data.mongodb.core.aggregation.FacetOperationUnitTests
30-Jun-2019 03:38:15 [INFO] Tests run: 5, Failures: 0, Errors: 0, Skipped: 0, Time elapsed: 0.011 s - in org.springframework.data.mongodb.core.aggregation.FacetOperationUnitTests
30-Jun-2019 03:38:15 [INFO] Running org.springframework.data.mongodb.core.aggregation.UnwindOperationUnitTests
30-Jun-2019 03:38:15 [INFO] Tests run: 7, Failures: 0, Errors: 0, Skipped: 0, Time elapsed: 0.002 s - in org.springframework.data.mongodb.core.aggregation.UnwindOperationUnitTests
30-Jun-2019 03:38:15 [INFO] Running org.springframework.data.mongodb.core.aggregation.LookupOperationUnitTests
30-Jun-2019 03:38:15 [INFO] Tests run: 12, Failures: 0, Errors: 0, Skipped: 0, Time elapsed: 0.004 s - in org.springframework.data.mongodb.core.aggregation.LookupOperationUnitTests
30-Jun-2019 03:38:15 [INFO] Running org.springframework.data.mongodb.core.aggregation.CountOperationUnitTests
30-Jun-2019 03:38:15 [INFO] Tests run: 3, Failures: 0, Errors: 0, Skipped: 0, Time elapsed: 0 s - in org.springframework.data.mongodb.core.aggregation.CountOperationUnitTests
30-Jun-2019 03:38:15 [INFO] Running org.springframework.data.mongodb.core.aggregation.ReactiveAggregationUnitTests
30-Jun-2019 03:38:15 [INFO] Tests run: 8, Failures: 0, Errors: 0, Skipped: 0, Time elapsed: 0.031 s - in org.springframework.data.mongodb.core.aggregation.ReactiveAggregationUnitTests
30-Jun-2019 03:38:15 [INFO] Running org.springframework.data.mongodb.core.aggregation.GroupOperationUnitTests
30-Jun-2019 03:38:15 [INFO] Tests run: 18, Failures: 0, Errors: 0, Skipped: 0, Time elapsed: 0.01 s - in org.springframework.data.mongodb.core.aggregation.GroupOperationUnitTests
30-Jun-2019 03:38:15 [INFO] Running org.springframework.data.mongodb.core.aggregation.SpelExpressionTransformerUnitTests
30-Jun-2019 03:38:15 [WARNING] Tests run: 154, Failures: 0, Errors: 0, Skipped: 4, Time elapsed: 0.077 s - in org.springframework.data.mongodb.core.aggregation.SpelExpressionTransformerUnitTests
30-Jun-2019 03:38:15 [INFO] Running org.springframework.data.mongodb.core.aggregation.TypeBasedAggregationOperationContextUnitTests
30-Jun-2019 03:38:15 [INFO] Tests run: 19, Failures: 0, Errors: 0, Skipped: 0, Time elapsed: 0.036 s - in org.springframework.data.mongodb.core.aggregation.TypeBasedAggregationOperationContextUnitTests
30-Jun-2019 03:38:15 [INFO] Running org.springframework.data.mongodb.core.aggregation.AggregationOptionsTests
30-Jun-2019 03:38:15 [INFO] Tests run: 3, Failures: 0, Errors: 0, Skipped: 0, Time elapsed: 0 s - in org.springframework.data.mongodb.core.aggregation.AggregationOptionsTests
30-Jun-2019 03:38:15 [INFO] Running org.springframework.data.mongodb.core.aggregation.CondExpressionUnitTests
30-Jun-2019 03:38:15 [INFO] Tests run: 9, Failures: 0, Errors: 0, Skipped: 0, Time elapsed: 0.002 s - in org.springframework.data.mongodb.core.aggregation.CondExpressionUnitTests
30-Jun-2019 03:38:15 [INFO] Running org.springframework.data.mongodb.core.aggregation.AggregationUnitTests
30-Jun-2019 03:38:15 [INFO] Tests run: 37, Failures: 0, Errors: 0, Skipped: 0, Time elapsed: 0.018 s - in org.springframework.data.mongodb.core.aggregation.AggregationUnitTests
30-Jun-2019 03:38:15 [INFO] Running org.springframework.data.mongodb.core.aggregation.ObjectOperatorsUnitTests
30-Jun-2019 03:38:15 [INFO] Tests run: 9, Failures: 0, Errors: 0, Skipped: 0, Time elapsed: 0.006 s - in org.springframework.data.mongodb.core.aggregation.ObjectOperatorsUnitTests
30-Jun-2019 03:38:15 [INFO] Running org.springframework.data.mongodb.core.aggregation.BucketOperationUnitTests
30-Jun-2019 03:38:15 [INFO] Tests run: 18, Failures: 0, Errors: 0, Skipped: 0, Time elapsed: 0.007 s - in org.springframework.data.mongodb.core.aggregation.BucketOperationUnitTests
30-Jun-2019 03:38:15 [INFO] Running org.springframework.data.mongodb.core.aggregation.ProjectionOperationUnitTests
30-Jun-2019 03:38:16 [INFO] Tests run: 190, Failures: 0, Errors: 0, Skipped: 0, Time elapsed: 0.114 s - in org.springframework.data.mongodb.core.aggregation.ProjectionOperationUnitTests
30-Jun-2019 03:38:16 [INFO] Running org.springframework.data.mongodb.core.aggregation.SampleOperationUnitTests
30-Jun-2019 03:38:16 [INFO] Tests run: 3, Failures: 0, Errors: 0, Skipped: 0, Time elapsed: 0 s - in org.springframework.data.mongodb.core.aggregation.SampleOperationUnitTests
30-Jun-2019 03:38:16 [INFO] Running org.springframework.data.mongodb.core.aggregation.SpelExpressionTransformerIntegrationTests
30-Jun-2019 03:38:16 [INFO] Tests run: 2, Failures: 0, Errors: 0, Skipped: 0, Time elapsed: 0.008 s - in org.springframework.data.mongodb.core.aggregation.SpelExpressionTransformerIntegrationTests
30-Jun-2019 03:38:16 [INFO] Running org.springframework.data.mongodb.core.aggregation.StringOperatorsUnitTests
30-Jun-2019 03:38:16 [INFO] Tests run: 16, Failures: 0, Errors: 0, Skipped: 0, Time elapsed: 0.005 s - in org.springframework.data.mongodb.core.aggregation.StringOperatorsUnitTests
30-Jun-2019 03:38:16 [INFO] Running org.springframework.data.mongodb.core.aggregation.AggregationTests
30-Jun-2019 03:38:23 [INFO] Tests run: 62, Failures: 0, Errors: 0, Skipped: 0, Time elapsed: 7.731 s - in org.springframework.data.mongodb.core.aggregation.AggregationTests
30-Jun-2019 03:38:23 [INFO] Running org.springframework.data.mongodb.core.aggregation.FilterExpressionUnitTests
30-Jun-2019 03:38:23 [INFO] Tests run: 3, Failures: 0, Errors: 0, Skipped: 0, Time elapsed: 0.006 s - in org.springframework.data.mongodb.core.aggregation.FilterExpressionUnitTests
30-Jun-2019 03:38:23 [INFO] Running org.springframework.data.mongodb.core.aggregation.GeoNearOperationUnitTests
30-Jun-2019 03:38:23 [INFO] Tests run: 12, Failures: 0, Errors: 0, Skipped: 0, Time elapsed: 0.002 s - in org.springframework.data.mongodb.core.aggregation.GeoNearOperationUnitTests
30-Jun-2019 03:38:23 [INFO] Running org.springframework.data.mongodb.core.aggregation.FieldsUnitTests
30-Jun-2019 03:38:23 [INFO] Tests run: 14, Failures: 0, Errors: 0, Skipped: 0, Time elapsed: 0.003 s - in org.springframework.data.mongodb.core.aggregation.FieldsUnitTests
30-Jun-2019 03:38:23 [INFO] Running org.springframework.data.mongodb.core.aggregation.ReplaceRootOperationUnitTests
30-Jun-2019 03:38:23 [INFO] Tests run: 7, Failures: 0, Errors: 0, Skipped: 0, Time elapsed: 0.001 s - in org.springframework.data.mongodb.core.aggregation.ReplaceRootOperationUnitTests
30-Jun-2019 03:38:23 [INFO] Running org.springframework.data.mongodb.core.aggregation.ExposedFieldsUnitTests
30-Jun-2019 03:38:23 [INFO] Tests run: 4, Failures: 0, Errors: 0, Skipped: 0, Time elapsed: 0 s - in org.springframework.data.mongodb.core.aggregation.ExposedFieldsUnitTests
30-Jun-2019 03:38:23 [INFO] Running org.springframework.data.mongodb.core.aggregation.SortByCountOperationUnitTests
30-Jun-2019 03:38:23 [INFO] Tests run: 2, Failures: 0, Errors: 0, Skipped: 0, Time elapsed: 0.003 s - in org.springframework.data.mongodb.core.aggregation.SortByCountOperationUnitTests
30-Jun-2019 03:38:23 [INFO] Running org.springframework.data.mongodb.core.aggregation.ArrayOperatorsUnitTests
30-Jun-2019 03:38:23 [INFO] Tests run: 3, Failures: 0, Errors: 0, Skipped: 0, Time elapsed: 0.003 s - in org.springframework.data.mongodb.core.aggregation.ArrayOperatorsUnitTests
30-Jun-2019 03:38:23 [INFO] Running org.springframework.data.mongodb.core.aggregation.SkipOperationUnitTests
30-Jun-2019 03:38:23 [INFO] Tests run: 2, Failures: 0, Errors: 0, Skipped: 0, Time elapsed: 0 s - in org.springframework.data.mongodb.core.aggregation.SkipOperationUnitTests
30-Jun-2019 03:38:23 [INFO] Running org.springframework.data.mongodb.core.aggregation.ConvertOperatorsUnitTests
30-Jun-2019 03:38:23 [INFO] Tests run: 26, Failures: 0, Errors: 0, Skipped: 0, Time elapsed: 0.007 s - in org.springframework.data.mongodb.core.aggregation.ConvertOperatorsUnitTests
30-Jun-2019 03:38:23 [INFO] Running org.springframework.data.mongodb.core.aggregation.SortOperationUnitTests
30-Jun-2019 03:38:23 [INFO] Tests run: 2, Failures: 0, Errors: 0, Skipped: 0, Time elapsed: 0.001 s - in org.springframework.data.mongodb.core.aggregation.SortOperationUnitTests
30-Jun-2019 03:38:23 [INFO] Running org.springframework.data.mongodb.core.aggregation.BucketAutoOperationUnitTests
30-Jun-2019 03:38:23 [INFO] Tests run: 9, Failures: 0, Errors: 0, Skipped: 0, Time elapsed: 0.003 s - in org.springframework.data.mongodb.core.aggregation.BucketAutoOperationUnitTests
30-Jun-2019 03:38:23 [INFO] Running org.springframework.data.mongodb.core.aggregation.ReactiveAggregationTests
30-Jun-2019 03:38:24 [INFO] Tests run: 5, Failures: 0, Errors: 0, Skipped: 0, Time elapsed: 0.326 s - in org.springframework.data.mongodb.core.aggregation.ReactiveAggregationTests
30-Jun-2019 03:38:24 [INFO] Running org.springframework.data.mongodb.core.ExecutableFindOperationSupportTests
30-Jun-2019 03:38:29 [INFO] Tests run: 52, Failures: 0, Errors: 0, Skipped: 0, Time elapsed: 5.617 s - in org.springframework.data.mongodb.core.ExecutableFindOperationSupportTests
30-Jun-2019 03:38:29 [INFO] Running org.springframework.data.mongodb.core.ReactiveMongoTemplateUnitTests
30-Jun-2019 03:38:30 [INFO] Tests run: 59, Failures: 0, Errors: 0, Skipped: 0, Time elapsed: 0.34 s - in org.springframework.data.mongodb.core.ReactiveMongoTemplateUnitTests
30-Jun-2019 03:38:30 [INFO] Running org.springframework.data.mongodb.core.schema.MongoJsonSchemaUnitTests
30-Jun-2019 03:38:30 [INFO] Tests run: 5, Failures: 0, Errors: 0, Skipped: 0, Time elapsed: 0.001 s - in org.springframework.data.mongodb.core.schema.MongoJsonSchemaUnitTests
30-Jun-2019 03:38:30 [INFO] Running org.springframework.data.mongodb.core.schema.ReactiveMongoJsonSchemaTests
30-Jun-2019 03:38:30 [INFO] Tests run: 1, Failures: 0, Errors: 0, Skipped: 0, Time elapsed: 0.074 s - in org.springframework.data.mongodb.core.schema.ReactiveMongoJsonSchemaTests
30-Jun-2019 03:38:30 [INFO] Running org.springframework.data.mongodb.core.schema.JsonSchemaPropertyUnitTests
30-Jun-2019 03:38:30 [INFO] Tests run: 8, Failures: 0, Errors: 0, Skipped: 0, Time elapsed: 0.006 s - in org.springframework.data.mongodb.core.schema.JsonSchemaPropertyUnitTests
30-Jun-2019 03:38:30 [INFO] Running org.springframework.data.mongodb.core.schema.JsonSchemaObjectUnitTests
30-Jun-2019 03:38:30 [INFO] Tests run: 34, Failures: 0, Errors: 0, Skipped: 0, Time elapsed: 0.017 s - in org.springframework.data.mongodb.core.schema.JsonSchemaObjectUnitTests
30-Jun-2019 03:38:30 [INFO] Running org.springframework.data.mongodb.core.schema.MongoJsonSchemaTests
30-Jun-2019 03:38:30 [INFO] Tests run: 4, Failures: 0, Errors: 0, Skipped: 0, Time elapsed: 0.172 s - in org.springframework.data.mongodb.core.schema.MongoJsonSchemaTests
30-Jun-2019 03:38:30 [INFO] Running org.springframework.data.mongodb.core.ReactiveUpdateOperationExtensionsTests
30-Jun-2019 03:38:31 [INFO] Tests run: 14, Failures: 0, Errors: 0, Skipped: 0, Time elapsed: 1.08 s - in org.springframework.data.mongodb.core.ReactiveUpdateOperationExtensionsTests
30-Jun-2019 03:38:31 [INFO] Running org.springframework.data.mongodb.core.DefaultScriptOperationsTests
30-Jun-2019 03:38:31 [INFO] Tests run: 11, Failures: 0, Errors: 0, Skipped: 0, Time elapsed: 0.211 s - in org.springframework.data.mongodb.core.DefaultScriptOperationsTests
30-Jun-2019 03:38:31 [INFO] Running org.springframework.data.mongodb.core.DefaultScriptOperationsUnitTests
30-Jun-2019 03:38:31 [INFO] Tests run: 9, Failures: 0, Errors: 0, Skipped: 0, Time elapsed: 0.045 s - in org.springframework.data.mongodb.core.DefaultScriptOperationsUnitTests
30-Jun-2019 03:38:31 [INFO] Running org.springframework.data.mongodb.core.ReactiveRemoveOperationSupportTests
30-Jun-2019 03:38:31 [INFO] Tests run: 4, Failures: 0, Errors: 0, Skipped: 0, Time elapsed: 0.218 s - in org.springframework.data.mongodb.core.ReactiveRemoveOperationSupportTests
30-Jun-2019 03:38:31 [INFO] Running org.springframework.data.mongodb.core.ExecutableRemoveOperationSupportTests
30-Jun-2019 03:38:32 [INFO] Tests run: 4, Failures: 0, Errors: 0, Skipped: 0, Time elapsed: 0.227 s - in org.springframework.data.mongodb.core.ExecutableRemoveOperationSupportTests
30-Jun-2019 03:38:32 [INFO] Running org.springframework.data.mongodb.core.ReactiveMapReduceOperationSupportUnitTests
30-Jun-2019 03:38:32 [INFO] Tests run: 7, Failures: 0, Errors: 0, Skipped: 0, Time elapsed: 0.007 s - in org.springframework.data.mongodb.core.ReactiveMapReduceOperationSupportUnitTests
30-Jun-2019 03:38:32 [INFO] Running org.springframework.data.mongodb.core.ExecutableMapReduceOperationSupportUnitTests
30-Jun-2019 03:38:32 [INFO] Tests run: 7, Failures: 0, Errors: 0, Skipped: 0, Time elapsed: 0.006 s - in org.springframework.data.mongodb.core.ExecutableMapReduceOperationSupportUnitTests
30-Jun-2019 03:38:32 [INFO] Running org.springframework.data.mongodb.core.ExecutableFindOperationExtensionsTests
30-Jun-2019 03:38:33 [INFO] Tests run: 6, Failures: 0, Errors: 0, Skipped: 0, Time elapsed: 0.953 s - in org.springframework.data.mongodb.core.ExecutableFindOperationExtensionsTests
30-Jun-2019 03:38:33 [INFO] Running org.springframework.data.mongodb.core.ReactiveFindOperationExtensionsTests
30-Jun-2019 03:38:34 [INFO] Tests run: 20, Failures: 0, Errors: 0, Skipped: 0, Time elapsed: 1.116 s - in org.springframework.data.mongodb.core.ReactiveFindOperationExtensionsTests
30-Jun-2019 03:38:34 [INFO] Running org.springframework.data.mongodb.core.MappingMongoJsonSchemaCreatorUnitTests
30-Jun-2019 03:38:34 [INFO] Tests run: 4, Failures: 0, Errors: 0, Skipped: 0, Time elapsed: 0.022 s - in org.springframework.data.mongodb.core.MappingMongoJsonSchemaCreatorUnitTests
30-Jun-2019 03:38:34 [INFO] Running org.springframework.data.mongodb.core.ReactiveInsertOperationSupportUnitTests
30-Jun-2019 03:38:34 [INFO] Tests run: 4, Failures: 0, Errors: 0, Skipped: 0, Time elapsed: 0.006 s - in org.springframework.data.mongodb.core.ReactiveInsertOperationSupportUnitTests
30-Jun-2019 03:38:34 [INFO] Running org.springframework.data.mongodb.core.geo.GeoSpatial2DTests
30-Jun-2019 03:38:35 [INFO] Tests run: 9, Failures: 0, Errors: 0, Skipped: 0, Time elapsed: 0.871 s - in org.springframework.data.mongodb.core.geo.GeoSpatial2DTests
30-Jun-2019 03:38:35 [INFO] Running org.springframework.data.mongodb.core.geo.GeoJsonModuleUnitTests
30-Jun-2019 03:38:35 [INFO] Tests run: 6, Failures: 0, Errors: 0, Skipped: 0, Time elapsed: 0.6 s - in org.springframework.data.mongodb.core.geo.GeoJsonModuleUnitTests
30-Jun-2019 03:38:35 [INFO] Running org.springframework.data.mongodb.core.geo.GeoJsonTests
30-Jun-2019 03:38:37 [INFO] Tests run: 22, Failures: 0, Errors: 0, Skipped: 0, Time elapsed: 2.105 s - in org.springframework.data.mongodb.core.geo.GeoJsonTests
30-Jun-2019 03:38:37 [INFO] Running org.springframework.data.mongodb.core.geo.GeoSpatialIndexTests
30-Jun-2019 03:38:38 [INFO] Tests run: 4, Failures: 0, Errors: 0, Skipped: 0, Time elapsed: 0.423 s - in org.springframework.data.mongodb.core.geo.GeoSpatialIndexTests
30-Jun-2019 03:38:38 [INFO] Running org.springframework.data.mongodb.core.geo.GeoSpatial2DSphereTests
30-Jun-2019 03:38:38 [INFO] Tests run: 10, Failures: 0, Errors: 0, Skipped: 0, Time elapsed: 0.693 s - in org.springframework.data.mongodb.core.geo.GeoSpatial2DSphereTests
30-Jun-2019 03:38:38 [INFO] Running org.springframework.data.mongodb.core.ExecutableMapReduceOperationExtensionsTests
30-Jun-2019 03:38:39 [INFO] Tests run: 4, Failures: 0, Errors: 0, Skipped: 0, Time elapsed: 0.467 s - in org.springframework.data.mongodb.core.ExecutableMapReduceOperationExtensionsTests
30-Jun-2019 03:38:39 [INFO] Running org.springframework.data.mongodb.core.script.ExecutableMongoScriptUnitTests
30-Jun-2019 03:38:39 [INFO] Tests run: 3, Failures: 0, Errors: 0, Skipped: 0, Time elapsed: 0.003 s - in org.springframework.data.mongodb.core.script.ExecutableMongoScriptUnitTests
30-Jun-2019 03:38:39 [INFO] Running org.springframework.data.mongodb.core.script.NamedMongoScriptUnitTests
30-Jun-2019 03:38:39 [INFO] Tests run: 4, Failures: 0, Errors: 0, Skipped: 0, Time elapsed: 0.001 s - in org.springframework.data.mongodb.core.script.NamedMongoScriptUnitTests
30-Jun-2019 03:38:39 [INFO] Running org.springframework.data.mongodb.core.query.CriteriaExtensionsTests
30-Jun-2019 03:38:39 [INFO] Tests run: 10, Failures: 0, Errors: 0, Skipped: 0, Time elapsed: 0.029 s - in org.springframework.data.mongodb.core.query.CriteriaExtensionsTests
30-Jun-2019 03:38:39 [INFO] Running org.springframework.data.mongodb.core.query.QueryTests
30-Jun-2019 03:38:39 [INFO] Tests run: 29, Failures: 0, Errors: 0, Skipped: 0, Time elapsed: 0.026 s - in org.springframework.data.mongodb.core.query.QueryTests
30-Jun-2019 03:38:39 [INFO] Running org.springframework.data.mongodb.core.query.KPropertyPathTests
30-Jun-2019 03:38:39 [INFO] Tests run: 4, Failures: 0, Errors: 0, Skipped: 0, Time elapsed: 0.004 s - in org.springframework.data.mongodb.core.query.KPropertyPathTests
30-Jun-2019 03:38:39 [INFO] Running org.springframework.data.mongodb.core.query.FieldUnitTests
30-Jun-2019 03:38:39 [INFO] Tests run: 2, Failures: 0, Errors: 0, Skipped: 0, Time elapsed: 0.002 s - in org.springframework.data.mongodb.core.query.FieldUnitTests
30-Jun-2019 03:38:39 [INFO] Running org.springframework.data.mongodb.core.query.TypedCriteriaExtensionsTests
30-Jun-2019 03:38:39 [INFO] Tests run: 38, Failures: 0, Errors: 0, Skipped: 0, Time elapsed: 0.041 s - in org.springframework.data.mongodb.core.query.TypedCriteriaExtensionsTests
30-Jun-2019 03:38:39 [INFO] Running org.springframework.data.mongodb.core.query.IndexUnitTests
30-Jun-2019 03:38:39 [INFO] Tests run: 8, Failures: 0, Errors: 0, Skipped: 0, Time elapsed: 0.002 s - in org.springframework.data.mongodb.core.query.IndexUnitTests
30-Jun-2019 03:38:39 [INFO] Running org.springframework.data.mongodb.core.query.TextCriteriaUnitTests
30-Jun-2019 03:38:39 [INFO] Tests run: 10, Failures: 0, Errors: 0, Skipped: 0, Time elapsed: 0.004 s - in org.springframework.data.mongodb.core.query.TextCriteriaUnitTests
30-Jun-2019 03:38:39 [INFO] Running org.springframework.data.mongodb.core.query.NearQueryUnitTests
30-Jun-2019 03:38:39 [INFO] Tests run: 19, Failures: 0, Errors: 0, Skipped: 0, Time elapsed: 0.019 s - in org.springframework.data.mongodb.core.query.NearQueryUnitTests
30-Jun-2019 03:38:39 [INFO] Running org.springframework.data.mongodb.core.query.UntypedExampleMatcherUnitTests
30-Jun-2019 03:38:39 [INFO] Tests run: 17, Failures: 0, Errors: 0, Skipped: 0, Time elapsed: 0.005 s - in org.springframework.data.mongodb.core.query.UntypedExampleMatcherUnitTests
30-Jun-2019 03:38:39 [INFO] Running org.springframework.data.mongodb.core.query.MetricConversionUnitTests
30-Jun-2019 03:38:39 [INFO] Tests run: 4, Failures: 0, Errors: 0, Skipped: 0, Time elapsed: 0 s - in org.springframework.data.mongodb.core.query.MetricConversionUnitTests
30-Jun-2019 03:38:39 [INFO] Running org.springframework.data.mongodb.core.query.SortTests
30-Jun-2019 03:38:39 [INFO] Tests run: 3, Failures: 0, Errors: 0, Skipped: 0, Time elapsed: 0 s - in org.springframework.data.mongodb.core.query.SortTests
30-Jun-2019 03:38:39 [INFO] Running org.springframework.data.mongodb.core.query.CriteriaTests
30-Jun-2019 03:38:40 [INFO] Tests run: 12, Failures: 0, Errors: 0, Skipped: 0, Time elapsed: 0.589 s - in org.springframework.data.mongodb.core.query.CriteriaTests
30-Jun-2019 03:38:40 [INFO] Running org.springframework.data.mongodb.core.query.CriteriaUnitTests
30-Jun-2019 03:38:40 [INFO] Tests run: 34, Failures: 0, Errors: 0, Skipped: 0, Time elapsed: 0.008 s - in org.springframework.data.mongodb.core.query.CriteriaUnitTests
30-Jun-2019 03:38:40 [INFO] Running org.springframework.data.mongodb.core.query.BasicQueryUnitTests
30-Jun-2019 03:38:40 [INFO] Tests run: 10, Failures: 0, Errors: 0, Skipped: 0, Time elapsed: 0.302 s - in org.springframework.data.mongodb.core.query.BasicQueryUnitTests
30-Jun-2019 03:38:40 [INFO] Running org.springframework.data.mongodb.core.query.UpdateTests
30-Jun-2019 03:38:40 [INFO] Tests run: 56, Failures: 0, Errors: 0, Skipped: 0, Time elapsed: 0.037 s - in org.springframework.data.mongodb.core.query.UpdateTests
30-Jun-2019 03:38:40 [INFO] Running org.springframework.data.mongodb.core.query.MongoRegexCreatorUnitTests
30-Jun-2019 03:38:40 [INFO] Tests run: 15, Failures: 0, Errors: 0, Skipped: 0, Time elapsed: 0.005 s - in org.springframework.data.mongodb.core.query.MongoRegexCreatorUnitTests
30-Jun-2019 03:38:40 [INFO] Running org.springframework.data.mongodb.core.query.TextQueryTests
30-Jun-2019 03:38:41 [INFO] Tests run: 10, Failures: 0, Errors: 0, Skipped: 0, Time elapsed: 0.707 s - in org.springframework.data.mongodb.core.query.TextQueryTests
30-Jun-2019 03:38:41 [INFO] Running org.springframework.data.mongodb.core.query.TextQueryUnitTests
30-Jun-2019 03:38:41 [INFO] Tests run: 7, Failures: 0, Errors: 0, Skipped: 0, Time elapsed: 0.002 s - in org.springframework.data.mongodb.core.query.TextQueryUnitTests
30-Jun-2019 03:38:41 [INFO] Running org.springframework.data.mongodb.ReactiveMongoDatabaseUtilsUnitTests
30-Jun-2019 03:38:41 [INFO] Tests run: 5, Failures: 0, Errors: 0, Skipped: 0, Time elapsed: 0.067 s - in org.springframework.data.mongodb.ReactiveMongoDatabaseUtilsUnitTests
30-Jun-2019 03:38:41 [INFO] Running org.springframework.data.mongodb.monitor.MongoMonitorIntegrationTests
30-Jun-2019 03:38:41 [INFO] Tests run: 3, Failures: 0, Errors: 0, Skipped: 0, Time elapsed: 0 s - in org.springframework.data.mongodb.monitor.MongoMonitorIntegrationTests
30-Jun-2019 03:38:41 [INFO] Running org.springframework.data.mongodb.test.util.CleanMongoDBTests
30-Jun-2019 03:38:41 [INFO] Tests run: 9, Failures: 0, Errors: 0, Skipped: 0, Time elapsed: 0.047 s - in org.springframework.data.mongodb.test.util.CleanMongoDBTests
30-Jun-2019 03:38:41 [INFO] Running org.springframework.data.mongodb.MongoDatabaseUtilsUnitTests
30-Jun-2019 03:38:41 [INFO] Tests run: 9, Failures: 0, Errors: 0, Skipped: 0, Time elapsed: 0.027 s - in org.springframework.data.mongodb.MongoDatabaseUtilsUnitTests
30-Jun-2019 03:38:41 [INFO] Running org.springframework.data.mongodb.DependencyTests
30-Jun-2019 03:39:02 [INFO] Tests run: 3, Failures: 0, Errors: 0, Skipped: 0, Time elapsed: 20.644 s - in org.springframework.data.mongodb.DependencyTests
30-Jun-2019 03:39:02 [INFO] Running org.springframework.data.mongodb.repository.config.MongoRepositoriesRegistrarIntegrationTests
30-Jun-2019 03:39:02 [INFO] Tests run: 1, Failures: 0, Errors: 0, Skipped: 0, Time elapsed: 0.311 s - in org.springframework.data.mongodb.repository.config.MongoRepositoriesRegistrarIntegrationTests
30-Jun-2019 03:39:02 [INFO] Running org.springframework.data.mongodb.repository.config.lazy.NestedMongoRepositoriesJavaConfigTests
30-Jun-2019 03:39:02 [INFO] Tests run: 1, Failures: 0, Errors: 0, Skipped: 0, Time elapsed: 0.037 s - in org.springframework.data.mongodb.repository.config.lazy.NestedMongoRepositoriesJavaConfigTests
30-Jun-2019 03:39:02 [INFO] Running org.springframework.data.mongodb.repository.config.lazy.AllowNestedMongoRepositoriesRepositoryConfigTests
30-Jun-2019 03:39:02 [INFO] Tests run: 1, Failures: 0, Errors: 0, Skipped: 0, Time elapsed: 0.034 s - in org.springframework.data.mongodb.repository.config.lazy.AllowNestedMongoRepositoriesRepositoryConfigTests
30-Jun-2019 03:39:02 [INFO] Running org.springframework.data.mongodb.repository.config.MongoNamespaceIntegrationTests
30-Jun-2019 03:39:04 [INFO] Tests run: 123, Failures: 0, Errors: 0, Skipped: 0, Time elapsed: 2.395 s - in org.springframework.data.mongodb.repository.config.MongoNamespaceIntegrationTests
30-Jun-2019 03:39:04 [INFO] Running org.springframework.data.mongodb.repository.config.ReactiveMongoRepositoryConfigurationExtensionUnitTests
30-Jun-2019 03:39:04 [INFO] Tests run: 3, Failures: 0, Errors: 0, Skipped: 0, Time elapsed: 0.023 s - in org.springframework.data.mongodb.repository.config.ReactiveMongoRepositoryConfigurationExtensionUnitTests
30-Jun-2019 03:39:04 [INFO] Running org.springframework.data.mongodb.repository.config.ReactiveMongoRepositoriesRegistrarIntegrationTests
30-Jun-2019 03:39:04 [INFO] Tests run: 1, Failures: 0, Errors: 0, Skipped: 0, Time elapsed: 0.097 s - in org.springframework.data.mongodb.repository.config.ReactiveMongoRepositoriesRegistrarIntegrationTests
30-Jun-2019 03:39:04 [INFO] Running org.springframework.data.mongodb.repository.config.MongoRepositoryConfigurationExtensionUnitTests
30-Jun-2019 03:39:04 [INFO] Tests run: 3, Failures: 0, Errors: 0, Skipped: 0, Time elapsed: 0.018 s - in org.springframework.data.mongodb.repository.config.MongoRepositoryConfigurationExtensionUnitTests
30-Jun-2019 03:39:04 [INFO] Running org.springframework.data.mongodb.repository.ConvertingReactiveMongoRepositoryTests
30-Jun-2019 03:39:05 [INFO] Tests run: 17, Failures: 0, Errors: 0, Skipped: 0, Time elapsed: 0.275 s - in org.springframework.data.mongodb.repository.ConvertingReactiveMongoRepositoryTests
30-Jun-2019 03:39:05 [INFO] Running org.springframework.data.mongodb.repository.support.ReactiveQuerydslMongoPredicateExecutorTests
30-Jun-2019 03:39:05 2019-06-30 03:39:05,564 ERROR .data.mongodb.core.ReactiveMongoTemplate: 309 - Unexpected exception during asynchronous execution
30-Jun-2019 03:39:05 org.springframework.dao.PermissionDeniedDataAccessException: Authentication Failed; nested exception is com.mongodb.MongoException: Authentication Failed
30-Jun-2019 03:39:05         at org.springframework.data.mongodb.core.MongoExceptionTranslator.translateExceptionIfPossible(MongoExceptionTranslator.java:132)
30-Jun-2019 03:39:05         at org.springframework.data.mongodb.core.ReactiveMongoTemplate.potentiallyConvertRuntimeException(ReactiveMongoTemplate.java:2736)
30-Jun-2019 03:39:05         at org.springframework.data.mongodb.core.ReactiveMongoTemplate.lambda$translateException$86(ReactiveMongoTemplate.java:2719)
30-Jun-2019 03:39:05         at reactor.core.publisher.Flux.lambda$onErrorMap$24(Flux.java:6193)
30-Jun-2019 03:39:05         at reactor.core.publisher.FluxOnErrorResume$ResumeSubscriber.onError(FluxOnErrorResume.java:88)
30-Jun-2019 03:39:05         at reactor.core.publisher.MonoFlatMapMany$FlatMapManyMain.onError(MonoFlatMapMany.java:193)
30-Jun-2019 03:39:05         at reactor.core.publisher.FluxMap$MapSubscriber.onError(FluxMap.java:126)
30-Jun-2019 03:39:05         at reactor.core.publisher.Operators.error(Operators.java:182)
30-Jun-2019 03:39:05         at reactor.core.publisher.MonoError.subscribe(MonoError.java:52)
30-Jun-2019 03:39:05         at reactor.core.publisher.MonoMap.subscribe(MonoMap.java:55)
30-Jun-2019 03:39:05         at reactor.core.publisher.MonoFlatMapMany.subscribe(MonoFlatMapMany.java:49)
30-Jun-2019 03:39:05         at reactor.core.publisher.FluxOnErrorResume.subscribe(FluxOnErrorResume.java:47)
30-Jun-2019 03:39:05         at reactor.core.publisher.MonoNext.subscribe(MonoNext.java:40)
30-Jun-2019 03:39:05         at reactor.core.publisher.MonoOnErrorResume.subscribe(MonoOnErrorResume.java:44)
30-Jun-2019 03:39:05         at reactor.core.publisher.Mono.subscribe(Mono.java:3711)
30-Jun-2019 03:39:05         at reactor.core.publisher.FluxFlatMap$FlatMapMain.onNext(FluxFlatMap.java:389)
30-Jun-2019 03:39:05         at reactor.core.publisher.FluxIterable$IterableSubscription.slowPath(FluxIterable.java:243)
30-Jun-2019 03:39:05         at reactor.core.publisher.FluxIterable$IterableSubscription.request(FluxIterable.java:201)
30-Jun-2019 03:39:05         at reactor.core.publisher.FluxFlatMap$FlatMapMain.onSubscribe(FluxFlatMap.java:335)
30-Jun-2019 03:39:05         at reactor.core.publisher.FluxIterable.subscribe(FluxIterable.java:139)
30-Jun-2019 03:39:05         at reactor.core.publisher.FluxIterable.subscribe(FluxIterable.java:63)
30-Jun-2019 03:39:05         at reactor.core.publisher.FluxFlatMap.subscribe(FluxFlatMap.java:97)
30-Jun-2019 03:39:05         at reactor.core.publisher.MonoIgnoreElements.subscribe(MonoIgnoreElements.java:37)
30-Jun-2019 03:39:05         at reactor.core.publisher.Mono.subscribe(Mono.java:3711)
30-Jun-2019 03:39:05         at reactor.core.publisher.Mono.subscribeWith(Mono.java:3817)
30-Jun-2019 03:39:05         at reactor.core.publisher.Mono.subscribe(Mono.java:3705)
30-Jun-2019 03:39:05         at reactor.core.publisher.Mono.subscribe(Mono.java:3672)
30-Jun-2019 03:39:05         at reactor.core.publisher.Mono.subscribe(Mono.java:3644)
30-Jun-2019 03:39:05         at org.springframework.data.mongodb.core.ReactiveMongoTemplate.onCheckForIndexes(ReactiveMongoTemplate.java:304)
30-Jun-2019 03:39:05         at org.springframework.data.mongodb.core.ReactiveMongoTemplate.access$1100(ReactiveMongoTemplate.java:168)
30-Jun-2019 03:39:05         at org.springframework.data.mongodb.core.ReactiveMongoTemplate$IndexCreatorEventListener.onApplicationEvent(ReactiveMongoTemplate.java:3332)
30-Jun-2019 03:39:05         at org.springframework.data.mongodb.core.ReactiveMongoTemplate$IndexCreatorEventListener.onApplicationEvent(ReactiveMongoTemplate.java:3315)
30-Jun-2019 03:39:05         at org.springframework.data.mongodb.core.index.MongoMappingEventPublisher.publishEvent(MongoMappingEventPublisher.java:76)
30-Jun-2019 03:39:05         at org.springframework.data.mapping.context.AbstractMappingContext.addPersistentEntity(AbstractMappingContext.java:396)
30-Jun-2019 03:39:05         at org.springframework.data.mapping.context.AbstractMappingContext.getPersistentEntity(AbstractMappingContext.java:248)
30-Jun-2019 03:39:05         at org.springframework.data.mapping.context.AbstractMappingContext.getPersistentEntity(AbstractMappingContext.java:191)
30-Jun-2019 03:39:05         at org.springframework.data.mapping.context.AbstractMappingContext.getPersistentEntity(AbstractMappingContext.java:85)
30-Jun-2019 03:39:05         at org.springframework.data.mapping.context.MappingContext.getRequiredPersistentEntity(MappingContext.java:73)
30-Jun-2019 03:39:05         at org.springframework.data.mongodb.repository.support.ReactiveMongoRepositoryFactory.getEntityInformation(ReactiveMongoRepositoryFactory.java:148)
30-Jun-2019 03:39:05         at org.springframework.data.mongodb.repository.support.ReactiveMongoRepositoryFactory.getEntityInformation(ReactiveMongoRepositoryFactory.java:141)
30-Jun-2019 03:39:05         at org.springframework.data.mongodb.repository.support.ReactiveQuerydslMongoPredicateExecutorTests.translatesExceptionsCorrectly(ReactiveQuerydslMongoPredicateExecutorTests.java:320)
30-Jun-2019 03:39:05         at sun.reflect.NativeMethodAccessorImpl.invoke0(Native Method)
30-Jun-2019 03:39:05         at sun.reflect.NativeMethodAccessorImpl.invoke(NativeMethodAccessorImpl.java:62)
30-Jun-2019 03:39:05         at sun.reflect.DelegatingMethodAccessorImpl.invoke(DelegatingMethodAccessorImpl.java:43)
30-Jun-2019 03:39:05         at java.lang.reflect.Method.invoke(Method.java:498)
30-Jun-2019 03:39:05         at org.junit.runners.model.FrameworkMethod$1.runReflectiveCall(FrameworkMethod.java:50)
30-Jun-2019 03:39:05         at org.junit.internal.runners.model.ReflectiveCallable.run(ReflectiveCallable.java:12)
30-Jun-2019 03:39:05         at org.junit.runners.model.FrameworkMethod.invokeExplosively(FrameworkMethod.java:47)
30-Jun-2019 03:39:05         at org.junit.internal.runners.statements.InvokeMethod.evaluate(InvokeMethod.java:17)
30-Jun-2019 03:39:05         at org.springframework.test.context.junit4.statements.RunBeforeTestExecutionCallbacks.evaluate(RunBeforeTestExecutionCallbacks.java:74)
30-Jun-2019 03:39:05         at org.springframework.test.context.junit4.statements.RunAfterTestExecutionCallbacks.evaluate(RunAfterTestExecutionCallbacks.java:84)
30-Jun-2019 03:39:05         at org.junit.internal.runners.statements.RunBefores.evaluate(RunBefores.java:26)
30-Jun-2019 03:39:05         at org.springframework.test.context.junit4.statements.RunBeforeTestMethodCallbacks.evaluate(RunBeforeTestMethodCallbacks.java:75)
30-Jun-2019 03:39:05         at org.junit.internal.runners.statements.RunAfters.evaluate(RunAfters.java:27)
30-Jun-2019 03:39:05         at org.springframework.test.context.junit4.statements.RunAfterTestMethodCallbacks.evaluate(RunAfterTestMethodCallbacks.java:86)
30-Jun-2019 03:39:05         at org.springframework.test.context.junit4.statements.SpringRepeat.evaluate(SpringRepeat.java:84)
30-Jun-2019 03:39:05         at org.junit.runners.ParentRunner.runLeaf(ParentRunner.java:325)
30-Jun-2019 03:39:05         at org.springframework.test.context.junit4.SpringJUnit4ClassRunner.runChild(SpringJUnit4ClassRunner.java:251)
30-Jun-2019 03:39:05         at org.springframework.test.context.junit4.SpringJUnit4ClassRunner.runChild(SpringJUnit4ClassRunner.java:97)
30-Jun-2019 03:39:05         at org.junit.runners.ParentRunner$3.run(ParentRunner.java:290)
30-Jun-2019 03:39:05         at org.junit.runners.ParentRunner$1.schedule(ParentRunner.java:71)
30-Jun-2019 03:39:05         at org.junit.runners.ParentRunner.runChildren(ParentRunner.java:288)
30-Jun-2019 03:39:05         at org.junit.runners.ParentRunner.access$000(ParentRunner.java:58)
30-Jun-2019 03:39:05         at org.junit.runners.ParentRunner$2.evaluate(ParentRunner.java:268)
30-Jun-2019 03:39:05         at org.junit.internal.runners.statements.RunBefores.evaluate(RunBefores.java:26)
30-Jun-2019 03:39:05         at org.springframework.test.context.junit4.statements.RunBeforeTestClassCallbacks.evaluate(RunBeforeTestClassCallbacks.java:61)
30-Jun-2019 03:39:05         at org.springframework.test.context.junit4.statements.RunAfterTestClassCallbacks.evaluate(RunAfterTestClassCallbacks.java:70)
30-Jun-2019 03:39:05         at org.junit.runners.ParentRunner.run(ParentRunner.java:363)
30-Jun-2019 03:39:05         at org.springframework.test.context.junit4.SpringJUnit4ClassRunner.run(SpringJUnit4ClassRunner.java:190)
30-Jun-2019 03:39:05         at org.apache.maven.surefire.junit4.JUnit4Provider.execute(JUnit4Provider.java:365)
30-Jun-2019 03:39:05         at org.apache.maven.surefire.junit4.JUnit4Provider.executeWithRerun(JUnit4Provider.java:273)
30-Jun-2019 03:39:05         at org.apache.maven.surefire.junit4.JUnit4Provider.executeTestSet(JUnit4Provider.java:238)
30-Jun-2019 03:39:05         at org.apache.maven.surefire.junit4.JUnit4Provider.invoke(JUnit4Provider.java:159)
30-Jun-2019 03:39:05         at org.apache.maven.surefire.booter.ForkedBooter.invokeProviderInSameClassLoader(ForkedBooter.java:384)
30-Jun-2019 03:39:05         at org.apache.maven.surefire.booter.ForkedBooter.runSuitesInProcess(ForkedBooter.java:345)
30-Jun-2019 03:39:05         at org.apache.maven.surefire.booter.ForkedBooter.execute(ForkedBooter.java:126)
30-Jun-2019 03:39:05         at org.apache.maven.surefire.booter.ForkedBooter.main(ForkedBooter.java:418)
30-Jun-2019 03:39:05 Caused by: com.mongodb.MongoException: Authentication Failed
30-Jun-2019 03:39:05         at org.springframework.data.mongodb.repository.support.ReactiveQuerydslMongoPredicateExecutorTests$1.doGetDatabase(ReactiveQuerydslMongoPredicateExecutorTests.java:315)
30-Jun-2019 03:39:05         at org.springframework.data.mongodb.core.ReactiveMongoTemplate.createFlux(ReactiveMongoTemplate.java:651)
30-Jun-2019 03:39:05         at org.springframework.data.mongodb.core.ReactiveMongoTemplate.execute(ReactiveMongoTemplate.java:504)
30-Jun-2019 03:39:05         at org.springframework.data.mongodb.core.DefaultReactiveIndexOperations.ensureIndex(DefaultReactiveIndexOperations.java:95)
30-Jun-2019 03:39:05         at org.springframework.data.mongodb.core.index.ReactiveMongoPersistentEntityIndexCreator.createIndex(ReactiveMongoPersistentEntityIndexCreator.java:147)
30-Jun-2019 03:39:05         at org.springframework.data.mongodb.core.index.ReactiveMongoPersistentEntityIndexCreator.checkForAndCreateIndexes(ReactiveMongoPersistentEntityIndexCreator.java:136)
30-Jun-2019 03:39:05         at org.springframework.data.mongodb.core.index.ReactiveMongoPersistentEntityIndexCreator.checkForIndexes(ReactiveMongoPersistentEntityIndexCreator.java:116)
30-Jun-2019 03:39:05         ... 49 common frames omitted
30-Jun-2019 03:39:05 [INFO] Tests run: 11, Failures: 0, Errors: 0, Skipped: 0, Time elapsed: 0.383 s - in org.springframework.data.mongodb.repository.support.ReactiveQuerydslMongoPredicateExecutorTests
30-Jun-2019 03:39:05 [INFO] Running org.springframework.data.mongodb.repository.support.MongoRepositoryFactoryUnitTests
30-Jun-2019 03:39:05 [INFO] Tests run: 2, Failures: 0, Errors: 0, Skipped: 0, Time elapsed: 0.013 s - in org.springframework.data.mongodb.repository.support.MongoRepositoryFactoryUnitTests
30-Jun-2019 03:39:05 [INFO] Running org.springframework.data.mongodb.repository.support.SimpleMongoRepositoryUnitTests
30-Jun-2019 03:39:05 [INFO] Tests run: 6, Failures: 0, Errors: 0, Skipped: 0, Time elapsed: 0.013 s - in org.springframework.data.mongodb.repository.support.SimpleMongoRepositoryUnitTests
30-Jun-2019 03:39:05 [INFO] Running org.springframework.data.mongodb.repository.support.SimpleReactiveMongoRepositoryVersionedEntityTests
30-Jun-2019 03:39:05 [INFO] Tests run: 3, Failures: 0, Errors: 0, Skipped: 0, Time elapsed: 0.078 s - in org.springframework.data.mongodb.repository.support.SimpleReactiveMongoRepositoryVersionedEntityTests
30-Jun-2019 03:39:05 [INFO] Running org.springframework.data.mongodb.repository.support.IndexEnsuringQueryCreationListenerUnitTests
30-Jun-2019 03:39:05 [INFO] Tests run: 5, Failures: 0, Errors: 0, Skipped: 0, Time elapsed: 0.085 s - in org.springframework.data.mongodb.repository.support.IndexEnsuringQueryCreationListenerUnitTests
30-Jun-2019 03:39:05 [INFO] Running org.springframework.data.mongodb.repository.support.SimpleMongoRepositoryTests
30-Jun-2019 03:39:08 [WARNING] Tests run: 25, Failures: 0, Errors: 0, Skipped: 2, Time elapsed: 2.398 s - in org.springframework.data.mongodb.repository.support.SimpleMongoRepositoryTests
30-Jun-2019 03:39:08 [INFO] Running org.springframework.data.mongodb.repository.support.SimpleMongoRepositoryVersionedEntityTests
30-Jun-2019 03:39:08 [WARNING] Tests run: 6, Failures: 0, Errors: 0, Skipped: 3, Time elapsed: 0.055 s - in org.springframework.data.mongodb.repository.support.SimpleMongoRepositoryVersionedEntityTests
30-Jun-2019 03:39:08 [INFO] Running org.springframework.data.mongodb.repository.support.MongoRepositoryFactoryBeanUnitTests
30-Jun-2019 03:39:08 [INFO] Tests run: 2, Failures: 0, Errors: 0, Skipped: 0, Time elapsed: 0.002 s - in org.springframework.data.mongodb.repository.support.MongoRepositoryFactoryBeanUnitTests
30-Jun-2019 03:39:08 [INFO] Running org.springframework.data.mongodb.repository.support.SimpleReactiveMongoRepositoryUnitTests
30-Jun-2019 03:39:08 [INFO] Tests run: 5, Failures: 0, Errors: 0, Skipped: 0, Time elapsed: 0.065 s - in org.springframework.data.mongodb.repository.support.SimpleReactiveMongoRepositoryUnitTests
30-Jun-2019 03:39:08 [INFO] Running org.springframework.data.mongodb.repository.support.QuerydslRepositorySupportTests
30-Jun-2019 03:39:08 [INFO] Tests run: 10, Failures: 0, Errors: 0, Skipped: 0, Time elapsed: 0.265 s - in org.springframework.data.mongodb.repository.support.QuerydslRepositorySupportTests
30-Jun-2019 03:39:08 [INFO] Running org.springframework.data.mongodb.repository.support.QuerydslMongoPredicateExecutorIntegrationTests
30-Jun-2019 03:39:09 [INFO] Tests run: 10, Failures: 0, Errors: 0, Skipped: 0, Time elapsed: 0.527 s - in org.springframework.data.mongodb.repository.support.QuerydslMongoPredicateExecutorIntegrationTests
30-Jun-2019 03:39:09 [INFO] Running org.springframework.data.mongodb.repository.support.SpringDataMongodbSerializerUnitTests
30-Jun-2019 03:39:09 [INFO] Tests run: 9, Failures: 0, Errors: 0, Skipped: 0, Time elapsed: 0.017 s - in org.springframework.data.mongodb.repository.support.SpringDataMongodbSerializerUnitTests
30-Jun-2019 03:39:09 [INFO] Running org.springframework.data.mongodb.repository.SimpleReactiveMongoRepositoryTests
30-Jun-2019 03:39:09 [INFO] Tests run: 40, Failures: 0, Errors: 0, Skipped: 0, Time elapsed: 0.207 s - in org.springframework.data.mongodb.repository.SimpleReactiveMongoRepositoryTests
30-Jun-2019 03:39:09 [INFO] Running org.springframework.data.mongodb.repository.custom.CustomRepositoryImplementationTests
30-Jun-2019 03:39:09 [INFO] Tests run: 1, Failures: 0, Errors: 0, Skipped: 0, Time elapsed: 0.025 s - in org.springframework.data.mongodb.repository.custom.CustomRepositoryImplementationTests
30-Jun-2019 03:39:09 [INFO] Running org.springframework.data.mongodb.repository.custom.CustomReactiveRepositoryImplementationTests
30-Jun-2019 03:39:09 [INFO] Tests run: 1, Failures: 0, Errors: 0, Skipped: 0, Time elapsed: 0.023 s - in org.springframework.data.mongodb.repository.custom.CustomReactiveRepositoryImplementationTests
30-Jun-2019 03:39:09 [INFO] Running org.springframework.data.mongodb.repository.custom.ComposedRepositoryImplementationTests
30-Jun-2019 03:39:09 [INFO] Tests run: 1, Failures: 0, Errors: 0, Skipped: 0, Time elapsed: 0.03 s - in org.springframework.data.mongodb.repository.custom.ComposedRepositoryImplementationTests
30-Jun-2019 03:39:09 [INFO] Running org.springframework.data.mongodb.repository.PersonRepositoryIntegrationTests
30-Jun-2019 03:39:11 [INFO] Tests run: 121, Failures: 0, Errors: 0, Skipped: 0, Time elapsed: 1.972 s - in org.springframework.data.mongodb.repository.PersonRepositoryIntegrationTests
30-Jun-2019 03:39:11 [INFO] Running org.springframework.data.mongodb.repository.cdi.CdiExtensionIntegrationTests
30-Jun-2019 03:39:11 [INFO] Tests run: 2, Failures: 0, Errors: 0, Skipped: 0, Time elapsed: 0.359 s - in org.springframework.data.mongodb.repository.cdi.CdiExtensionIntegrationTests
30-Jun-2019 03:39:11 [INFO] Running org.springframework.data.mongodb.repository.RepositoryIndexCreationIntegrationTests
30-Jun-2019 03:39:12 [INFO] Tests run: 1, Failures: 0, Errors: 0, Skipped: 0, Time elapsed: 0.704 s - in org.springframework.data.mongodb.repository.RepositoryIndexCreationIntegrationTests
30-Jun-2019 03:39:12 [INFO] Running org.springframework.data.mongodb.repository.ContactRepositoryIntegrationTests
30-Jun-2019 03:39:12 [INFO] Tests run: 2, Failures: 0, Errors: 0, Skipped: 0, Time elapsed: 0.121 s - in org.springframework.data.mongodb.repository.ContactRepositoryIntegrationTests
30-Jun-2019 03:39:12 [INFO] Running org.springframework.data.mongodb.repository.RedeclaringRepositoryMethodsTests
30-Jun-2019 03:39:14 [INFO] Tests run: 123, Failures: 0, Errors: 0, Skipped: 0, Time elapsed: 1.865 s - in org.springframework.data.mongodb.repository.RedeclaringRepositoryMethodsTests
30-Jun-2019 03:39:14 [INFO] Running org.springframework.data.mongodb.repository.PersonRepositoryLazyLoadingIntegrationTests
30-Jun-2019 03:39:14 [INFO] Tests run: 3, Failures: 0, Errors: 0, Skipped: 0, Time elapsed: 0.01 s - in org.springframework.data.mongodb.repository.PersonRepositoryLazyLoadingIntegrationTests
30-Jun-2019 03:39:14 [INFO] Running org.springframework.data.mongodb.repository.ComplexIdRepositoryIntegrationTests
30-Jun-2019 03:39:14 [INFO] Tests run: 6, Failures: 0, Errors: 0, Skipped: 0, Time elapsed: 0.244 s - in org.springframework.data.mongodb.repository.ComplexIdRepositoryIntegrationTests
30-Jun-2019 03:39:14 [INFO] Running org.springframework.data.mongodb.repository.PersonRepositoryTransactionalTests
30-Jun-2019 03:39:14 [WARNING] Tests run: 1, Failures: 0, Errors: 0, Skipped: 1, Time elapsed: 0.005 s - in org.springframework.data.mongodb.repository.PersonRepositoryTransactionalTests
30-Jun-2019 03:39:14 [INFO] Running org.springframework.data.mongodb.repository.ReactiveMongoRepositoryTests
30-Jun-2019 03:39:16 [INFO] Tests run: 29, Failures: 0, Errors: 0, Skipped: 0, Time elapsed: 1.862 s - in org.springframework.data.mongodb.repository.ReactiveMongoRepositoryTests
30-Jun-2019 03:39:16 [INFO] Running org.springframework.data.mongodb.repository.MongoRepositoryTextSearchIntegrationTests
30-Jun-2019 03:39:17 [INFO] Tests run: 8, Failures: 0, Errors: 0, Skipped: 0, Time elapsed: 0.721 s - in org.springframework.data.mongodb.repository.MongoRepositoryTextSearchIntegrationTests
30-Jun-2019 03:39:17 [INFO] Running org.springframework.data.mongodb.repository.query.ConvertingParameterAccessorUnitTests
30-Jun-2019 03:39:17 [INFO] Tests run: 5, Failures: 0, Errors: 0, Skipped: 0, Time elapsed: 0.017 s - in org.springframework.data.mongodb.repository.query.ConvertingParameterAccessorUnitTests
30-Jun-2019 03:39:17 [INFO] Running org.springframework.data.mongodb.repository.query.MappingMongoEntityInformationUnitTests
30-Jun-2019 03:39:17 [INFO] Tests run: 3, Failures: 0, Errors: 0, Skipped: 0, Time elapsed: 0.001 s - in org.springframework.data.mongodb.repository.query.MappingMongoEntityInformationUnitTests
30-Jun-2019 03:39:17 [INFO] Running org.springframework.data.mongodb.repository.query.ReactiveStringBasedAggregationUnitTests
30-Jun-2019 03:39:17 [INFO] Tests run: 7, Failures: 0, Errors: 0, Skipped: 0, Time elapsed: 0.026 s - in org.springframework.data.mongodb.repository.query.ReactiveStringBasedAggregationUnitTests
30-Jun-2019 03:39:17 [INFO] Running org.springframework.data.mongodb.repository.query.MongoQueryExecutionUnitTests
30-Jun-2019 03:39:17 [INFO] Tests run: 5, Failures: 0, Errors: 0, Skipped: 0, Time elapsed: 0.039 s - in org.springframework.data.mongodb.repository.query.MongoQueryExecutionUnitTests
30-Jun-2019 03:39:17 [INFO] Running org.springframework.data.mongodb.repository.query.MongoParametersParameterAccessorUnitTests
30-Jun-2019 03:39:17 [INFO] Tests run: 6, Failures: 0, Errors: 0, Skipped: 0, Time elapsed: 0.005 s - in org.springframework.data.mongodb.repository.query.MongoParametersParameterAccessorUnitTests
30-Jun-2019 03:39:17 [INFO] Running org.springframework.data.mongodb.repository.query.StringBasedMongoQueryUnitTests
30-Jun-2019 03:39:17 [INFO] Tests run: 45, Failures: 0, Errors: 0, Skipped: 0, Time elapsed: 0.127 s - in org.springframework.data.mongodb.repository.query.StringBasedMongoQueryUnitTests
30-Jun-2019 03:39:17 [INFO] Running org.springframework.data.mongodb.repository.query.ReactiveMongoQueryExecutionUnitTests
30-Jun-2019 03:39:17 [INFO] Tests run: 2, Failures: 0, Errors: 0, Skipped: 0, Time elapsed: 0.001 s - in org.springframework.data.mongodb.repository.query.ReactiveMongoQueryExecutionUnitTests
30-Jun-2019 03:39:17 [INFO] Running org.springframework.data.mongodb.repository.query.AbstractReactiveMongoQueryUnitTests
30-Jun-2019 03:39:17 [INFO] Tests run: 11, Failures: 0, Errors: 0, Skipped: 0, Time elapsed: 0.077 s - in org.springframework.data.mongodb.repository.query.AbstractReactiveMongoQueryUnitTests
30-Jun-2019 03:39:17 [INFO] Running org.springframework.data.mongodb.repository.query.MongoQueryCreatorUnitTests
30-Jun-2019 03:39:17 [INFO] Tests run: 52, Failures: 0, Errors: 0, Skipped: 0, Time elapsed: 0.086 s - in org.springframework.data.mongodb.repository.query.MongoQueryCreatorUnitTests
30-Jun-2019 03:39:17 [INFO] Running org.springframework.data.mongodb.repository.query.MongoQueryMethodUnitTests
30-Jun-2019 03:39:17 [INFO] Tests run: 20, Failures: 0, Errors: 0, Skipped: 0, Time elapsed: 0.025 s - in org.springframework.data.mongodb.repository.query.MongoQueryMethodUnitTests
30-Jun-2019 03:39:17 [INFO] Running org.springframework.data.mongodb.repository.query.ReactiveStringBasedMongoQueryUnitTests
30-Jun-2019 03:39:17 [INFO] Tests run: 12, Failures: 0, Errors: 0, Skipped: 0, Time elapsed: 0.041 s - in org.springframework.data.mongodb.repository.query.ReactiveStringBasedMongoQueryUnitTests
30-Jun-2019 03:39:17 [INFO] Running org.springframework.data.mongodb.repository.query.PartTreeMongoQueryUnitTests
30-Jun-2019 03:39:17 [INFO] Tests run: 14, Failures: 0, Errors: 0, Skipped: 0, Time elapsed: 0.071 s - in org.springframework.data.mongodb.repository.query.PartTreeMongoQueryUnitTests
30-Jun-2019 03:39:17 [INFO] Running org.springframework.data.mongodb.repository.query.AbstractMongoQueryUnitTests
30-Jun-2019 03:39:17 [INFO] Tests run: 26, Failures: 0, Errors: 0, Skipped: 0, Time elapsed: 0.09 s - in org.springframework.data.mongodb.repository.query.AbstractMongoQueryUnitTests
30-Jun-2019 03:39:17 [INFO] Running org.springframework.data.mongodb.repository.query.MongoParametersUnitTests
30-Jun-2019 03:39:17 [INFO] Tests run: 13, Failures: 0, Errors: 0, Skipped: 0, Time elapsed: 0.007 s - in org.springframework.data.mongodb.repository.query.MongoParametersUnitTests
30-Jun-2019 03:39:17 [INFO] Running org.springframework.data.mongodb.repository.query.ReactiveMongoQueryMethodUnitTests
30-Jun-2019 03:39:18 [INFO] Tests run: 13, Failures: 0, Errors: 0, Skipped: 0, Time elapsed: 0.013 s - in org.springframework.data.mongodb.repository.query.ReactiveMongoQueryMethodUnitTests
30-Jun-2019 03:39:18 [INFO] Running org.springframework.data.mongodb.repository.query.StringBasedAggregationUnitTests
30-Jun-2019 03:39:18 [INFO] Tests run: 11, Failures: 0, Errors: 0, Skipped: 0, Time elapsed: 0.045 s - in org.springframework.data.mongodb.repository.query.StringBasedAggregationUnitTests
30-Jun-2019 03:39:18 [INFO] Running org.springframework.data.mongodb.SessionAwareMethodInterceptorUnitTests
30-Jun-2019 03:39:18 [INFO] Tests run: 9, Failures: 0, Errors: 0, Skipped: 0, Time elapsed: 0.006 s - in org.springframework.data.mongodb.SessionAwareMethodInterceptorUnitTests
30-Jun-2019 03:39:18 [INFO] Running org.springframework.data.mongodb.ReactiveTransactionIntegrationTests
30-Jun-2019 03:39:18 [WARNING] Tests run: 1, Failures: 0, Errors: 0, Skipped: 1, Time elapsed: 0.007 s - in org.springframework.data.mongodb.ReactiveTransactionIntegrationTests
30-Jun-2019 03:39:18 [INFO] Running org.springframework.data.mongodb.ReactiveMongoTransactionManagerUnitTests
30-Jun-2019 03:39:18 [INFO] Tests run: 6, Failures: 0, Errors: 0, Skipped: 0, Time elapsed: 0.055 s - in org.springframework.data.mongodb.ReactiveMongoTransactionManagerUnitTests
30-Jun-2019 03:39:18 [INFO] Running org.springframework.data.mongodb.util.json.ParameterBindingJsonReaderUnitTests
30-Jun-2019 03:39:18 [INFO] Tests run: 16, Failures: 0, Errors: 0, Skipped: 0, Time elapsed: 0.007 s - in org.springframework.data.mongodb.util.json.ParameterBindingJsonReaderUnitTests
30-Jun-2019 03:39:18 [INFO] Running ConfigClassInDefaultPackageUnitTests
30-Jun-2019 03:39:18 [INFO] Tests run: 1, Failures: 0, Errors: 0, Skipped: 0, Time elapsed: 0.014 s - in ConfigClassInDefaultPackageUnitTests
30-Jun-2019 03:39:19 [INFO]
30-Jun-2019 03:39:19 [INFO] Results:
30-Jun-2019 03:39:19 [INFO]
30-Jun-2019 03:39:19 [WARNING] Tests run: 4067, Failures: 0, Errors: 0, Skipped: 40
30-Jun-2019 03:39:19 [INFO]
30-Jun-2019 03:39:19 [INFO]
30-Jun-2019 03:39:19 [INFO] --- build-helper-maven-plugin:3.0.0:add-source (add-kotlin-source) @ spring-data-mongodb ---
30-Jun-2019 03:39:19 [INFO] Source directory: /opt/bamboo-home/xml-data/build-dir/SPRINGDATAMONGODB-MONGOSONAR-JOB1/spring-data-mongodb/src/main/kotlin added.
30-Jun-2019 03:39:19 [INFO]
30-Jun-2019 03:39:19 [INFO] --- maven-jar-plugin:3.1.0:jar (default-jar) @ spring-data-mongodb ---
30-Jun-2019 03:39:20 [INFO] Building jar: /opt/bamboo-home/xml-data/build-dir/SPRINGDATAMONGODB-MONGOSONAR-JOB1/spring-data-mongodb/target/spring-data-mongodb-2.2.0.BUILD-SNAPSHOT.jar
30-Jun-2019 03:39:20 [INFO]
30-Jun-2019 03:39:20 [INFO] >>> maven-source-plugin:3.1.0:jar (attach-sources) > generate-sources @ spring-data-mongodb >>>
30-Jun-2019 03:39:20 [INFO]
30-Jun-2019 03:39:20 [INFO] --- maven-enforcer-plugin:1.4.1:enforce (enforce-maven-version) @ spring-data-mongodb ---
30-Jun-2019 03:39:20 [INFO]
30-Jun-2019 03:39:20 [INFO] <<< maven-source-plugin:3.1.0:jar (attach-sources) < generate-sources @ spring-data-mongodb <<<
30-Jun-2019 03:39:20 [INFO]
30-Jun-2019 03:39:20 [INFO]
30-Jun-2019 03:39:20 [INFO] --- maven-source-plugin:3.1.0:jar (attach-sources) @ spring-data-mongodb ---
30-Jun-2019 03:39:20 [INFO] Building jar: /opt/bamboo-home/xml-data/build-dir/SPRINGDATAMONGODB-MONGOSONAR-JOB1/spring-data-mongodb/target/spring-data-mongodb-2.2.0.BUILD-SNAPSHOT-sources.jar
30-Jun-2019 03:39:20 [INFO]
30-Jun-2019 03:39:20 [INFO] -----< org.springframework.data:spring-data-mongodb-distribution >------
30-Jun-2019 03:39:20 [INFO] Building Spring Data MongoDB - Distribution 2.2.0.BUILD-SNAPSHOT   [3/3]
30-Jun-2019 03:39:20 [INFO] --------------------------------[ pom ]---------------------------------
30-Jun-2019 03:39:20 [INFO]
30-Jun-2019 03:39:20 [INFO] --- maven-clean-plugin:2.5:clean (default-clean) @ spring-data-mongodb-distribution ---
30-Jun-2019 03:39:20 [INFO]
30-Jun-2019 03:39:20 [INFO] --- maven-enforcer-plugin:1.4.1:enforce (enforce-maven-version) @ spring-data-mongodb-distribution ---
30-Jun-2019 03:39:20 [INFO]
30-Jun-2019 03:39:20 [INFO] --- kotlin-maven-plugin:1.3.40:compile (compile) @ spring-data-mongodb-distribution ---
30-Jun-2019 03:39:20 [WARNING] No sources found skipping Kotlin compile
30-Jun-2019 03:39:20 [INFO]
30-Jun-2019 03:39:20 [INFO] --- maven-compiler-plugin:3.8.1:compile (java-compile) @ spring-data-mongodb-distribution ---
30-Jun-2019 03:39:20 [INFO] No sources to compile
30-Jun-2019 03:39:20 [INFO]
30-Jun-2019 03:39:20 [INFO] --- kotlin-maven-plugin:1.3.40:test-compile (test-compile) @ spring-data-mongodb-distribution ---
30-Jun-2019 03:39:20 [WARNING] No sources found skipping Kotlin compile
30-Jun-2019 03:39:20 [INFO]
30-Jun-2019 03:39:20 [INFO] --- maven-compiler-plugin:3.8.1:testCompile (java-test-compile) @ spring-data-mongodb-distribution ---
30-Jun-2019 03:39:20 [INFO] No sources to compile
30-Jun-2019 03:39:20 [INFO]
30-Jun-2019 03:39:20 [INFO] --- build-helper-maven-plugin:3.0.0:add-source (add-kotlin-source) @ spring-data-mongodb-distribution ---
30-Jun-2019 03:39:20 [INFO] Source directory: /opt/bamboo-home/xml-data/build-dir/SPRINGDATAMONGODB-MONGOSONAR-JOB1/spring-data-mongodb-distribution/src/main/kotlin added.
30-Jun-2019 03:39:20 [INFO]
30-Jun-2019 03:39:20 [INFO] >>> maven-source-plugin:3.1.0:jar (attach-sources) > generate-sources @ spring-data-mongodb-distribution >>>
30-Jun-2019 03:39:20 [INFO]
30-Jun-2019 03:39:20 [INFO] --- maven-enforcer-plugin:1.4.1:enforce (enforce-maven-version) @ spring-data-mongodb-distribution ---
30-Jun-2019 03:39:20 [INFO]
30-Jun-2019 03:39:20 [INFO] <<< maven-source-plugin:3.1.0:jar (attach-sources) < generate-sources @ spring-data-mongodb-distribution <<<
30-Jun-2019 03:39:20 [INFO]
30-Jun-2019 03:39:20 [INFO]
30-Jun-2019 03:39:20 [INFO] --- maven-source-plugin:3.1.0:jar (attach-sources) @ spring-data-mongodb-distribution ---
30-Jun-2019 03:39:20 [INFO] ------------------------------------------------------------------------
30-Jun-2019 03:39:20 [INFO] Reactor Summary:
30-Jun-2019 03:39:20 [INFO]
30-Jun-2019 03:39:20 [INFO] Spring Data MongoDB 2.2.0.BUILD-SNAPSHOT ........... SUCCESS [  0.780 s]
30-Jun-2019 03:39:20 [INFO] Spring Data MongoDB - Core ......................... SUCCESS [03:07 min]
30-Jun-2019 03:39:20 [INFO] Spring Data MongoDB - Distribution 2.2.0.BUILD-SNAPSHOT SUCCESS [  0.015 s]
30-Jun-2019 03:39:20 [INFO] ------------------------------------------------------------------------
30-Jun-2019 03:39:20 [INFO] BUILD SUCCESS
30-Jun-2019 03:39:20 [INFO] ------------------------------------------------------------------------
30-Jun-2019 03:39:20 [INFO] Total time: 03:08 min
30-Jun-2019 03:39:20 [INFO] Finished at: 2019-06-30T03:39:20Z
30-Jun-2019 03:39:20 [INFO] ------------------------------------------------------------------------
30-Jun-2019 03:39:20 Parsing test results under /opt/bamboo-home/xml-data/build-dir/SPRINGDATAMONGODB-MONGOSONAR-JOB1...
30-Jun-2019 03:39:20 Finished task 'Build for Sonar' with result: Success
30-Jun-2019 03:39:20 Starting task 'Sonar' of type 'ch.mibex.bamboo.sonar4bamboo:sonar4bamboo.maven3task'
30-Jun-2019 03:39:20
Substituting password variable: ${bamboo.sonar.token.password}
30-Jun-2019 03:39:20 SONAR4BAMBOO: Using capability system.builder.mvn3.Maven 3.5 with value: /opt/maven-3.5
30-Jun-2019 03:39:20 SONAR4BAMBOO: Using capability system.builder.mvn3.Maven 3.5 with value: /opt/maven-3.5
30-Jun-2019 03:39:20 SONAR4BAMBOO: Will use  as sonar.branch.
30-Jun-2019 03:39:20
Beginning to execute external process for build 'Spring Data MongoDB - Spring Data MongoDB - Sonar - Default Job #2602 (SPRINGDATAMONGODB-MONGOSONAR-JOB1-2602)'
... running command line:
/opt/maven-3.5/bin/mvn sonar:sonar -Dsonar.host.url=http://sonar.af.pivotal.io:8080 -Dsonar.login=****** ... in: /opt/bamboo-home/xml-data/build-dir/SPRINGDATAMONGODB-MONGOSONAR-JOB1
... using extra environment variables:
bamboo_planRepository_1_branch=master
bamboo_********_username_password=********
bamboo_signing_store_password=********
bamboo_capability_system_builder_ant_Ant_1_9=/opt/ant-1.9
bamboo_repository_108331052_revision_number=8ce8a8307a19b68505c6e6fa42ae7a70ec534b0f
bamboo_capability_system_builder_ant_Ant_1_8=/opt/ant-1.8
bamboo_planRepository_1_branchDisplayName=master
bamboo_artifactory_override_resolve_repo=libs-milestone
bamboo_capability_system_builder_node_Node_js_10_16=/opt/node-10.16/bin/node
bamboo_repository_revision_number=8ce8a8307a19b68505c6e6fa42ae7a70ec534b0f
MAVEN2_HOME=/opt/maven-3.5
bamboo_RIAK_BIN=/usr/sbin/riak
bamboo_buildKey=SPRINGDATAMONGODB-MONGOSONAR-JOB1
bamboo_bintray_password=********
bamboo_sonar_token_password=********
bamboo_shortJobName=Default Job
bamboo_artifactory_override_resolver_password=********
bamboo_sonatype_token=RSJChaox
bamboo_capability_system_builder_gradle___gradlew=./gradlew
bamboo_buildResultsUrl=https://build.spring.io/browse/SPRINGDATAMONGODB-MONGOSONAR-JOB1-2602
bamboo_capability_system_builder_mvn3_Maven_3_3=/opt/maven-3.3
bamboo_capability_system_builder_mvn3_Maven_3_2=/opt/maven-3.2
bamboo_capability_system_builder_mvn3_Maven_3_1=/opt/maven-3.1
bamboo_planRepository_repositoryUrl=git://github.com/SpringSource/spring-data-mongodb.git
bamboo_capability_system_builder_mvn3_Maven_3_6=/opt/maven-3.6
bamboo_agentId=284196868
bamboo_capability_system_builder_mvn3_Maven_3_5=/opt/maven-3.5
bamboo_capability_system_builder_mvn3_Maven_3_0=/opt/maven-3.0
bamboo_repository_108331052_branch_name=master
bamboo_planRepository_revision=8ce8a8307a19b68505c6e6fa42ae7a70ec534b0f
bamboo_planRepository_previousRevision=8ce8a8307a19b68505c6e6fa42ae7a70ec534b0f
bamboo_capability_remote_build=true
bamboo_repository_branch_name=master
bamboo_sonatype_token_password=********
bamboo_sonatype_user=springsource
bamboo_scdf_acceptance_tests_password=********
JAVA_HOME=/opt/jdk-8
bamboo_repository_108331052_previous_revision_number=8ce8a8307a19b68505c6e6fa42ae7a70ec534b0f
bamboo_planRepository_branch=master
bamboo_planRepository_1_type=gitv2
bamboo_planRepository_branchName=master
bamboo_capability_system_jdk_JDK_12=/opt/jdk-12
bamboo_capability_system_builder_ant_Ant_1_10=/opt/ant-1.10
bamboo_sonar_password=********
bamboo_hg_cache_directory=/opt/bamboo-home/xml-data/build-dir/_hg-repositories-cache
bamboo_planRepository_1_username=
bamboo_planRepository_type=gitv2
bamboo_git_cache_directory=/opt/bamboo-home/xml-data/build-dir/_git-repositories-cache
bamboo_build_commandline_com_atlassian_bamboo_plugins_maven_task_builder_mvn3_3=/opt/maven-3.5/bin/mvn -Djava.io.tmpdir=/tmp/SPRINGDATAMONGODB-MONGOSONAR-JOB1 clean verify -B -Dmaven.test.failure.ignore=true
bamboo_artifactory_username=buildmaster
bamboo_tmp_directory=/opt/bamboo-home/temp
bamboo_planKey=SPRINGDATAMONGODB-MONGOSONAR
bamboo_planRepository_username=
bamboo_JDK8_HOME=/opt/jdk-8
bamboo_planRepository_1_branchName=master
bamboo_sonar_version=5.6.3
bamboo_sonar_jdbc_password=********
bamboo_bintray_api_key_password=********
bamboo_repository_108331052_git_branch=master
bamboo_capability_system_jdk_JDK_1_11=/opt/jdk-11
bamboo_resultsUrl=https://build.spring.io/browse/SPRINGDATAMONGODB-MONGOSONAR-JOB1-2602
bamboo_capability_system_jdk_JDK_1_10=/opt/jdk-10
bamboo_build_working_directory=/opt/bamboo-home/xml-data/build-dir/SPRINGDATAMONGODB-MONGOSONAR-JOB1
bamboo_planRepository_1_name=Plan Repository
bamboo_capability_system_os=ubuntu1804
bamboo_repository_108331052_git_repositoryUrl=git://github.com/SpringSource/spring-data-mongodb.git
bamboo_nexusPush_stagingProfile=buildmaster
bamboo_shortPlanName=Spring Data MongoDB - Sonar
bamboo_repository_108331052_git_username=
bamboo_planRepository_name=Plan Repository
bamboo_buildNumber=2602
bamboo_repository_108331052_name=Plan Repository
bamboo_planName=Spring Data MongoDB - Spring Data MongoDB - Sonar
bamboo_JDK7_HOME=/opt/jdk-7
bamboo_shortPlanKey=MONGOSONAR
bamboo_shortJobKey=JOB1
bamboo_artifactory_password=********
bamboo_buildTimeStamp=2019-06-30T03:30:00.950Z
bamboo_repository_previous_revision_number=8ce8a8307a19b68505c6e6fa42ae7a70ec534b0f
bamboo_sonar_username=buildmaster
bamboo_********_password=********
M2_HOME=/opt/maven-3.5
bamboo_repository_git_branch=master
bamboo_buildResultKey=SPRINGDATAMONGODB-MONGOSONAR-JOB1-2602
bamboo_nexusPush_close=true
bamboo_artifactory_override_resolver_username=buildmaster
bamboo_buildPlanName=Spring Data MongoDB - Spring Data MongoDB - Sonar - Default Job
bamboo_planRepository_1_revision=8ce8a8307a19b68505c6e6fa42ae7a70ec534b0f
bamboo_repository_name=Plan Repository
bamboo_signing_key_password=********
bamboo_capability_system_builder_groovy_Groovy_2_5=/opt/groovy-2.5
bamboo_buildFailed=false
bamboo_capability_system_docker_executable=/usr/bin/docker
bamboo_capability_system_jdk_OpenJDK_7=/opt/jdk-7
bamboo_capability_system_builder_groovy_Groovy_2_4=/opt/groovy-2.4
bamboo_artifactory_override_deployer_username=buildmaster
bamboo_capability_system_builder_command_Bash=/bin/bash
bamboo_agentWorkingDirectory=/opt/bamboo-home/xml-data/build-dir
bamboo_capability_system_git_executable=/usr/bin/git
bamboo_repository_git_username=
bamboo_planRepository_1_previousRevision=8ce8a8307a19b68505c6e6fa42ae7a70ec534b0f
bamboo_capability_os_family=unix
bamboo_planRepository_branchDisplayName=master
bamboo_capability_system_builder_maven_Artifactory_Maven_3_6=/opt/maven-3.6
bamboo_capability_system_builder_maven_Artifactory_Maven_3_5=/opt/maven-3.5
bamboo_capability_system_builder_maven_Artifactory_Maven_3_3=/opt/maven-3.3
bamboo_capability_system_builder_maven_Artifactory_Maven_3_2=/opt/maven-3.2
bamboo_s3_properties=/home/bamboo/tools/s3.properties
bamboo_capability_system_builder_maven_Artifactory_Maven_3_1=/opt/maven-3.1
bamboo_artifactory_override_deploy_repo=libs-snapshot-local
bamboo_capability_system_builder_maven_Artifactory_Maven_3_0=/opt/maven-3.0
bamboo_plan_storageTag=SPRINGDATAMONGODB-MONGOSONAR
bamboo_bintray_username_password=********
bamboo_repository_git_repositoryUrl=git://github.com/SpringSource/spring-data-mongodb.git
bamboo_working_directory=/opt/bamboo-home/xml-data/build-dir/SPRINGDATAMONGODB-MONGOSONAR-JOB1
bamboo_planRepository_1_repositoryUrl=git://github.com/SpringSource/spring-data-mongodb.git
bamboo_capability_system_jdk_JDK_1_8=/opt/jdk-8
bamboo_artifactory_override_deployer_password=********
bamboo_capability_system_jdk_JDK_1_9=/opt/jdk-9
bamboo_capability_system_jdk_JDK_1_6=/opt/jdk-6
bamboo_sonatype_password=********
bamboo_capability_system_jdk_JDK_1_7=/opt/jdk-7
bamboo_sonar_ip=10.194.6.9
PATH=/opt/jdk-8/bin:/bin:/home/bamboo/bin:/usr/local/sbin:/usr/local/bin:/usr/sbin:/usr/bin:/sbin:/bin:/usr/games:/usr/local/games:/snap/bin:/home/bamboo/bin:/usr/local/bin
30-Jun-2019 03:39:21 [INFO] Scanning for projects...
30-Jun-2019 03:39:22 [INFO] ------------------------------------------------------------------------
30-Jun-2019 03:39:22 [INFO] Reactor Build Order:
30-Jun-2019 03:39:22 [INFO]
30-Jun-2019 03:39:22 [INFO] Spring Data MongoDB                                                [pom]
30-Jun-2019 03:39:22 [INFO] Spring Data MongoDB - Core                                         [jar]
30-Jun-2019 03:39:22 [INFO] Spring Data MongoDB - Distribution                                 [pom]
30-Jun-2019 03:39:22 Downloading from spring-libs-milestone: https://repo.spring.io/libs-milestone/org/apache/maven/plugins/maven-metadata.xml
30-Jun-2019 03:39:22 Downloading from spring-libs-milestone: https://repo.spring.io/libs-milestone/org/codehaus/mojo/maven-metadata.xml
30-Jun-2019 03:39:22 Downloading from spring-plugins-release: https://repo.spring.io/plugins-release/org/apache/maven/plugins/maven-metadata.xml
30-Jun-2019 03:39:22 Downloading from spring-plugins-release: https://repo.spring.io/plugins-release/org/codehaus/mojo/maven-metadata.xml
30-Jun-2019 03:39:22 Progress (1): 0.6/19 kB
30-Jun-2019 03:39:22 Progress (1): 2.0/19 kB
30-Jun-2019 03:39:22 Progress (1): 3.3/19 kB
30-Jun-2019 03:39:22 Progress (1): 4.7/19 kB
30-Jun-2019 03:39:22 Progress (1): 6.1/19 kB
30-Jun-2019 03:39:22 Progress (1): 7.4/19 kB
30-Jun-2019 03:39:22 Progress (1): 8.8/19 kB
30-Jun-2019 03:39:22 Progress (1): 10/19 kB
30-Jun-2019 03:39:22 Progress (1): 12/19 kB
30-Jun-2019 03:39:22 Progress (1): 13/19 kB
30-Jun-2019 03:39:22 Progress (1): 13/19 kB
30-Jun-2019 03:39:22 Progress (1): 15/19 kB
30-Jun-2019 03:39:22 Progress (1): 16/19 kB
30-Jun-2019 03:39:22 Progress (1): 17/19 kB
30-Jun-2019 03:39:22 Progress (1): 19 kB   
30-Jun-2019 03:39:22 Progress (2): 19 kB | 0.6/27 kB
30-Jun-2019 03:39:22 Progress (2): 19 kB | 2.0/27 kB
30-Jun-2019 03:39:22 Progress (2): 19 kB | 3.3/27 kB
30-Jun-2019 03:39:22 Progress (2): 19 kB | 4.7/27 kB
30-Jun-2019 03:39:22 Progress (2): 19 kB | 6.1/27 kB
30-Jun-2019 03:39:22 Progress (2): 19 kB | 7.4/27 kB
30-Jun-2019 03:39:22 Progress (2): 19 kB | 8.8/27 kB
30-Jun-2019 03:39:22 Progress (2): 19 kB | 10/27 kB
30-Jun-2019 03:39:22 Progress (2): 19 kB | 12/27 kB
30-Jun-2019 03:39:22 Progress (2): 19 kB | 13/27 kB
30-Jun-2019 03:39:22 Progress (2): 19 kB | 14/27 kB
30-Jun-2019 03:39:22 Progress (2): 19 kB | 15/27 kB
30-Jun-2019 03:39:22 Progress (2): 19 kB | 16/27 kB
30-Jun-2019 03:39:22 Progress (2): 19 kB | 18/27 kB
30-Jun-2019 03:39:22 Progress (2): 19 kB | 19/27 kB
30-Jun-2019 03:39:22 Progress (2): 19 kB | 20/27 kB
30-Jun-2019 03:39:22 Progress (2): 19 kB | 22/27 kB
30-Jun-2019 03:39:22 Progress (2): 19 kB | 23/27 kB
30-Jun-2019 03:39:22 Progress (2): 19 kB | 24/27 kB
30-Jun-2019 03:39:22 Progress (2): 19 kB | 26/27 kB
30-Jun-2019 03:39:22 Progress (2): 19 kB | 27 kB   
30-Jun-2019 03:39:22 Progress (3): 19 kB | 27 kB | 0.6/19 kB
30-Jun-2019 03:39:22 Progress (3): 19 kB | 27 kB | 2.0/19 kB
30-Jun-2019 03:39:22 Progress (3): 19 kB | 27 kB | 3.3/19 kB
30-Jun-2019 03:39:22 Progress (3): 19 kB | 27 kB | 4.7/19 kB
30-Jun-2019 03:39:22 Progress (3): 19 kB | 27 kB | 6.1/19 kB
30-Jun-2019 03:39:22 Progress (3): 19 kB | 27 kB | 7.4/19 kB
30-Jun-2019 03:39:22 Progress (3): 19 kB | 27 kB | 8.8/19 kB
30-Jun-2019 03:39:22 Progress (3): 19 kB | 27 kB | 10/19 kB
30-Jun-2019 03:39:22 Progress (3): 19 kB | 27 kB | 12/19 kB
30-Jun-2019 03:39:22 Progress (3): 19 kB | 27 kB | 13/19 kB
30-Jun-2019 03:39:22 Progress (3): 19 kB | 27 kB | 13/19 kB
30-Jun-2019 03:39:22 Progress (3): 19 kB | 27 kB | 15/19 kB
30-Jun-2019 03:39:22 Progress (3): 19 kB | 27 kB | 16/19 kB
30-Jun-2019 03:39:22 Progress (3): 19 kB | 27 kB | 17/19 kB
30-Jun-2019 03:39:22 Progress (3): 19 kB | 27 kB | 19 kB   
30-Jun-2019 03:39:22 Progress (4): 19 kB | 27 kB | 19 kB | 0.6/27 kB
30-Jun-2019 03:39:22 Progress (4): 19 kB | 27 kB | 19 kB | 2.0/27 kB
30-Jun-2019 03:39:22 Progress (4): 19 kB | 27 kB | 19 kB | 3.3/27 kB
30-Jun-2019 03:39:22 Progress (4): 19 kB | 27 kB | 19 kB | 4.7/27 kB
30-Jun-2019 03:39:22 Progress (4): 19 kB | 27 kB | 19 kB | 6.1/27 kB
30-Jun-2019 03:39:22 Progress (4): 19 kB | 27 kB | 19 kB | 7.4/27 kB
30-Jun-2019 03:39:22 Progress (4): 19 kB | 27 kB | 19 kB | 8.8/27 kB
30-Jun-2019 03:39:22 Progress (4): 19 kB | 27 kB | 19 kB | 10/27 kB
30-Jun-2019 03:39:22 Progress (4): 19 kB | 27 kB | 19 kB | 12/27 kB
30-Jun-2019 03:39:22 Progress (4): 19 kB | 27 kB | 19 kB | 13/27 kB
30-Jun-2019 03:39:22 Progress (4): 19 kB | 27 kB | 19 kB | 13/27 kB
30-Jun-2019 03:39:22 Progress (4): 19 kB | 27 kB | 19 kB | 15/27 kB
30-Jun-2019 03:39:22 Progress (4): 19 kB | 27 kB | 19 kB | 16/27 kB
30-Jun-2019 03:39:22 Progress (4): 19 kB | 27 kB | 19 kB | 17/27 kB
30-Jun-2019 03:39:22 Progress (4): 19 kB | 27 kB | 19 kB | 19/27 kB
30-Jun-2019 03:39:22 Progress (4): 19 kB | 27 kB | 19 kB | 20/27 kB
30-Jun-2019 03:39:22 Progress (4): 19 kB | 27 kB | 19 kB | 22/27 kB
30-Jun-2019 03:39:22 Progress (4): 19 kB | 27 kB | 19 kB | 23/27 kB
30-Jun-2019 03:39:22 Progress (4): 19 kB | 27 kB | 19 kB | 24/27 kB
30-Jun-2019 03:39:22 Progress (4): 19 kB | 27 kB | 19 kB | 26/27 kB
30-Jun-2019 03:39:22 Progress (4): 19 kB | 27 kB | 19 kB | 27/27 kB
30-Jun-2019 03:39:22 Progress (4): 19 kB | 27 kB | 19 kB | 27 kB   
30-Jun-2019 03:39:22                                            
30-Jun-2019 03:39:22 Downloaded from spring-libs-milestone: https://repo.spring.io/libs-milestone/org/apache/maven/plugins/maven-metadata.xml (19 kB at 33 kB/s)
30-Jun-2019 03:39:23 Downloaded from spring-plugins-release: https://repo.spring.io/plugins-release/org/codehaus/mojo/maven-metadata.xml (27 kB at 45 kB/s)
30-Jun-2019 03:39:23 Downloaded from spring-plugins-release: https://repo.spring.io/plugins-release/org/apache/maven/plugins/maven-metadata.xml (19 kB at 30 kB/s)
30-Jun-2019 03:39:23 Downloaded from spring-libs-milestone: https://repo.spring.io/libs-milestone/org/codehaus/mojo/maven-metadata.xml (27 kB at 38 kB/s)
30-Jun-2019 03:39:23 Downloading from spring-plugins-release: https://repo.spring.io/plugins-release/org/codehaus/mojo/sonar-maven-plugin/maven-metadata.xml
30-Jun-2019 03:39:23 Downloading from spring-libs-milestone: https://repo.spring.io/libs-milestone/org/codehaus/mojo/sonar-maven-plugin/maven-metadata.xml
30-Jun-2019 03:39:23 Progress (1): 0.6/1.1 kB
30-Jun-2019 03:39:23 Progress (1): 1.1 kB   
30-Jun-2019 03:39:23 Progress (2): 1.1 kB | 0.6/1.1 kB
30-Jun-2019 03:39:23 Progress (2): 1.1 kB | 1.1 kB   
30-Jun-2019 03:39:23                              
30-Jun-2019 03:39:23 Downloaded from spring-plugins-release: https://repo.spring.io/plugins-release/org/codehaus/mojo/sonar-maven-plugin/maven-metadata.xml (1.1 kB at 2.9 kB/s)
30-Jun-2019 03:39:23 Downloaded from spring-libs-milestone: https://repo.spring.io/libs-milestone/org/codehaus/mojo/sonar-maven-plugin/maven-metadata.xml (1.1 kB at 2.3 kB/s)
30-Jun-2019 03:39:23 [INFO]
30-Jun-2019 03:39:23 [INFO] --------< org.springframework.data:spring-data-mongodb-parent >---------
30-Jun-2019 03:39:23 [INFO] Building Spring Data MongoDB 2.2.0.BUILD-SNAPSHOT                  [1/3]
30-Jun-2019 03:39:23 [INFO] --------------------------------[ pom ]---------------------------------
30-Jun-2019 03:39:23 [INFO]
30-Jun-2019 03:39:23 [INFO] --- sonar-maven-plugin:3.6.0.1398:sonar (default-cli) @ spring-data-mongodb-parent ---
30-Jun-2019 03:39:23 [INFO] User cache: /home/bamboo/.sonar/cache
30-Jun-2019 03:39:23 [INFO] SonarQube version: 6.7.7
30-Jun-2019 03:39:23 [INFO] Default locale: "en_US", source code encoding: "UTF-8"
30-Jun-2019 03:39:24 [INFO] Publish mode
30-Jun-2019 03:39:24 [INFO] Load global settings
30-Jun-2019 03:39:24 [INFO] Load global settings (done) | time=235ms
30-Jun-2019 03:39:24 [INFO] Server id: A7EE8CF2-11acedf5b092511
30-Jun-2019 03:39:24 [INFO] User cache: /home/bamboo/.sonar/cache
30-Jun-2019 03:39:24 [INFO] Load plugins index
30-Jun-2019 03:39:24 [INFO] Load plugins index (done) | time=55ms
30-Jun-2019 03:39:25 [INFO] Process project properties
30-Jun-2019 03:39:25 [INFO] Load project repositories
30-Jun-2019 03:39:26 [INFO] Load project repositories (done) | time=967ms
30-Jun-2019 03:39:26 [INFO] Execute project builders
30-Jun-2019 03:39:26 [INFO] Execute project builders (done) | time=0ms
30-Jun-2019 03:39:26 [INFO] Load quality profiles
30-Jun-2019 03:39:26 [INFO] Load quality profiles (done) | time=212ms
30-Jun-2019 03:39:26 [INFO] Load active rules
30-Jun-2019 03:39:26 [INFO] Load active rules (done) | time=379ms
30-Jun-2019 03:39:26 [INFO] Load metrics repository
30-Jun-2019 03:39:26 [INFO] Load metrics repository (done) | time=20ms
30-Jun-2019 03:39:26 [INFO] Project key: org.springframework.data:spring-data-mongodb-parent
30-Jun-2019 03:39:26 [INFO] -------------  Scan Spring Data MongoDB - Distribution
30-Jun-2019 03:39:26 [INFO] Base dir: /opt/bamboo-home/xml-data/build-dir/SPRINGDATAMONGODB-MONGOSONAR-JOB1/spring-data-mongodb-distribution
30-Jun-2019 03:39:26 [INFO] Working dir: /opt/bamboo-home/xml-data/build-dir/SPRINGDATAMONGODB-MONGOSONAR-JOB1/spring-data-mongodb-distribution/target/sonar
30-Jun-2019 03:39:26 [INFO] Source paths: pom.xml
30-Jun-2019 03:39:26 [INFO] Source encoding: UTF-8, default locale: en_US
30-Jun-2019 03:39:26 [INFO] Load server rules
30-Jun-2019 03:39:27 [INFO] Load server rules (done) | time=109ms
30-Jun-2019 03:39:27 [INFO] Index files
30-Jun-2019 03:39:27 [INFO] 1 file indexed
30-Jun-2019 03:39:27 [INFO] Structure101 sensor require following mandatory properties:
30-Jun-2019 03:39:27         structure101.java.classpath
30-Jun-2019 03:39:27         structure101.java.repository
30-Jun-2019 03:39:27         structure101.java.project
30-Jun-2019 03:39:27         
30-Jun-2019 03:39:27 [INFO] Sensor Sonar-Sonargraph-Plugin [3.5] [Sonargraph]
30-Jun-2019 03:39:27 [INFO] ----------------------------------------------------------------
30-Jun-2019 03:39:27 [INFO] Sonargraph: Skipping project Spring Data MongoDB - Distribution [org.springframework.data:spring-data-mongodb-distribution], since no Sonargraph rules are activated in current SonarQube quality profile.
30-Jun-2019 03:39:27 [INFO] ----------------------------------------------------------------
30-Jun-2019 03:39:27 [INFO] Sensor Sonar-Sonargraph-Plugin [3.5] [Sonargraph] (done) | time=1ms
30-Jun-2019 03:39:27 [INFO] -------------  Scan Spring Data MongoDB - Core
30-Jun-2019 03:39:27 [INFO] Base dir: /opt/bamboo-home/xml-data/build-dir/SPRINGDATAMONGODB-MONGOSONAR-JOB1/spring-data-mongodb
30-Jun-2019 03:39:27 [INFO] Working dir: /opt/bamboo-home/xml-data/build-dir/SPRINGDATAMONGODB-MONGOSONAR-JOB1/spring-data-mongodb/target/sonar
30-Jun-2019 03:39:27 [INFO] Source paths: pom.xml, src/main/java
30-Jun-2019 03:39:27 [INFO] Test paths: src/test/java
30-Jun-2019 03:39:27 [INFO] Source encoding: UTF-8, default locale: en_US
30-Jun-2019 03:39:27 [INFO] Index files
30-Jun-2019 03:39:27 [INFO] 875 files indexed
30-Jun-2019 03:39:27 [INFO] Quality profile for java: Spring Data
30-Jun-2019 03:39:27 [INFO] Structure101 sensor require following mandatory properties:
30-Jun-2019 03:39:27         structure101.java.classpath
30-Jun-2019 03:39:27         structure101.java.repository
30-Jun-2019 03:39:27         structure101.java.project
30-Jun-2019 03:39:27         
30-Jun-2019 03:39:27 [INFO] Sensor JavaSquidSensor [java]
30-Jun-2019 03:39:27 [INFO] Configured Java source version (sonar.java.source): 8
30-Jun-2019 03:39:27 [INFO] JavaClasspath initialization
30-Jun-2019 03:39:27 [INFO] JavaClasspath initialization (done) | time=13ms
30-Jun-2019 03:39:27 [INFO] JavaTestClasspath initialization
30-Jun-2019 03:39:27 [INFO] JavaTestClasspath initialization (done) | time=4ms
30-Jun-2019 03:39:27 [INFO] Java Main Files AST scan
30-Jun-2019 03:39:27 [INFO] 466 source files to be analyzed
30-Jun-2019 03:39:37 [INFO] 466/466 source files have been analyzed
30-Jun-2019 03:39:37 [INFO] Java Main Files AST scan (done) | time=9718ms
30-Jun-2019 03:39:37 [INFO] Java Test Files AST scan
30-Jun-2019 03:39:37 [INFO] 408 source files to be analyzed
30-Jun-2019 03:39:47 [INFO] 307/408 files analyzed, current file: spring-data-mongodb/src/test/java/org/springframework/data/mongodb/repository/AbstractPersonRepositoryIntegrationTests.java
30-Jun-2019 03:39:50 [INFO] 408/408 source files have been analyzed
30-Jun-2019 03:39:50 [WARNING] Classes not found during the analysis : [scala.Predef$$less, scala.Predef$$less$colon]
30-Jun-2019 03:39:50 [INFO] Java Test Files AST scan (done) | time=12625ms
30-Jun-2019 03:39:50 [INFO] Sensor JavaSquidSensor [java] (done) | time=22714ms
30-Jun-2019 03:39:50 [INFO] Sensor Sonar-Sonargraph-Plugin [3.5] [Sonargraph]
30-Jun-2019 03:39:50 [INFO] ----------------------------------------------------------------
30-Jun-2019 03:39:50 [INFO] Sonargraph: Skipping project Spring Data MongoDB - Core [org.springframework.data:spring-data-mongodb], since no Sonargraph rules are activated in current SonarQube quality profile.
30-Jun-2019 03:39:50 [INFO] ----------------------------------------------------------------
30-Jun-2019 03:39:50 [INFO] Sensor Sonar-Sonargraph-Plugin [3.5] [Sonargraph] (done) | time=1ms
30-Jun-2019 03:39:50 [INFO] Sensor CoberturaSensor [cobertura]
30-Jun-2019 03:39:50 [WARNING] Cobertura report not found at /opt/bamboo-home/xml-data/build-dir/SPRINGDATAMONGODB-MONGOSONAR-JOB1/spring-data-mongodb/target/site/cobertura/coverage.xml
30-Jun-2019 03:39:50 [INFO] Sensor CoberturaSensor [cobertura] (done) | time=0ms
30-Jun-2019 03:39:50 [INFO] Sensor PmdSensor [pmd]
30-Jun-2019 03:39:50 [INFO] Execute PMD 6.10.0
30-Jun-2019 03:39:50 [INFO] Java version: 1.8
30-Jun-2019 03:39:50 [INFO] PMD configuration: /opt/bamboo-home/xml-data/build-dir/SPRINGDATAMONGODB-MONGOSONAR-JOB1/spring-data-mongodb/target/sonar/pmd.xml
30-Jun-2019 03:39:58 [INFO] PMD configuration: /opt/bamboo-home/xml-data/build-dir/SPRINGDATAMONGODB-MONGOSONAR-JOB1/spring-data-mongodb/target/sonar/pmd-unit-tests.xml
30-Jun-2019 03:39:58 [INFO] Execute PMD 6.10.0 (done) | time=8798ms
30-Jun-2019 03:39:58 [INFO] Sensor PmdSensor [pmd] (done) | time=8832ms
30-Jun-2019 03:39:58 [INFO] Sensor FindBugs Sensor [findbugs]
30-Jun-2019 03:40:00 [INFO] Loading findbugs plugin: /opt/bamboo-home/xml-data/build-dir/SPRINGDATAMONGODB-MONGOSONAR-JOB1/spring-data-mongodb/target/sonar/findbugs/findsecbugs-plugin.jar
30-Jun-2019 03:40:00 [INFO] Findbugs output report: /opt/bamboo-home/xml-data/build-dir/SPRINGDATAMONGODB-MONGOSONAR-JOB1/spring-data-mongodb/target/sonar/findbugs-result.xml
30-Jun-2019 03:40:24 The following classes needed for analysis were missing:
30-Jun-2019 03:40:24   get
30-Jun-2019 03:40:24   test
30-Jun-2019 03:40:24   accept
30-Jun-2019 03:40:24   apply
30-Jun-2019 03:40:24   doInCollection
30-Jun-2019 03:40:24   getCollectionName
30-Jun-2019 03:40:24   convert
30-Jun-2019 03:40:24   doWithPersistentProperty
30-Jun-2019 03:40:24   run
30-Jun-2019 03:40:24   asDocument
30-Jun-2019 03:40:24   dispose
30-Jun-2019 03:40:24   getBindableValue
30-Jun-2019 03:40:24   invoke
30-Jun-2019 03:40:24   doWithAssociation
30-Jun-2019 03:40:24   all
30-Jun-2019 03:40:24   doInDB
30-Jun-2019 03:40:24   indexOps
30-Jun-2019 03:40:24   getAsLong
30-Jun-2019 03:40:24   execute
30-Jun-2019 03:40:24   startingWith
30-Jun-2019 03:40:24   toDocument
30-Jun-2019 03:40:24   year
30-Jun-2019 03:40:24   isoWeekYear
30-Jun-2019 03:40:24   handleError
30-Jun-2019 03:40:24 [WARNING] The class 'org.springframework.data.mongodb.core.ReactiveFindOperationExtensionsKt$awaitCount$1' could not be matched to its original source file. It might be a dynamically generated class.
30-Jun-2019 03:40:24 [WARNING] The class 'org.springframework.data.mongodb.core.ReactiveFindOperationExtensionsKt$awaitExists$1' could not be matched to its original source file. It might be a dynamically generated class.
30-Jun-2019 03:40:24 [WARNING] The class 'org.springframework.data.mongodb.core.ReactiveRemoveOperationExtensionsKt$allAndAwait$1' could not be matched to its original source file. It might be a dynamically generated class.
30-Jun-2019 03:40:24 [WARNING] The class 'org.springframework.data.mongodb.core.ReactiveUpdateOperationExtensionsKt$allAndAwait$1' could not be matched to its original source file. It might be a dynamically generated class.
30-Jun-2019 03:40:24 [WARNING] The class 'org.springframework.data.mongodb.core.ReactiveUpdateOperationExtensionsKt$findModifyAndAwait$1' could not be matched to its original source file. It might be a dynamically generated class.
30-Jun-2019 03:40:24 [WARNING] The class 'org.springframework.data.mongodb.core.ReactiveUpdateOperationExtensionsKt$findReplaceAndAwait$1' could not be matched to its original source file. It might be a dynamically generated class.
30-Jun-2019 03:40:24 [WARNING] The class 'org.springframework.data.mongodb.core.ReactiveUpdateOperationExtensionsKt$firstAndAwait$1' could not be matched to its original source file. It might be a dynamically generated class.
30-Jun-2019 03:40:24 [WARNING] The class 'org.springframework.data.mongodb.core.ReactiveUpdateOperationExtensionsKt$upsertAndAwait$1' could not be matched to its original source file. It might be a dynamically generated class.
30-Jun-2019 03:40:24 [INFO] Sensor FindBugs Sensor [findbugs] (done) | time=26030ms
30-Jun-2019 03:40:24 [INFO] Sensor SurefireSensor [java]
30-Jun-2019 03:40:24 [INFO] parsing [/opt/bamboo-home/xml-data/build-dir/SPRINGDATAMONGODB-MONGOSONAR-JOB1/spring-data-mongodb/target/surefire-reports]
30-Jun-2019 03:40:25 [INFO] Sensor SurefireSensor [java] (done) | time=260ms
30-Jun-2019 03:40:25 [INFO] Sensor JaCoCoSensor [java]
30-Jun-2019 03:40:25 [INFO] Sensor JaCoCoSensor [java] (done) | time=1ms
30-Jun-2019 03:40:25 [INFO] Sensor CheckstyleSensor [checkstyle]
30-Jun-2019 03:40:25 [INFO] Checkstyle output report: /opt/bamboo-home/xml-data/build-dir/SPRINGDATAMONGODB-MONGOSONAR-JOB1/spring-data-mongodb/target/sonar/checkstyle-result.xml
30-Jun-2019 03:40:25 [INFO] Checkstyle configuration: /opt/bamboo-home/xml-data/build-dir/SPRINGDATAMONGODB-MONGOSONAR-JOB1/spring-data-mongodb/target/sonar/checkstyle.xml
30-Jun-2019 03:40:25 [INFO] Checkstyle charset: UTF-8
30-Jun-2019 03:40:27 [INFO] Sensor CheckstyleSensor [checkstyle] (done) | time=2271ms
30-Jun-2019 03:40:27 [INFO] -------------  Scan Spring Data MongoDB
30-Jun-2019 03:40:27 [INFO] Base dir: /opt/bamboo-home/xml-data/build-dir/SPRINGDATAMONGODB-MONGOSONAR-JOB1
30-Jun-2019 03:40:27 [INFO] Working dir: /opt/bamboo-home/xml-data/build-dir/SPRINGDATAMONGODB-MONGOSONAR-JOB1/target/sonar
30-Jun-2019 03:40:27 [INFO] Source paths: pom.xml
30-Jun-2019 03:40:27 [INFO] Source encoding: UTF-8, default locale: en_US
30-Jun-2019 03:40:27 [INFO] Index files
30-Jun-2019 03:40:27 [INFO] 1 file indexed
30-Jun-2019 03:40:27 [INFO] Structure101 sensor require following mandatory properties:
30-Jun-2019 03:40:27         structure101.java.classpath
30-Jun-2019 03:40:27         structure101.java.repository
30-Jun-2019 03:40:27         structure101.java.project
30-Jun-2019 03:40:27         
30-Jun-2019 03:40:27 [INFO] Structure101 sensor require following mandatory properties:
30-Jun-2019 03:40:27         structure101.java.classpath
30-Jun-2019 03:40:27         structure101.java.repository
30-Jun-2019 03:40:27         structure101.java.project
30-Jun-2019 03:40:27         
30-Jun-2019 03:40:27 [INFO] Sensor Sonar-Sonargraph-Plugin [3.5] [Sonargraph]
30-Jun-2019 03:40:27 [INFO] ----------------------------------------------------------------
30-Jun-2019 03:40:27 [INFO] Sonargraph: Skipping project Spring Data MongoDB [org.springframework.data:spring-data-mongodb-parent], since no Sonargraph rules are activated in current SonarQube quality profile.
30-Jun-2019 03:40:27 [INFO] ----------------------------------------------------------------
30-Jun-2019 03:40:27 [INFO] Sensor Sonar-Sonargraph-Plugin [3.5] [Sonargraph] (done) | time=2ms
30-Jun-2019 03:40:27 [INFO] Sensor Zero Coverage Sensor
30-Jun-2019 03:40:27 [INFO] Sensor Zero Coverage Sensor (done) | time=142ms
30-Jun-2019 03:40:27 [INFO] Sensor CPD Block Indexer
30-Jun-2019 03:40:28 [INFO] Sensor CPD Block Indexer (done) | time=404ms
30-Jun-2019 03:40:28 [INFO] 137 files had no CPD blocks
30-Jun-2019 03:40:28 [INFO] Calculating CPD for 329 files
30-Jun-2019 03:40:28 [INFO] CPD calculation finished
30-Jun-2019 03:40:29 [INFO] Analysis report generated in 763ms, dir size=9 MB
30-Jun-2019 03:40:30 [INFO] Analysis reports compressed in 1380ms, zip size=4 MB
30-Jun-2019 03:40:31 [INFO] Analysis report uploaded in 522ms
30-Jun-2019 03:40:31 [INFO] ANALYSIS SUCCESSFUL, you can browse https://sonar.spring.io/dashboard/index/org.springframework.data:spring-data-mongodb-parent
30-Jun-2019 03:40:31 [INFO] Note that you will be able to access the updated dashboard once the server has processed the submitted analysis report
30-Jun-2019 03:40:31 [INFO] More about the report processing at https://sonar.spring.io/api/ce/task?id=AWumeE40XFvlBU1gpYdX
30-Jun-2019 03:40:31 [INFO] Executing post-job org.sonar.plugins.buildbreaker.QualityGateBreaker
30-Jun-2019 03:40:31 [INFO] Waiting for report processing to complete...
30-Jun-2019 03:40:41 [INFO] Waiting for report processing to complete...
30-Jun-2019 03:40:51 [INFO] Waiting for report processing to complete...
30-Jun-2019 03:41:01 [INFO] Quality gate status: OK
30-Jun-2019 03:41:01 [INFO] Task total time: 1:36.753 s
30-Jun-2019 03:41:01 [INFO] ------------------------------------------------------------------------
30-Jun-2019 03:41:01 [INFO] Reactor Summary:
30-Jun-2019 03:41:01 [INFO]
30-Jun-2019 03:41:01 [INFO] Spring Data MongoDB 2.2.0.BUILD-SNAPSHOT ........... SUCCESS [01:37 min]
30-Jun-2019 03:41:01 [INFO] Spring Data MongoDB - Core ......................... SKIPPED
30-Jun-2019 03:41:01 [INFO] Spring Data MongoDB - Distribution 2.2.0.BUILD-SNAPSHOT SKIPPED
30-Jun-2019 03:41:01 [INFO] ------------------------------------------------------------------------
30-Jun-2019 03:41:01 [INFO] BUILD SUCCESS
30-Jun-2019 03:41:01 [INFO] ------------------------------------------------------------------------
30-Jun-2019 03:41:01 [INFO] Total time: 01:39 min
30-Jun-2019 03:41:01 [INFO] Finished at: 2019-06-30T03:41:01Z
30-Jun-2019 03:41:01 [INFO] ------------------------------------------------------------------------
30-Jun-2019 03:41:01 Finished task 'Sonar' with result: Success
30-Jun-2019 03:41:01 Running post build plugin 'Docker Container Cleanup'
30-Jun-2019 03:41:01 Running post build plugin 'NCover Results Collector'
30-Jun-2019 03:41:01 Running post build plugin 'Artifactory Release Management Staging'
30-Jun-2019 03:41:01 Running post build plugin 'Artifactory Build Info Copier'
30-Jun-2019 03:41:01 Running post build plugin 'Artifactory Gradle Properties Info Copier'
30-Jun-2019 03:41:01 Running post build plugin 'Clover Results Collector'
30-Jun-2019 03:41:01 Running post build plugin 'npm Cache Cleanup'
30-Jun-2019 03:41:01 Running post build plugin 'Artifact Copier'
30-Jun-2019 03:41:01 Successfully removed working directory at '/opt/bamboo-home/xml-data/build-dir/SPRINGDATAMONGODB-MONGOSONAR-JOB1'
30-Jun-2019 03:41:01 Finalising the build...
30-Jun-2019 03:41:01 Stopping timer.
30-Jun-2019 03:41:01 Build SPRINGDATAMONGODB-MONGOSONAR-JOB1-2602 completed.
30-Jun-2019 03:41:01 Running on server: post build plugin 'NCover Results Collector'
30-Jun-2019 03:41:01 Running on server: post build plugin 'Build Hanging Detection Configuration'
30-Jun-2019 03:41:01 Running on server: post build plugin 'Clover Delta Calculator'
30-Jun-2019 03:41:01 Running on server: post build plugin 'Maven Dependencies Postprocessor'
30-Jun-2019 03:41:01 All post build plugins have finished
30-Jun-2019 03:41:01 Generating build results summary...
30-Jun-2019 03:41:02 Saving build results to disk...
30-Jun-2019 03:41:02 Logging substituted variables...
30-Jun-2019 03:41:02 Indexing build results...
30-Jun-2019 03:41:02 Finished building SPRINGDATAMONGODB-MONGOSONAR-JOB1-2602.